{"text_format":"1","workbook":"xlsx","n_sheets":10,"sheets":["HELP","Cover Sheet","Clean Columns","Calculations","Instructions","Assumptions","Beams","Columns","Lists","Database v14.0"],"not_rendered":{"charts":0,"images":45,"macros":1,"external_links":2,"defined_names":42,"comments":1,"pivot_tables":0},"unopened":[],"bounds":{"document_bytes":16777216,"sheet_cells":100000,"rows_first":2000,"rows_last":500,"rows_between":2000,"halvings":0,"cell_chars":16384,"cell_head_chars":4096},"cells_cut":0,"cells_raw":0,"read":"whole","date_system":"1900"}

{"sheet":"HELP","index":0,"n_rows":18,"n_cols":2,"rows_kept":18,"cut":false,"hidden":false,"merged":[]}
["Clean Columns Help:"]
["1)","You must Enable Macros in order for the spreadsheet \"Clean Columns\" to work."]
[null,"If the buttons on the worksheets don't work the Macros are not enabled."]
[null,"If you are not prompted as to whether or not you want to enable macros when you open Clean Columns, there are two possible reasons."]
[null,"First, Excel's macro security may be too high.  To correct this, select \"Tools\" from the menu bar, then select \"Macros\", then \"Security\". "]
[null,"The \"Security\" form will open. Choose the \"Medium\" or \"Low\" setting on the \"Security Level\" tab.  Close then re-open Clean Columns."]
[]
[null,"If the program still does not work, the second reason macros may not work is  that some anti-virus software will identify the macros in this spreadsheet"]
{"$rows_left_out":11}
{"sheet":"Cover Sheet","index":1,"n_rows":13,"n_cols":12,"rows_kept":13,"cut":false,"hidden":false,"merged":[[3,2,3,10],[12,3,12,10],[5,2,5,10],[10,2,10,10],[6,2,6,10],[7,2,7,10],[8,2,8,10]]}
[]
[]
[]
[null,null,"The Steel Solutions® Center is your gateway to powerful tools, facts and project solutions."]
[null,null,null,null,null,null,null,null,null,null,null,"Clean Columns V14.2"]
[null,null,"Least weight is not least cost."]
[null,null,"Least weight is not least cost."]
[null,null,"Least weight is not least cost."]
{"$rows_left_out":6}
{"sheet":"Clean Columns","index":2,"n_rows":84,"n_cols":35,"rows_kept":84,"cut":false,"hidden":false,"merged":[[13,26,15,26],[13,27,15,27],[13,24,15,24],[13,25,15,25],[43,2,43,13],[29,20,31,20],[32,20,35,20],[41,3,41,4],[37,8,37,9],[38,8,38,9],[40,3,40,4],[37,3,37,4],[41,8,41,9],[37,10,37,11],[38,10,38,11],[39,3,39,4],[3,3,3,12],[8,2,8,13],[4,3,4,13],[5,3,5,13],[6,3,7,13],[11,2,11,13],[13,23,15,23],[19,20,20,20],[21,20,23,20],[24,20,28,20],[13,22,15,22],[13,20,15,21],[39,8,39,9],[40,10,40,11],[41,10,41,11],[40,8,40,9],[38,3,38,4],[39,10,39,11]]}
[null,null,null,null,null,null,null,null,null,null,null,null,null,null,null,null,null,null,null,null,null,null,null,null,null,null,27,28,29,30]
[]
[]
[null,"Project:",null,"Any Steel Project",null,null,null,null,null,null,null,null,null,{"$f":"TODAY()","v":"2015-01-26"}]
[null,"Client:",null,"Best Architect Ever"]
[null,"Engineer:"]
[null,"Remarks:",null,"Interior Columns: Lines B, C, and E"]
[]
{"$rows_left_out":77}
{"sheet":"Calculations","index":3,"n_rows":132,"n_cols":39,"rows_kept":132,"cut":false,"hidden":false,"merged":[[16,29,18,29],[128,2,129,4],[121,7,121,9],[117,2,118,4],[122,7,122,9],[111,2,111,4],[122,2,123,4],[16,30,18,30],[117,7,117,9],[115,7,115,9],[116,7,116,9],[34,26,37,26],[19,26,20,26],[21,26,23,26],[16,26,18,27],[16,12,16,13],[71,5,72,11],[74,5,75,10],[70,11,70,12],[24,26,30,26],[31,26,33,26],[41,2,41,12],[16,28,18,28],[1,16,1,18],[0,1,0,11],[1,3,1,11],[6,1,6,18],[2,3,2,18],[3,3,3,18],[4,3,5,18],[12,16,12,17],[11,16,11,17],[128,7,129,9],[111,7,111,9],[12,7,12,8],[100,5,101,11],[54,5,55,11],[98,5,99,10],[86,5,87,11],[97,11,97,12]]}
[]
[null,"Project:",null,{"$f":"'Clean Columns'!D4:M4","v":"Any Steel Project"},null,null,null,null,null,null,null,null,null,null,null,null,{"$f":"TODAY()","v":"2015-01-26"}]
[null,"Client:",null,{"$f":"'Clean Columns'!$D$5:$M$5","v":"Best Architect Ever"}]
[null,"Engineer:"]
[null,"Remarks:",null,{"$f":"'Clean Columns'!D7","v":"Interior Columns: Lines B, C, and E"}]
[]
[null,{"$f":"\"Clean Column Design Calculations for a \"&'Clean Columns'!AF25&\" Column\"&IF('Clean Columns'!Z67=0,\": LRFD\",\": ASD\")","v":"Clean Column Design Calculations for a W18X283 Column: LRFD"}]
[null,"Clean Columns V14.2"]
{"$rows_left_out":125}
{"sheet":"Instructions","index":4,"n_rows":26,"n_cols":5,"rows_kept":26,"cut":false,"hidden":false,"merged":[[1,2,1,4]]}
[]
[null,null,"Instructions for Clean Columns V14.2"]
[]
[null,null,"1)","Verify the Assumptions"]
[null,null,null,null,"Verify that the assumptions made in the formulation of the spreadsheet apply to the design criteria at hand.  It is important to ensure that the user has carefully identified the assumptions made in the analysis and has accepted them as applicable to the particular design situation at hand.  Click above to review these assumptions.  Further information can be found in the 2010 AISC Specification for Structural Steel Buildings, Design Guide #13, and Design Guide #4, 2nd Ed."]
[null,null,"2)","Connection Configuration"]
[null,null,null,null,"Select whether or not a beam is connected to one side of the joint or both sides of the joint.  The connection configuration affects the amount of required shear strength in the panel-zone calculations.  It is conservative to select a beam connected on both sides of the column or to ignore the contribution of gravity loads.  After choosing the desired option check the diagram at the top of the page to see if the situation shown matches the desired connection configuration. "]
[null,null,null,null,"If the connection occurs near the top of the column, or the top story of a frame, place a check in the box by clicking on it with the cursor.  If the connection does not occur near the top of the column, remove the check in the box by clicking on it with the cursor.  When the box has a check in it, a line asking for the distance from the top of the top beam flange to the column end appears.  Provide this information if the connection is located near the top of the column.  The smaller the distance entered the more conservative the calculations will become."]
{"$rows_left_out":19}
{"sheet":"Assumptions","index":5,"n_rows":18,"n_cols":5,"rows_kept":18,"cut":false,"hidden":false,"merged":[[1,2,1,4]]}
[]
[null,null,"Assumptions in Clean Columns V14.2"]
[]
[null,null,"1)","Wind, Low-Seismic, and High-Seismic Applications"]
[null,null,null,null,"For the purposes of this spreadsheet, wind, low-seismic and high-seismic applications are defined as follows.  Wind and low-seismic applications are those for which the structure is designed to meet the requirements in the LRFD Specification with no special seismic detailing.  This includes all applications for which the structural response is intended to remain in the nominally elastic range and the response modification factor R used in determination of seismic forces, if any, is not taken greater than 3.  "]
[null,null,null,null,"High-seismic applications are those for which inelastic behavior is expected in the beams or panel-zones as a means of dissipating the energy induced during strong ground motions.  Such buildings are designed to meet the requirements in both the LRFD Specification and the AISC Seismic Provisions and a response modification factor R that is appropriate for the level of detailing required for the moment-frame system selected is used in the determination of seismic forces.  Additionally, the moment connections used in high-seismic applications have special seismic detailing that is appropriate for the moment-frame system selected."]
[null,null,"2)","The Parameter \"N\""]
[null,null,null,null,"The variable 'N' in Clean Columns corresponds to the variable lb in the 2010 AISC Specification.  The variable 'N' is used to determine the strength of the column for the Local Web Yielding and Web Crippling limit states.  'N' is the vertical width over which the force from the beam flange is transferred to the column flange or to the end-plate in an extended end-plate moment connection.  The value for 'N' is taken as the beam flange or flange plate thickness plus 2w.  'w' is the leg size of fillet weld or groove weld reinforcement of the weld of the beam flange or flange plate to the column flange."]
{"$rows_left_out":11}
{"sheet":"Beams","index":6,"n_rows":324,"n_cols":16,"rows_kept":324,"cut":false,"hidden":false,"merged":[]}
[null,"MuR =",{"$f":"'Clean Columns'!Z71","v":150},"MuL =",{"$f":"'Clean Columns'!Z73","v":150},null,"PuR =",{"$f":"'Clean Columns'!Z70","v":0},"PuL =",{"$f":"'Clean Columns'!Z72","v":0}]
[null,"Fy =",{"$f":"'Clean Columns'!Z80","v":50},"ksi",null,null,"Vus =",{"$f":"'Clean Columns'!Z68","v":0}]
[null,{"$f":"HLOOKUP(B4,DB_Headers,2,FALSE)","v":4},5,9,16,21,35,null,null,"Top","Top","Bottom","Bottom"]
["Designation","A","d","bf","tf","kdes","Zx","f Mp",null,"(Puf)TR","(Puf)TL","(Puf)BR","(Puf)BL","Vu","dm"]
[null,"in2","in.","in.","in.","in.","in.3","kip-in",null,"kips","kips","kips","kips","kips","in"]
["W4X13",{"$f":"VLOOKUP($A6,_xlnm.DataBase,B$3,FALSE)","v":3.83},4.16,4.0599999999999996,0.34499999999999997,0.59499999999999997,6.28,{"$f":"0.9*$C$2*G6","v":282.60000000000002},1,{"$f":"$H$1/2+($C$1*12)/O6","v":471.82175622542593},{"$f":"$J$1/2-($E$1*12)/O6","v":-471.82175622542593},{"$f":"$H$1/2-($C$1*12)/O6","v":-471.82175622542593},{"$f":"$J$1/2+($E$1*12)/O6","v":471.82175622542593},{"$f":"IF('Clean Columns'!$Z$57,J6-K6,J6)-$H$2","v":943.64351245085186},{"$f":"IF('Clean Columns'!$Z$60=0,Beams!C6-Beams!E6,Beams!C6+'Clean Columns'!$AD$62)","v":3.8150000000000004},319]
[null,{"$error":"#N/A"},{"$error":"#N/A"},{"$error":"#N/A"},{"$error":"#N/A"},{"$error":"#N/A"},{"$error":"#N/A"},{"$f":"0.9*$C$2*G7","v":{"$error":"#N/A"}},{"$f":"I6+1","v":2},{"$f":"$H$1/2+($C$1*12)/O7","v":{"$error":"#N/A"}},{"$f":"$J$1/2-($E$1*12)/O7","v":{"$error":"#N/A"}},{"$f":"$H$1/2-($C$1*12)/O7","v":{"$error":"#N/A"}},{"$f":"$J$1/2+($E$1*12)/O7","v":{"$error":"#N/A"}},{"$f":"IF('Clean Columns'!$Z$57,J7-K7,J7)-$H$2","v":{"$error":"#N/A"}},{"$f":"IF('Clean Columns'!$Z$60=0,Beams!C7-Beams!E7,Beams!C7+'Clean Columns'!$AD$62)","v":{"$error":"#N/A"}},{"$f":"P6-1","v":318}]
["W5X16",4.71,5.01,5,0.36,0.66,9.6300000000000008,433.35,{"$f":"I7+1","v":3},{"$f":"$H$1/2+($C$1*12)/O8","v":387.09677419354841},{"$f":"$J$1/2-($E$1*12)/O8","v":-387.09677419354841},{"$f":"$H$1/2-($C$1*12)/O8","v":-387.09677419354841},{"$f":"$J$1/2+($E$1*12)/O8","v":387.09677419354841},{"$f":"IF('Clean Columns'!$Z$57,J8-K8,J8)-$H$2","v":774.19354838709683},{"$f":"IF('Clean Columns'!$Z$60=1,Beams!C8+'Clean Columns'!$AD$62,Beams!C8-Beams!E8)","v":4.6499999999999995},{"$f":"P7-1","v":317}]
{"$rows_left_out":317}
{"sheet":"Columns","index":7,"n_rows":128,"n_cols":20,"rows_kept":128,"cut":false,"hidden":false,"merged":[]}
["N=",{"$f":"IF('Clean Columns'!Z60=1,'Clean Columns'!AD62,INDEX(Beams!E6:E324,'Clean Columns'!AD26))","v":0.42499999999999999},"in","Pu",{"$f":"'Clean Columns'!D30","v":0},"kips","bfb =",{"$f":"INDEX(Beams!D6:D324,'Clean Columns'!AD26)","v":6},"in","tp =",{"$f":"'Clean Columns'!AD62","v":0},"in      Yc =",{"$f":"'Clean Columns'!Z65","v":170.1},"in","max without","max without","max without","max without","max without"]
["Fy=",{"$f":"'Clean Columns'!D27","v":50},"ksi","Fy ",{"$f":"B2","v":50},"ksi, for LFB","E =",29000,"ksi","Ten","Ten+Comp","Comp","Comp",null,"Stiffener/Ten","Stiffener/Comp","Doubler Pl","Stiff & DPL","Stiffener/Ten_Mnf"]
["Designation","A","d","h","tw","tf","bf","kdes","PZ Shear Str.","LFB","LWY","WC","CBW",null,"f Rn","f Rn","f Rv","f Rn","f Rn","Py"]
[null,"in2","in.","(d-2*k)","in.","in.","in.","in.","fRv (kips)","f Rn (kips)","f Rn (kips)","f Rn (kips)","f Rn (kips)",null,"kips","kips","kips","kips","kips","kips"]
["W18X311",{"$f":"VLOOKUP($A5,_xlnm.DataBase,HLOOKUP(B$3,DB_Headers,2,FALSE),FALSE)","v":91.6},22.3,{"$f":"C5-2*H5","v":15.82},{"$f":"VLOOKUP($A5,_xlnm.DataBase,HLOOKUP(E$3,DB_Headers,2,FALSE),FALSE)","v":1.52},2.74,12,3.24,{"$f":"IF('Clean Columns'!$Z$67=0,1,1/1.5)*(IF($E$1>0.4*T5,0.9*0.6*$B$2*C5*E5*(1.4-$E$1/T5),0.9*0.6*$B$2*C5*E5))","v":915.19200000000001},{"$f":"IF(OR('Clean Columns'!$Z$67=0,'Clean Columns'!$Z$60=2),1,1/1.5)*(IF('Clean Columns'!$Z$60=2,(0.9*$B$2*$M$1*F5^2)/(1.11*0.75)/12,IF($H$1/G5<0.15,1000000,IF(AND('Clean Columns'!$Z$58,'Clean Columns'!$Z$59<10*F5),0.9*6.25*F5^2*$B$2*0.5,0.9*6.25*F5^2*$B$2))))","v":2111.5125000000003},{"$f":"IF('Clean Columns'!$Z$67=0,1,1/1.5)*IF('Clean Columns'!$Z$60=2,IF(AND('Clean Columns'!$Z$58,'Clean Columns'!$Z$59<C5),0.5,1)*(6*H5+$B$1+2*$K$1),IF(AND('Clean Columns'!$Z$58,'Clean Columns'!$Z$59<C5),0.5,1)*5*H5+$B$1)*$B$2*E5","v":1263.5000000000005},{"$f":"IF('Clean Columns'!$Z$67=0,1,1/1.5)*(IF(AND('Clean Columns'!$Z$58,'Clean Columns'!$Z$59<C5/2),(0.75*0.8*E5^2*(1+((IF($B$1/C5<=0.2,3*$B$1/C5,4*$B$1/C5-0.2))*(E5/F5)^1.5))*SQRT($H$2*$B$2*F5/E5))*0.5,0.75*0.8*E5^2*(1+((3*$B$1/C5)*(E5/F5)^1.5))*SQRT($H$2*$B$2*F5/E5)))","v":2294.1202414710192},{"$f":"IF('Clean Columns'!$Z$67=0,1,1/1.5)*(IF('Clean Columns'!$Z$57,IF(AND('Clean Columns'!$Z$58,'Clean Columns'!$Z$59<Columns!C5/2),0.9*24*(E5^3)*SQRT($H$2*$B$2)/D5*0.5,0.9*24*(E5^3)*SQRT($H$2*$B$2)/D5),1000000))","v":5773.8039985491996},null,{"$f":"IF('Clean Columns'!$Z$60=2,Columns!K5,MIN(J5:K5))","v":1263.5000000000005},{"$f":"MIN(K5:M5)","v":1263.5000000000005},{"$f":"I5","v":915.19200000000001},{"$f":"MIN(O5:Q5)","v":915.19200000000001},{"$f":"J5","v":2111.5125000000003},{"$f":"B5*$B$2","v":4580}]
["W18X283",83.3,21.9,{"$f":"C6-2*H6","v":15.899999999999999},1.4,2.5,11.9,3,{"$f":"IF('Clean Columns'!$Z$67=0,1,1/1.5)*(IF($E$1>0.4*T6,0.9*0.6*$B$2*C6*E6*(1.4-$E$1/T6),0.9*0.6*$B$2*C6*E6))","v":827.81999999999994},{"$f":"IF(OR('Clean Columns'!$Z$67=0,'Clean Columns'!$Z$60=2),1,1/1.5)*(IF('Clean Columns'!$Z$60=2,(0.9*$B$2*$M$1*F6^2)/(1.11*0.75)/12,IF($H$1/G6<0.15,1000000,IF(AND('Clean Columns'!$Z$58,'Clean Columns'!$Z$59<10*F6),0.9*6.25*F6^2*$B$2*0.5,0.9*6.25*F6^2*$B$2))))","v":1757.8125},{"$f":"IF('Clean Columns'!$Z$67=0,1,1/1.5)*IF('Clean Columns'!$Z$60=2,IF(AND('Clean Columns'!$Z$58,'Clean Columns'!$Z$59<C6),0.5,1)*(6*H6+$B$1+2*$K$1),IF(AND('Clean Columns'!$Z$58,'Clean Columns'!$Z$59<C6),0.5,1)*5*H6+$B$1)*$B$2*E6","v":1079.75},{"$f":"IF('Clean Columns'!$Z$67=0,1,1/1.5)*(IF(AND('Clean Columns'!$Z$58,'Clean Columns'!$Z$59<C6/2),(0.75*0.8*E6^2*(1+((IF($B$1/C6<=0.2,3*$B$1/C6,4*$B$1/C6-0.2))*(E6/F6)^1.5))*SQRT($H$2*$B$2*F6/E6))*0.5,0.75*0.8*E6^2*(1+((3*$B$1/C6)*(E6/F6)^1.5))*SQRT($H$2*$B$2*F6/E6)))","v":1938.5003581147523},{"$f":"IF('Clean Columns'!$Z$67=0,1,1/1.5)*(IF('Clean Columns'!$Z$57,IF(AND('Clean Columns'!$Z$58,'Clean Columns'!$Z$59<Columns!C6/2),0.9*24*(E6^3)*SQRT($H$2*$B$2)/D6*0.5,0.9*24*(E6^3)*SQRT($H$2*$B$2)/D6),1000000))","v":4488.7429391374262},null,{"$f":"IF('Clean Columns'!$Z$60=2,Columns!K6,MIN(J6:K6))","v":1079.75},{"$f":"MIN(K6:M6)","v":1079.75},{"$f":"I6","v":827.81999999999994},{"$f":"MIN(O6:Q6)","v":827.81999999999994},{"$f":"J6","v":1757.8125},{"$f":"B6*$B$2","v":4165}]
["W18X258",76,21.5,{"$f":"C7-2*H7","v":16.100000000000001},1.28,2.2999999999999998,11.8,2.7,{"$f":"IF('Clean Columns'!$Z$67=0,1,1/1.5)*(IF($E$1>0.4*T7,0.9*0.6*$B$2*C7*E7*(1.4-$E$1/T7),0.9*0.6*$B$2*C7*E7))","v":743.04},{"$f":"IF(OR('Clean Columns'!$Z$67=0,'Clean Columns'!$Z$60=2),1,1/1.5)*(IF('Clean Columns'!$Z$60=2,(0.9*$B$2*$M$1*F7^2)/(1.11*0.75)/12,IF($H$1/G7<0.15,1000000,IF(AND('Clean Columns'!$Z$58,'Clean Columns'!$Z$59<10*F7),0.9*6.25*F7^2*$B$2*0.5,0.9*6.25*F7^2*$B$2))))","v":1487.8124999999998},{"$f":"IF('Clean Columns'!$Z$67=0,1,1/1.5)*IF('Clean Columns'!$Z$60=2,IF(AND('Clean Columns'!$Z$58,'Clean Columns'!$Z$59<C7),0.5,1)*(6*H7+$B$1+2*$K$1),IF(AND('Clean Columns'!$Z$58,'Clean Columns'!$Z$59<C7),0.5,1)*5*H7+$B$1)*$B$2*E7","v":891.2},{"$f":"IF('Clean Columns'!$Z$67=0,1,1/1.5)*(IF(AND('Clean Columns'!$Z$58,'Clean Columns'!$Z$59<C7/2),(0.75*0.8*E7^2*(1+((IF($B$1/C7<=0.2,3*$B$1/C7,4*$B$1/C7-0.2))*(E7/F7)^1.5))*SQRT($H$2*$B$2*F7/E7))*0.5,0.75*0.8*E7^2*(1+((3*$B$1/C7)*(E7/F7)^1.5))*SQRT($H$2*$B$2*F7/E7)))","v":1625.8374313925756},{"$f":"IF('Clean Columns'!$Z$67=0,1,1/1.5)*(IF('Clean Columns'!$Z$57,IF(AND('Clean Columns'!$Z$58,'Clean Columns'!$Z$59<Columns!C7/2),0.9*24*(E7^3)*SQRT($H$2*$B$2)/D7*0.5,0.9*24*(E7^3)*SQRT($H$2*$B$2)/D7),1000000))","v":3387.9873896188451},null,{"$f":"IF('Clean Columns'!$Z$60=2,Columns!K7,MIN(J7:K7))","v":891.2},891.2,743.04,743.04,1487.8124999999998,3800]
["W18X234",68.599999999999994,21.1,{"$f":"C8-2*H8","v":16.080000000000002},1.1599999999999999,2.11,11.7,2.5099999999999998,{"$f":"IF('Clean Columns'!$Z$67=0,1,1/1.5)*(IF($E$1>0.4*T8,0.9*0.6*$B$2*C8*E8*(1.4-$E$1/T8),0.9*0.6*$B$2*C8*E8))","v":660.85199999999998},{"$f":"IF(OR('Clean Columns'!$Z$67=0,'Clean Columns'!$Z$60=2),1,1/1.5)*(IF('Clean Columns'!$Z$60=2,(0.9*$B$2*$M$1*F8^2)/(1.11*0.75)/12,IF($H$1/G8<0.15,1000000,IF(AND('Clean Columns'!$Z$58,'Clean Columns'!$Z$59<10*F8),0.9*6.25*F8^2*$B$2*0.5,0.9*6.25*F8^2*$B$2))))","v":1252.1531249999998},{"$f":"IF('Clean Columns'!$Z$67=0,1,1/1.5)*IF('Clean Columns'!$Z$60=2,IF(AND('Clean Columns'!$Z$58,'Clean Columns'!$Z$59<C8),0.5,1)*(6*H8+$B$1+2*$K$1),IF(AND('Clean Columns'!$Z$58,'Clean Columns'!$Z$59<C8),0.5,1)*5*H8+$B$1)*$B$2*E8","v":752.55},{"$f":"IF('Clean Columns'!$Z$67=0,1,1/1.5)*(IF(AND('Clean Columns'!$Z$58,'Clean Columns'!$Z$59<C8/2),(0.75*0.8*E8^2*(1+((IF($B$1/C8<=0.2,3*$B$1/C8,4*$B$1/C8-0.2))*(E8/F8)^1.5))*SQRT($H$2*$B$2*F8/E8))*0.5,0.75*0.8*E8^2*(1+((3*$B$1/C8)*(E8/F8)^1.5))*SQRT($H$2*$B$2*F8/E8)))","v":1343.4798906094961},{"$f":"IF('Clean Columns'!$Z$67=0,1,1/1.5)*(IF('Clean Columns'!$Z$57,IF(AND('Clean Columns'!$Z$58,'Clean Columns'!$Z$59<Columns!C8/2),0.9*24*(E8^3)*SQRT($H$2*$B$2)/D8*0.5,0.9*24*(E8^3)*SQRT($H$2*$B$2)/D8),1000000))","v":2524.7924075362271},null,{"$f":"IF('Clean Columns'!$Z$60=2,Columns!K8,MIN(J8:K8))","v":752.55},752.55,660.85199999999998,660.85199999999998,1252.1531249999998,3429.9999999999995]
{"$rows_left_out":121}
{"sheet":"Lists","index":8,"n_rows":12,"n_cols":20,"rows_kept":12,"cut":false,"hidden":false,"merged":[]}
[1,2,3,4,5,6,7,8,9,10,11,12,13,14,15,16,17,18,19,20]
[]
[null,"2010 LRFD",null,"Directly Welded Flange"]
[null,"2010 ASD",null,"Flange Plate"]
[null,null,null,"Extended End Plate"]
[]
[null,"W18"]
[null,"W16"]
{"$rows_left_out":5}
{"sheet":"Database v14.0","index":9,"n_rows":275,"n_cols":70,"rows_kept":275,"cut":false,"hidden":false,"merged":[]}
["Type","EDI_Std_Nomenclature","AISC_Manual_Label","T_F","W","A","d","ddet","Ht","OD","bf","bfdet","b","ID","tw","twdet","twdet/2","tf","tfdet","t","tnom","tdes","kdes","kdet","k1","x","y","eo","xp","yp","bf/2tf","b/t","h/tw","Ht/t","D/t","Ix","Zx","Sx","rx","Iy","Zy","Sy","ry","Iz","rz","Sz","J","Cw","C","Wno","Sw1","Sw2","Sw3","Qf","Qw","ro","H","tan(α)","Qs","Iw","SwA","SwB","SwC","SzA","SzB","SzC","rts","ho","PA","PB"]
[null,null,1,{"$f":"C2+1","v":2},{"$f":"D2+1","v":3},{"$f":"E2+1","v":4},{"$f":"F2+1","v":5},{"$f":"G2+1","v":6},{"$f":"H2+1","v":7},8,9,10,11,12,13,14,15,16,17,18,19,20,21,22,23,24,25,26,27,28,29,30,31,32,33,34,35,36,37,38,39,40,41,42,43,44,45,46,47,48,49,50,51,52,53,54,55,56,57,58,59,60,61,62,63,64,65,66,67,68]
["W","W44X335","W44X335","F",335,98.5,44,44,"–","–",15.9,16,"–","–",1.03,1,0.5,1.77,1.75,"–","–","–",2.56,2.625,1.3125,"–","–","–","–","–",4.5,"–",38,"–","–",31100,1620,1410,17.8,1200,236,150,3.49,"–","–","–",74.7,535000,"–",168,1180,"–","–",278,805,"–","–","–","–","–","–","–","–","–","–","–",4.24,42.2,132,148]
["W","W44X290","W44X290","F",290,85.4,43.6,43.625,"–","–",15.8,15.875,"–","–",0.86499999999999999,0.875,0.4375,1.58,1.5625,"–","–","–",2.36,2.4375,1.25,"–","–","–","–","–",5.0199999999999996,"–",45,"–","–",27000,1410,1240,17.8,1040,205,132,3.49,"–","–","–",50.9,461000,"–",166,1040,"–","–",248,701,"–","–","–","–","–","–","–","–","–","–","–",4.2,42,131,147]
["W","W44X262","W44X262","F",262,77.2,43.3,43.25,"–","–",15.8,15.75,"–","–",0.78500000000000003,0.8125,0.4375,1.42,1.4375,"–","–","–",2.2000000000000002,2.25,1.1875,"–","–","–","–","–",5.57,"–",49.6,"–","–",24100,1270,1110,17.7,923,182,117,3.47,"–","–","–",37.299999999999997,405000,"–",165,928,"–","–",223,630,"–","–","–","–","–","–","–","–","–","–","–",4.17,41.9,131,147]
["W","W44X230","W44X230","F",230,67.8,42.9,42.875,"–","–",15.8,15.75,"–","–",0.71,0.6875,0.375,1.22,1.25,"–","–","–",2.0099999999999998,2.0625,1.1875,"–","–","–","–","–",6.45,"–",54.8,"–","–",20800,1100,971,17.5,796,157,101,3.43,"–","–","–",24.9,346000,"–",165,793,"–","–",192,547,"–","–","–","–","–","–","–","–","–","–","–",4.13,41.7,130,146]
["W","W40X593","W40X593","T",593,174,43,43,"–","–",16.7,16.75,"–","–",1.79,1.8125,0.9375,3.23,3.25,"–","–","–",4.41,4.5,2.125,"–","–","–","–","–",2.58,"–",19.100000000000001,"–","–",50400,2760,2340,17,2520,481,302,3.8,"–","–","–",445,997000,"–",166,2240,"–","–",479,1370,"–","–","–","–","–","–","–","–","–","–","–",4.63,39.799999999999997,130,147]
["W","W40X503","W40X503","T",503,148,42.1,42,"–","–",16.399999999999999,16.375,"–","–",1.54,1.5625,0.8125,2.76,2.75,"–","–","–",3.94,4,2,"–","–","–","–","–",2.98,"–",22.3,"–","–",41600,2320,1980,16.8,2040,394,249,3.72,"–","–","–",277,789000,"–",161,1830,"–","–",403,1150,"–","–","–","–","–","–","–","–","–","–","–",4.5,39.299999999999997,129,145]
{"$rows_left_out":267}