{"text_format":"1","workbook":"xlsx","n_sheets":10,"sheets":["ReadMe","HSS_Member","HSS_Section_Properties","HSS_Axial_Calculations","HSS_Bending_Calculations","HSS_Tension,_Shear","HSS_Torsion_Calculations","HSS500_Database","HSS1085_Database","Comparisons"],"not_rendered":{"charts":0,"images":1,"macros":1,"external_links":0,"defined_names":115,"comments":0,"pivot_tables":0},"unopened":[],"bounds":{"document_bytes":16777216,"sheet_cells":100000,"rows_first":2000,"rows_last":500,"rows_between":2000,"halvings":0,"cell_chars":16384,"cell_head_chars":4096},"cells_cut":0,"cells_raw":0,"read":"whole","date_system":"1900"}

{"sheet":"ReadMe","index":0,"n_rows":57,"n_cols":2,"rows_kept":57,"cut":false,"hidden":false,"merged":[]}
[null,"HSS Sections - Rectangular and Square - LRFD"]
[null,"AISC 360-22"]
[null,"Norman R. Mahan, PE.                                                                                                                 Ver. 2.0 - 3/19/2025"]
[null,"Overview"]
[null,"TraditionBS"]
[1,"This workbook was originally developed to analyze HSS sections used as crane columns.  The eccentricity"]
[null,"   of the crane load at the top of the column was to be account for.  "]
[null,"   As time went on it became clear that the analysis of HSS beam sections could be incorporated.  It finally"]
[null,"   became a complete analysis spreadsheet for HSS sections, equivalent to the available strength tables"]
[null,"   in the AISC manual.  No deflections are analyzed.  "]
[]
[{"$f":"+A6+1","v":2},"   It computes the available strength of HSS sections, obtaining the values of ɸcPn, ɸbMnx, "]
[null,"      ɸbMny, ɸtTyn, ɸtuTUn, ɸtorTort, ɸtorTorny,ɸvVx, and ɸvVy, in accordance with AISC 360-22."]
[null,"       All HSS sections in the AISC Shapes Database, V16.0 are included, including ASTM 1085 sections."]
[]
[{"$f":"+A12+1","v":3},"The workbook consists of 8 sheets and this 'ReadMe' sheet.  'HSS_Member' is the only sheet with which the user interacts.  All sheets are protected, with the necessary input cells on 'HSS_Member' unprotected.  Almost all calculations are done on the other sheets.  Two of the other sheets are:  HSS_Database and 1085HSS_Database.  These are subsets of 'aisc-shapes-database-v16.0' and 'aisc-shapes-database-v16.0_a1085.'  Columns of these two sheets haved been named within Excel to allow quick access to the data within the databases.   "]
[]
[{"$f":"+A16+1","v":4},"The sheet 'HSS_Section_Properties' retrieves the necessary section properties for the input section from the appropriate database.  If the section is 'Slender' or requires adjustment of the full section properites for some reason it is done on this sheet."]
[]
[{"$f":"+A18+1","v":5},"HSS Axial Calculations', 'HSS Bending Calculations', 'HSS Torsion Calculations', and 'HSS Tension, Shear' sheets compute the values accordingly.  At the top of each page (take Axial for example) is the governing value (Pn and ɸcPn)."]
[]
[{"$f":"+A20+1","v":6},"Input"]
[null,"   'HSS_Member' is the only sheet that has input.  The input cells are this color. "]
[null,"   All other cells are protected."]
[null,"   Cells with totals are this color."]
[null,"   Cells with output values are this color."]
[]
[]
[8,"Note that all input forces and moments are to be factored."]
[]
[{"$f":"+A29+1","v":9},"You enter the section by selecting the shape (Square or Rectangle), then the size (depth x width),  then the thickness, and then clicking on 'Insert'.  It will be red to remind you to click on it.  Changing the section type (square or rectangle), size, thickness, or yield selection turns the cell red.  Clicking on Insert returns it to the original color. "]
[]
[{"$f":"+A31+1","v":10},"There are two option selections.  One is for the ASTM grade of the section, the other is to compute the moment at the top of the column due to crane load eccentricity.  The ASTM options are 1085, Grade A, 500 Grade B, and 500, Grade C.  ASTM 1085, Grade A uses the full section properties of the section, while Grade 500, B & C, use the standard reduced properties.  The crane load eccentricity options are 'Yes' and 'No'.  The eccentricity is taken to be  equal to the (column depth/2 - thickness/2).  Only the crane 'Live Load' is used to compute the Mx moment.  The crane DL is assumed to be the weight of the crane beam and rail, generally symmetric on the column.  "]
[]
[{"$f":"+A33+1","v":11},"The crane live load, or axial force on the column, is entered in cell B9, with the dead load in cell B10.  "]
[]
[{"$f":"+A35+1","v":12},"The k values for the member and the unbraced length about each axis are in cells B15 thru D16.  Note that the unbraced length for torsion (Lz) must be equal to or less than Ly.  It need be entered only if torsion effects are to be included in the analysis."]
[]
[{"$f":"+A37+1","v":13},"Additional Mx and My moments may be entered in cells F9 and F15 as needed.  The unbraced length in bending, Lb, is entered in cell F16."]
[]
[{"$f":"+A39+1","v":14},"If the crane eccentricity option is selected, values for Cb are automatically entered in cells H24 through H27, assuming a linear distribution of moment with Mmax at the top of the member and a zero value for the moment at the bottom.  The user may adjust these values if desired.  Alternatively, the user may enter a Cb value in cell H29 which will override any value computed in cell H28."]
[]
[{"$f":"+A41+1","v":15},"The only other values the user may wish to enter is for shear and torsion, in cells C47, C48, and F47. "]
[]
[{"$f":"+A43+1","v":16},"Ensure that all numeric entries have a value - zero if necessary.  Blank value may cause strange results."]
[]
[{"$f":"+A45+1","v":17},"As of this date (8/27/2024) 26 random selected sections have been compared with the AISC tabulated values (V16.0 Companion, Volume 2, Design Tables).  The largest positive variation is 1.91% for an HSS 24x12x5/16 in My bending.  The largest negitive variation is -0.67%.  In addition, the nine examples in the Companion, Volume 1 - Design Examples, that are of HSS sections have beens compared against the results of this workbook.  The largest deviation there was 1.30% for Examples F8A & F8B, a square flexural member with slender flanges."]
[]
[{"$f":"+A47+1","v":18},"Print any or all sheets as you desire using normal Excel printing procedures.  Print areas are pre-selected.  "]
[]
[{"$f":"+A49+1","v":19},"Sometimes the changing of HSS the shape (Square to Rectangular), size, thickness, and yield may cause unpredictable results.  Ensure that the section that you are interested in is shown on HSS_Section_Properties if the results are strange.  Start over with the yield, then the shape, then the size, then the thickness. Be sure to click on your selected wall thickness, even if the default that appears is what you desire.  If you don't see any thicknesses in the thickness drop down box (which sometimes happens due to the characteristics of the drop down box), select a different size and then go back and click on your original size.  All should be well.  If not, let me know."]
[]
[{"$f":"+A51+1","v":20},"It is believed that this workbook provides information in accordance with AISC 360-22.  However, the user is ultimately responsible for any errors.  "]
[]
[50,"Ver. 2.0.    Changes from Ver. 1.0.  Only one calculation has been changed.  The Y-axis shear value has been corrected.  All other changes are cosmetic, affecting the appearance of the HSS_Member sheet and methods of input."]
[]
[100,"Address any questions or comments to me at nrmahan@att.net.  I will reply as soon as I can.  Suggestions are welcome.  Norman R. Mahan, P.E."]

{"sheet":"HSS_Member","index":1,"n_rows":72,"n_cols":15,"rows_kept":72,"cut":false,"hidden":false,"merged":[]}
[null,null,"HSS Sections - Rectangular and Square - LRFD",null,null,null,null,null,"Ver. 2.0",null," "]
[" ",null,null,null,"AISC 360-22",null,null,null,null,null,null,null,{"$f":"INDEX(HSS500_Database!$H$4:$H$82, $K$6)","v":"8x8"}]
["8x8x1/2 section",null,null,null,"Test section",null,null,null,{"$f":"TODAY()","v":"2025-03-25"},null,null,null,{"$f":"INDEX(HSS500_Database!$I$4:$I$12,$K$7)","v":0}]
["  Square=>",null,"<==Rectangle",null,null," ",null,null,null,null,null,"Work area:"," "," "]
[null,"Square",2,null,null,null,null,null,"500, Gr. C",null,"index:",null,"Size:"]
[null,"HSS 500, Gr. C","Fy","Fu",null,null,"500, Gr. B","500, Gr. C","1085, Gr. A"," ",9,"<=Seq in H",{"$f":"INDEX(HSS500_Database!$H4:$H82, $K$6)","v":"8x8"},{"$f":"M6 &\"x\"&IF(M7=1,TEXT(M7,\"0\"),TEXT(M7,\"0.000\"))","v":"8x8x0.000"}]
[null,"8x8x0.500",50,62,"  <== ksi ==>",null,"46, 58","50, 62","50, 65"," ",2,"<=Seq in T",{"$f":"INDEX(HSS500_Database!$I4:$I14, $K$7)","v":0},null," "]
["Insert",null,null,null,null,null,null," ","(Full Prop.)"]
["Compression",null,null,null,null," ","Flexure"]
["                          All input forces to be factored forces.",null,null,null,null,null,null,0]
[" ",null,null," "," ",null,null,null,"No"]
["LL",0,"kips",null,null,null,null,null,"Crane force"]
["DL",0,"kips",null," ",null,null,null,"eccentricity?"]
["Total - Pn",{"$f":"B12+B13","v":0},"kips",null,"Mrx",50,"kip-ft",null,"      Y    N"]
[null,null,null,null,null,null,"in          <==","e to col flg centerline"]
[null,{"$f":"IF(B20>200, \"L/r > 200\", \"\")","v":""},{"$f":"IF(C20>200, \"L/r > 200\", \"\")","v":""},null,null,null,"kip-ft    <==","crane load Mx"]
[null,"X-axis","Y-axis","Z-axis","Total - Mrx",{"$f":"+F14+F16","v":50},"kip-ft"]
["k",1,1,1,"Mry",0,"kip-ft"]
["Lc",20,20,20,"Lb",20,"ft"]
["Lc/r",{"$f":"+B18*B19*12/rx","v":78.94736842105263},{"$f":"+C18*C19*12/ry","v":78.94736842105263},"Lcz <= Lcy"]
[null,null,null,null,null,null,null,null," "]
["For uniform compression section is:",null,null,null,null,null,null,"Flange:","Web:"]
[null,null,{"$f":"IF(hss500_type=\"Square\",HSS_Section_Properties!$C$26,HSS_Section_Properties!$I$32)","v":"Nonslender"},null," ",null,"For X-axis bending:",{"$f":"+HSS_Section_Properties!C42","v":"Compact"},{"$f":"+HSS_Section_Properties!C57","v":"Compact"}," "," "]
[null,null,null,null,null,null,"For Y-axis bending:",{"$f":"+HSS_Section_Properties!G42","v":"Compact"},{"$f":"+HSS_Section_Properties!G57","v":"Compact"}]
[null,null,null,null,null,"Compute Cb",null," "]
[null,null,null,null,null,"Optional calculation - absolute values","Mmax",0,"kip-ft"]
[null," ",null,null,null,"Ma - 1/4 pt of unbraced segment","Ma",0,"kip-ft"]
[null,null,null,null,null,"Mb - 1/2 pt of unbraced segment","Mb",0,"kip-ft"]
[null,null,null,null,null,"Mc - 3/4 pt of unbraced segment","Mc",0,"kip-ft"]
[null,null,null,null,null,"Cb = 12.5Mmax/(2.5Mmax + 3Ma + 4Mb+3Mc)","Cb",{"$f":"IFERROR((12.5*H26/(2.5*H26+3*H27+4*H28+3*H29)),0)","v":0}]
[null,null,null,"Optional direct entry",null,null,"Cb  (enter)",1]
[]
["Axial",null,"ɸcPn = Pn",{"$f":"+HSS_Axial_Calculations!D8","v":385.15056977548488},"kips","Pr",{"$f":"+B14","v":0},"kips"]
["X Bending",null,"ɸbMn = Mcx",{"$f":"+HSS_Bending_Calculations!E8","v":140.625},"kip-ft","Mrx",{"$f":"+F17","v":50},"kip-ft",null," "]
["Y Bending",null,"ɸbMn = Mcy",{"$f":"+HSS_Bending_Calculations!E10","v":140.625},"kip-ft","Mry",{"$f":"+F18","v":0},"kip-ft",null," "]
[null,null,null,null,null,null," "]
[null,null,null,"Pr/Pc",{"$f":"IFERROR(G33/D33,0)","v":0}]
[null,null,null,"Pr/Pc + (8/9)(Mrx/Mcx + Mry/Mcy) < = 1",{"$f":"+IFERROR(G33/D33,0)+(8/9)*(IFERROR((G34/D34),0)+IFERROR((G35/D35),0))","v":0.31604938271604938},null,null,"H1-1a"]
[null,null,null,"Pr/(2*Pc) + (Mrx/Mcx + Mry/Mcy) < = 1",{"$f":"IFERROR(G33/(2*D33),0)+IFERROR(G34/D34,0) + IFERROR(G35/D35,0)","v":0.35555555555555557},null,null,"H1-1b"]
[null,null,null,"Max ratio",{"$f":"IF(E37>=0.2,E38,E39)","v":0.35555555555555557}]
[]
["Tension",null,null,"Shear",null,null,"Torsion"]
["ɸtTYn",{"$f":"+'HSS_Tension,_Shear'!F9","v":607.5},"kips","ɸvVnx",{"$f":"+'HSS_Tension,_Shear'!C9","v":165.726},"kips","ɸtorTort",{"$f":"+HSS_Torsion_Calculations!D11","v":117.9},"kip-in"]
["ɸtuTUn",{"$f":"+'HSS_Tension,_Shear'!F11","v":470.8125},"kips","ɸvVny",{"$f":"+'HSS_Tension,_Shear'!C11","v":165.726},"kips",null,null," "]
[]
[]
["H3.2 - HSS subjected to combined torsion shear, flexure, and axial force"]
[null,null,"Shear force",null,null,"Torsion force"]
[null,"Vx",0,"kips","Tz",0,"kip-ft"]
[null,"Vy",0,"kips"]
[]
[null,"If Tr is less than or equal to Tc, torsional effects may be neglected."]
[null,"Use H1-1a and H1-1b."]
[]
[null,null,null,null,"(Pr/Pc + Mrx/Mcx + Mry/Mcy) + (Vr/Vc + Tr/Tc)^2 <= 1.0",null,null,"H3-6"]
[null,null,"Pr/Pc",{"$f":"IFERROR(B14/D33,0)","v":0}]
[null,null,"Mrx/Mcx",{"$f":"IFERROR(F17/D34,0)","v":0.35555555555555557}]
[null,null,"Mry/Mcy",{"$f":"+IFERROR(F18/D35,0)","v":0}]
[null,null,"Vr/Vc",{"$f":"MAX(C49/E43,C50/E44)","v":0},null," "," "," "]
[null,null,"Tr/Tc",{"$f":"IFERROR(F49/H43,0)","v":0}]
[null,null,"Ratio",{"$f":"+(D56+D57+D58)+(D59+D60)^2","v":0.35555555555555557}," ",null,null,"H3-6"]
[]
["G",11300,"ksi",null,"Created by: Norman R. Mahan, P.E.",null,null,"2024-08-27"]
["E",29000,"ksi"]
["Fy",{"$f":"+C7","v":50},"ksi"]
["π",3.1415899999999999,null," "," "]
["ɸb",0.9]
["ɸc",0.9]
["ɸv",0.9]
["ɸt",0.9]
["ɸtu",0.75,null,null,null," "," "]
["ɸtor",0.9,null,null,null," "]

{"sheet":"HSS_Section_Properties","index":2,"n_rows":114,"n_cols":16,"rows_kept":114,"cut":false,"hidden":false,"merged":[]}
[null,null,"HSS Sections - Rectangular and Square - LRFD",null,null,null,null,null,{"$f":"+HSS_Member!I1","v":"Ver. 2.0"}]
[" ",null,null,null,"AISC 360-22"]
[{"$f":"+HSS_Member!A3","v":"8x8x1/2 section"},null,null,null,{"$f":"+HSS_Member!E3","v":"Test section"},null,null,null,{"$f":"TODAY()","v":"2025-03-25"}]
[null,null,null," ",null," "]
["HSS Properties","ASTM",null,"HSS type:",null,"Depth","Width"]
[{"$f":"+Member","v":"8x8x0.500"},{"$f":"+HSS_Member!B6","v":"HSS 500, Gr. C"},null,{"$f":"IF(F6=G6, \"Square\", \"Rectangular\")","v":"Square"},null,{"$f":"LEFT(I22,SEARCH(\"x\",I22)-1)","v":"8"},{"$f":"LEFT(J22,SEARCH(\"x\",J22)-1)","v":"8"},"in"]
[null,null,null,null,null,null,null,null,null,null,null,null," ",null,null," "]
[{"$f":"\"HSS \"&$A$6 & \" section properties\"","v":"HSS 8x8x0.500 section properties"}]
["Area","Depth","Width","h","b","t","h/t","b/t","J","C"]
["in^2","in","in","in","in","in"," "," ","in^4","in^6"]
[{"$f":"INDEX(hss500_area,MATCH($A$6,hss500_hss,0))","v":13.5},{"$f":"INDEX(hss500_depth,MATCH($A$6, hss500_hss,0))","v":8},{"$f":"INDEX(hss500_width,MATCH($A$6, hss500_hss,0))","v":8},{"$f":"_xlfn.SINGLE(INDEX(hss500_h,MATCH($A$6, hss500_hss,0)))","v":6.6},{"$f":"_xlfn.SINGLE(INDEX(hss500_b,MATCH($A$6, hss500_hss,0)))","v":6.6},{"$f":"_xlfn.SINGLE(INDEX(hss500_tdes,MATCH($A$6, hss500_hss,0)))","v":0.46500000000000002},{"$f":"INDEX(hss500_h_t,MATCH($A$6, hss500_hss,0))","v":14.2},{"$f":"INDEX(hss500_b_t,MATCH($A$6, hss500_hss,0))","v":14.2},{"$f":"_xlfn.SINGLE(INDEX(hss500_j,MATCH($A$6, hss500_hss,0)))","v":204},{"$f":"_xlfn.SINGLE(INDEX(hss500_c,MATCH($A$6, hss500_hss,0)))","v":52.4},null,null,null," "]
[null,null,null,null,null,null," "," "]
["Ix","Sx","rx","Zx","Iy","Sy","ry","Zy"]
["in^4","in^3","in","in^3","in^4","in^3","in","in^3"]
[{"$f":"_xlfn.SINGLE(INDEX(hss500_ix,MATCH($A$6, hss500_hss,0)))","v":125},{"$f":"_xlfn.SINGLE(INDEX(hss500_sx,MATCH($A$6, hss500_hss,0)))","v":31.2},{"$f":"_xlfn.SINGLE(INDEX(hss500_rx,MATCH($A$6, hss500_hss,0)))","v":3.04},{"$f":"_xlfn.SINGLE(INDEX(hss500_zx,MATCH($A$6, hss500_hss,0)))","v":37.5},{"$f":"_xlfn.SINGLE(INDEX(hss500_iy,MATCH($A$6, hss500_hss,0)))","v":125},{"$f":"_xlfn.SINGLE(INDEX(hss500_sy,MATCH($A$6, hss500_hss,0)))","v":31.2},{"$f":"_xlfn.SINGLE(INDEX(hss500_ry,MATCH($A$6, hss500_hss,0)))","v":3.04},{"$f":"_xlfn.SINGLE(INDEX(hss500_zy,MATCH($A$6, hss500_hss,0)))","v":37.5},null,null,null,null," "]
[]
["Lp","Lr","Weight",null,null,null,null,null,null,null,null,null," "]
["ft","ft","lbs/ft",null,null,null,null,null,null,"sqrt(E/Fy)"]
[{"$f":"0.13*E*ry*((SQRT(j*area))/(HSS_Bending_Calculations!C22*12))/12","v":26.730949390577205},{"$f":"((SQRT(j*area)/(0.7*Fy*Sx))*2*E*ry)/12","v":706.12186682632102},{"$f":"_xlfn.SINGLE(INDEX(hss500_weight,MATCH($A$6,hss500_hss,0)))","v":48.85},null,null," ",null,null,null,{"$f":"SQRT(E/Fy)","v":24.083189157584592}]
["Eq. F7-10","Eq. F7-11",null,null,null,null,null,null,null," "]
[]
["Uniform compression:",null,null,null,null,null," ","Strip HS=>",{"$f":"RIGHT(\"HSS\"&$A$6,LEN(\"HSS\"&$A$6)-3)","v":"8x8x0.500"},{"$f":"RIGHT(I22,LEN(I22)-SEARCH(\"x\",I22))","v":"8x0.500"},null,null," "]
[null,"Square sections:",null,null,null,null,null,null," ",null,null,null," "]
[null,"b/t",{"$f":"b_t","v":14.2}]
[null,"λr = 1.40*sqrt(E/Fy)",{"$f":"1.4*sqrtefy","v":33.716464820618427}]
[null,"Section is:",{"$f":"IF(C24<=C25,\"Nonslender\",\"Slender\")","v":"Nonslender"},null,null,null,null,null,null," "]
[]
[null,"Rectangular sections, narrow wall:",null,null,null,"Rectangular sections, wide wall:"]
[null,"Uniform compression:",null,null,null,"Uniform compression:"]
[null,"λ; b/t",{"$f":"+b_t","v":14.2},null,null,"λ; b/t",{"$f":"+h_t","v":14.2}]
[null,"λr = 1.40*sqrt(E/Fy)",{"$f":"1.4*sqrtefy","v":33.716464820618427},null,null,"λr = 1.40*sqrt(E/Fy)",{"$f":"1.4*sqrtefy","v":33.716464820618427},null,"Section is:"]
[null,"Section is:",{"$f":"IF(C30<=C31,\"Nonslender\",\"Slender\")","v":"Nonslender"},null,null,"Section is:",{"$f":"IF(G30<=G31,\"Nonslender\",\"Slender\")","v":"Nonslender"},null,{"$f":"IF(OR(C32=\"Slender\",G32=\"Slender\"),\"Slender\",\"Nonslender\")","v":"Nonslender"}]
[]
[]
[]
["Flexure:"," "]
[null,"Flanges, bending about X-axis:",null,null,null,"Flanges, bending about Y-axis:"]
[null,"Square & Rectangular sections:",null,null,null,"Rectangular sections:"]
[null,"λ; b/t",{"$f":"+b_t","v":14.2},null,null,"λ; h/t",{"$f":"+h_t","v":14.2}]
[null,"λp = 1.12*sqrt(E/Fy)",{"$f":"1.12*sqrtefy","v":26.973171856494744},null,null,"λp = 1.12*sqrt(E/Fy)",{"$f":"1.12*sqrtefy","v":26.973171856494744}]
[null,"λr = 1.40*sqrt(E/Fy)",{"$f":"1.4*sqrtefy","v":33.716464820618427},null,null,"λr = 1.40*sqrt(E/Fy)",{"$f":"1.4*sqrtefy","v":33.716464820618427}]
[null,"Flange is:",{"$f":"IF(C39<=C40,\"Compact\",IF(C39<=C41,\"Noncompact\",\"Slender\"))","v":"Compact"},null,null,"Flange is:",{"$f":"IF(G39<=G40,\"Compact\",IF(G39<G41,\"Noncompact\",\"Slender\"))","v":"Compact"}]
[]
[null,null,"be = 1.92*t*sqrt(E/Fy)*[1-0.38/(b/t)*sqrt(E/Fy)] <=b",null,null,null,null,null,"F7-4"]
["be",{"$f":"IF(1.92*t*sqrtefy*(1-(0.38/C39)*sqrtefy)<0,b,(1.92*t*sqrtefy*(1-(0.38/C39)*sqrtefy)))","v":7.6442093080605362},"in",null,"be",{"$f":"1.92*t*sqrtefy*(1-(0.38/G39)*sqrtefy)","v":7.6442093080605362}]
["Ix",{"$f":"+Ix","v":125},"in^4"]
["minus area",{"$f":"+(b-B45)*t","v":-0.48555732824814951},"in^2"]
["d",{"$f":"+Depth/2-t/2","v":3.7675000000000001},"in"]
["minus I",{"$f":"IF(B47<0,0,-B47*B48^2)","v":0},"in^3"]
["Ix_eff",{"$f":"+B46+B49","v":125},"in"]
[]
[null,"Webs, bending about X-axis:",null,null,null,"Webs, bending about Y-axis:"]
[null,"Square & Rectangular sections:",null,null,null,"Rectangular sections:"]
[null,"λw",{"$f":"+h_t","v":14.2},null,null,"λw",{"$f":"+b_t","v":14.2}]
[null,"λpw = 1.42*sqrt(E/Fy)",{"$f":"2.42*$J$19","v":58.281317761354707},null,null,"λpw = 1.42*sqrt(E/Fy)",{"$f":"2.42*$J$19","v":58.281317761354707}]
[null,"λrw = 5.70*sqrt(E/Fy)",{"$f":"5.7*$J$19","v":137.27417819823216},null,null,"λrw = 5.70*sqrt(E/Fy)",{"$f":"5.7*$J$19","v":137.27417819823216},null,null,"For bending, section is:"]
[null,"Web is:",{"$f":"IF(C54<=C55,\"Compact\",IF(C54<=C56,\"Noncompact\",\"Slender\"))","v":"Compact"},null,null,"Web is:",{"$f":"IF(G54<=G55,\"Compact\",IF(G54<=G56,\"Noncompact\",\"Slender\"))","v":"Compact"},null,null,{"$f":"IF(OR(C57=\"Slender\",G57=\"Slender\"),\"Slender\",IF(OR(C57=\"Noncompact\",G57=\"Noncompact\"),\"Noncompact\",\"Compact\"))","v":"Compact"}]
[null,null,null,null,null,null," "]
[null,null,null,"Y-axis"," b"]
[]
[null,null,null,null,"        h"]
[null,null,null,null,null,"X -axis"]
[]
[]
[]
[null,null,null,null," "]
[null,"X - axis bending",null,null,null,"Y - axis bending"]
[null,"be",{"$f":"+HSS_Section_Properties!B45","v":7.6442093080605362},"in",null,"be",{"$f":"+HSS_Section_Properties!F45","v":7.6442093080605362},"in"]
[null,"b",{"$f":"b","v":6.6},"in",null,"h",{"$f":"h","v":6.6},"in"]
[null,"b Use==>",{"$f":"MIN(C68,C69)","v":6.6},"in",null,"h Use==>",{"$f":"MIN(G68,G69)","v":6.6},"in"]
[]
[null,"Bending about X-Axis",null,"Fillet r",{"$f":"+(F6-h)/2","v":0.70000000000000018},"in",{"$f":"+(G6-b)/2","v":0.70000000000000018}]
[null,null,"Length","t","Area","d","Area*d","Delta","A*Delta^2"]
[null,"Top (Comp)",{"$f":"+C70","v":6.6},{"$f":"t","v":0.46500000000000002},{"$f":"+C74*D74","v":3.069},{"$f":"+F6-t/2","v":7.7675000000000001},{"$f":"+F74*E74","v":23.838457500000001},{"$f":"$G$81-F74","v":-3.7675000000000001},{"$f":"+E74*H74^2","v":43.561558631250001}]
[null,"Left (Web)",{"$f":"+F6-t-2*rad","v":6.1349999999999998},0.46500000000000002,2.8527749999999998,{"$f":"+F6/2","v":4},11.411099999999999,0,0]
[null,"Right (Web)",{"$f":"+C75","v":6.1349999999999998},0.46500000000000002,2.8527749999999998,{"$f":"+F75","v":4},11.411099999999999,0,0]
[null,"Bottom (Ten)",{"$f":"+C69","v":6.6},0.46500000000000002,3.069,{"$f":"+D77/2","v":0.23250000000000001},0.71354250000000008,3.7675000000000001,43.561558631250001]
[null,"Top fillets",{"$f":"2*pi*fillet_r/4*2","v":2.1991130000000005},0.46500000000000002,1.0225875450000004,{"$f":"+F6-C114-t/2","v":7.2189645959794033},7.3820232836444974,-3.2189645959794033,10.595779182169274]
[null,"Bottom fillets",{"$f":"2*pi*fillet_r/4*2","v":2.1991130000000005},0.46500000000000002,1.0225875450000004,{"$f":"+C114+t/2","v":0.78103540402059657},0.79867707635550522,3.2189645959794033,10.595779182169274]
[null,null,null,null,{"$f":"SUM(E74:E79)","v":13.888725090000001},{"$f":"+F6","v":"8"},{"$f":"SUM(G74:G79)","v":55.554900360000005},null,{"$f":"SUM(I74:I79)","v":108.31467562683855},"in^4"]
[null,null,null,null,null,"NA",{"$f":"+G80/E80","v":4},"Web",{"$f":"2*D75*C75^3/12","v":17.895564554062499},"in^4"]
[null,"S_top = Se",{"$f":"+I82/G81","v":31.552560045225263},"in^3",null,"dist to bottom",{"$f":"+F80-G81","v":4},"Ix",{"$f":"+I80+I81","v":126.21024018090105},"in^4"," "]
[null,"S_bot",{"$f":"I82/G82","v":31.552560045225263},"in^3",null," ",null,"Table Ix",{"$f":"Ix","v":125},"in^4"," "]
[null,null,null,null,null,null,null,"%",{"$f":"+I82/I83","v":1.0096819214472084},null," "]
[]
[]
[null,"Bending about Y-axis"]
[null,null,"Length","t","Area","d","Area*d","Delta","A*Delta^2"]
[null,"Left (Ten)",{"$f":"+G69","v":6.6},{"$f":"t","v":0.46500000000000002},{"$f":"+C89*D89","v":3.069},{"$f":"+t/2","v":0.23250000000000001},{"$f":"+F89*E89","v":0.71354250000000008},{"$f":"+$G$96-F89","v":3.7675000000000001},{"$f":"+E89*H89^2","v":43.561558631250001}]
[null,"Top (Web)",{"$f":"+G6-t-2*rad","v":6.1349999999999998},{"$f":"t","v":0.46500000000000002},2.8527749999999998,{"$f":"+G6/2","v":4},11.411099999999999,0,0]
[null,"Bottom (Web)",{"$f":"+C90","v":6.1349999999999998},{"$f":"t","v":0.46500000000000002},2.8527749999999998,{"$f":"+G6/2","v":4},11.411099999999999,0,0]
[null,"Right (Comp)",{"$f":"+G70","v":6.6},{"$f":"t","v":0.46500000000000002},3.069,{"$f":"+G6-t/2","v":7.7675000000000001},23.838457500000001,-3.7675000000000001,43.561558631250001]
[null,"Left fillets",{"$f":"+C78","v":2.1991130000000005},{"$f":"+t","v":0.46500000000000002},1.0225875450000004,{"$f":"t/2+C114","v":0.78103540402059657},0.79867707635550522,3.2189645959794033,10.595779182169274,null,null,null," "]
[null,"Right fillets",{"$f":"+C93","v":2.1991130000000005},{"$f":"+t","v":0.46500000000000002},1.0225875450000004,{"$f":"G6-t/2-C114","v":7.2189645959794033},7.3820232836444974,-3.2189645959794033,10.595779182169274]
[null,null,null,null,{"$f":"SUM(E89:E94)","v":13.888725090000001},{"$f":"+G6","v":"8"},{"$f":"SUM(G89:G94)","v":55.554900360000005},null,{"$f":"SUM(I89:I94)","v":108.31467562683855},"in^4"]
[null,null,null,null,null,"NA",{"$f":"+G95/E95","v":4},"Web",{"$f":"2*D90*C90^3/12","v":17.895564554062499},"in^4"]
[null,"S_left = Se",{"$f":"+I97/G96","v":31.552560045225263},"in^3",null,"dist to left",{"$f":"+F95-G96","v":4},"Iy",{"$f":"+I95+I96","v":126.21024018090105},"in^4"]
[null,"S_right",{"$f":"I97/G97","v":31.552560045225263},"in^3",null,null,null,"Table Iy",{"$f":"+E15","v":125},"in^4"]
[null,null,null,null,null,null,null,"%",{"$f":"+I97/I98","v":1.0096819214472084},null," "]
[]
[null,"C.G. of fillet"]
[null,"rad",{"$f":"fillet_r","v":0.70000000000000018}]
[null,"t",{"$f":"+t","v":0.46500000000000002},null,null,null,null,null,null," "]
[null,"sqrt(2)",{"$f":"SQRT(2)","v":1.4142135623730951}]
[null,"(r+t)^3",{"$f":"+(C102+C103)^3","v":1.581167125000001}]
[null,"r^3",{"$f":"C102^3","v":0.34300000000000025}]
[null,"3pi",{"$f":"3*pi","v":9.4247699999999988}]
[null,"(r+t)^2",{"$f":"+(C102+C103)^2","v":1.3572250000000006}]
[null,"r^2",{"$f":"+C102^2","v":0.49000000000000027}]
[null,"num",{"$f":"C104*(C105-C106)","v":1.7510327406595045}]
[null,"den",{"$f":"+C107*(C108-C109)","v":8.1733961632500023}]
[null,"CG",{"$f":"+C110/C111","v":0.21423563787751582}]
[null,"0.707*cg",{"$f":"0.707*C112","v":0.15146459597940368}]
[null,"r-0.707*cg",{"$f":"fillet_r-C113","v":0.54853540402059653}]

{"sheet":"HSS_Axial_Calculations","index":3,"n_rows":61,"n_cols":11,"rows_kept":61,"cut":false,"hidden":false,"merged":[]}
[null,null,"HSS Sections - Rectangular and Square - LRFD",null,null,null,null,null,{"$f":"+HSS_Member!I1","v":"Ver. 2.0"}]
[" ",null,null,null,"AISC 360-22"]
[{"$f":"+HSS_Member!A3","v":"8x8x1/2 section"},null,null,null,{"$f":"+HSS_Member!E3","v":"Test section"},null,null,null,{"$f":"TODAY()","v":"2025-03-25"}]
[null,null,null," ",null," "]
["HSS Axial","ASTM"]
[{"$f":"+Member","v":"8x8x0.500"},{"$f":"+HSS_Member!B6","v":"HSS 500, Gr. C"}]
[null,null,"Pn",{"$f":"IF(B10<> \"Slender\",D23,D58)","v":427.94507752831652}]
[null,null,"ɸcPn",{"$f":"phi_c*D7","v":385.15056977548488},"kips"," "]
[]
["Section is:",{"$f":"+HSS_Section_Properties!I32","v":"Nonslender"}]
["HSS Section:","Elements are stiffened"]
[]
[null,null,"Max Lc/r",{"$f":"MAX(HSS_Member!B20,HSS_Member!C20)","v":78.94736842105263}]
[null,null,"sqrt(E/Fy)",{"$f":"+sqrtefy","v":24.083189157584592},null,null,null,null," "]
[null,null,"Fe = π^2*E/(Lc/r)^2",{"$f":"pi^2*E/D13^2","v":45.922095077990619},"ksi",null,null,"E3-4"," "]
[]
["E3 - Flexural buckling of members without slender elements"]
[null,null,"Pn = FnAg",null,null,null,null,"E3-1"]
[null,null,"4.71*sqrt(E/Fy)",{"$f":"4.71*D14","v":113.43182093222343}]
[null,null,"Fn = [0.658^(Fy/Fe)]Fy",{"$f":"(0.658^(Fy/D15))*Fy","v":31.699635372467888},"ksi",null,null,"E3-2"," "," "," "]
[null,null,"Fn = 0.877Fe",{"$f":"0.877*D15","v":40.273677383397775},"ksi",null,null,"E3-3"]
[null,null,"Fn use  ==>",{"$f":"IF(D13<=D19,D20,D21)","v":31.699635372467888},"ksi"]
[null,null,"Pn = FnAg",{"$f":"D22*area","v":427.94507752831652},"kips",null," ",null," "]
[]
["E4 - Torsional and Flexural-torsional buckling of single angles and members without slender elements"]
[null,null,"Pn = FnAg",null,null,null,null,"E4-1"]
["(a) For doubly symmetric members twisting about the shear center"]
[null,null,"(π^2*E*Cw)/(Lcz)^2",{"$f":"(pi^2*E*Cw)/(lcz*12)^2","v":260.37891513230488}]
[null,null,"GJ",{"$f":"+G*j","v":2305200}]
[null,null,"Ix + Iy",{"$f":"+Ix + Iy","v":250},"in^4"]
[null,null,"Fe",{"$f":"(D28+D29)*(1/D30)/1000","v":9.2218415156605289},"ksi",null,null,"E4-2"]
[]
["(b) For singly symmetric members twisting about the shear center where y is the axis of symmetry"]
[null,null,"H = 1-(xo^2 + yo^2)/ro_bar^2",1,null,"xo, yo = 0",null,null,null," "]
[null,null,"ro_bar = xo^2 + yo^2 +(Ix + Iy)/Ag",{"$f":"+(Ix + Iy)/area","v":18.518518518518519},"in^2"]
[null,null,"Fex = (π^2*E)/(Lcx/rx)^2",{"$f":"(pi^2*E)/((lcx*12)/rx)^2","v":45.922095077990619},"ksi",null,null,"E4-5"]
[null,null,"Fey = (π^2*E)/(Lcy/ry)^2",{"$f":"(pi^2*E)/((lcy*12)/ry)^2","v":45.922095077990619},"ksi",null,null,"E4-6"]
[null,null," (π^2*E*Cw)/(Lcz^2) + GJ)",{"$f":"(pi^2*E*Cw)/(12*lcz)^2 + G*j","v":2305460.3789151325}]
[null,null,"1/(Ag*ro_bar^2)",{"$f":"1/(area*ro_bar^2)","v":2.1599999999999996E-4},null,null,null,null," "]
[null,null,"Fe= (π^2*E*Cw)/(Lcz^2) + GJ)(1/(Ag*ro_bar^2)",{"$f":"+D38*D39/1000","v":0.49797944184566856},"ksi"]
[]
["E7. Members with Slender Elements"]
[null,null,"Pn = FnAe",null,null,null,null,"E7-1"]
[null,null,"λr",{"$f":"+HSS_Section_Properties!$C$25","v":33.716464820618427},null," "]
[null,null,"λr*sqrt(Fy/Fn)",{"$f":"lambda_r*SQRT(Fy/Fn)","v":42.344781989290105},null,null,null," "]
[]
[null,null,"Effective area - narrow wall",null,null,null,"Effective area - wide wall"]
[null,null,"λ,  b/t",{"$f":"IF(hss500_type=\"Square\",HSS_Section_Properties!$C$24,HSS_Section_Properties!$C$30)","v":14.2},null,{"$f":"IF(hss500_type=\"Square\",HSS_Section_Properties!$C$24,HSS_Section_Properties!$G$30)","v":14.2},null," ",null," "]
[null,null,"λ <= λr*sqrt(Fy/Fn)",{"$f":"IF(lambda<$D$45,\"True\",\"False\")","v":"True"},null,{"$f":"IF(lambda_w<$D$45,\"True\",\"False\")","v":"True"},null,"E7-2"]
[null,null,"Fel = [c2*( λr/λ)]^2*Fy",{"$f":"(t_c2*lambda_r/lambda)^2*Fy","v":536.8284864114263},"ksi",{"$f":"(t_c2*lambda_r/lambda_w)^2*Fy","v":536.8284864114263},"ksi","E7-5"]
[null,null,"sqrt(Fel/Fn)",{"$f":"SQRT(Fel_n/Fn)","v":4.1151971229028419},null,{"$f":"SQRT(Fel_w/Fn)","v":4.1151971229028419}]
[null,null,"b (narrow), h (wide)",{"$f":"b","v":6.6},"in",{"$f":"+h","v":6.6},"in"]
[null,null,"1 -c1*sqrt(Fel/Fn)",{"$f":"1 -t_c1*D51","v":0.17696057541943155},null,{"$f":"1 -t_c1*F51","v":0.17696057541943155}]
[null,null,"be = b[1-c1*sqrt(Fel/Fn)]*sqrt(Fel/Fn)",{"$f":"IF((D52*D53*D51)<0,D52,(D52*D53*D51))","v":4.8063024954996223},"in",{"$f":"IF((F52*F53*F51)<0,F52,(F52*F53*F51))","v":4.8063024954996223},"in","E7-3"]
[null,null,"Lost length",{"$f":"IF(D49,0,(D52-D54))","v":0},"in",{"$f":"IF(F49,0,(F52-F54))","v":0},"in"]
[null,null,null," "]
[null,null,"Aeff = Ag - t*2*Deducts",{"$f":"area-t*2*(D55+F55)","v":13.5},"in^2"," ","`"]
[null,null,"Pn = FnAe",{"$f":"+Fn*D57","v":427.94507752831652},"kips",null,null," "]
[]
[null,"Table E7.1","c1","c2"]
[null,"(b)",0.2,1.38,null," "]

{"sheet":"HSS_Bending_Calculations","index":4,"n_rows":77,"n_cols":11,"rows_kept":77,"cut":false,"hidden":false,"merged":[]}
[null,null,"HSS Sections - Rectangular and Square - LRFD",null,null,null,null,null,{"$f":"+HSS_Member!I1","v":"Ver. 2.0"}]
[" ",null,null,null,"AISC 360-22"]
[{"$f":"+HSS_Member!A3","v":"8x8x1/2 section"},null,null,null,{"$f":"+HSS_Member!E3","v":"Test section"},null,null,null,{"$f":"TODAY()","v":"2025-03-25"}]
[null,null,null," ",null," "]
["HSS Bending","ASTM"]
[{"$f":"+Member","v":"8x8x0.500"},{"$f":"+HSS_Member!B6","v":"HSS 500, Gr. C"}]
[null," ",null,"Mnx",{"$f":"MIN(E13:E14,IF(HSS_Member!B5 = \"Square\",C77,100000))","v":156.25},"kip-ft"]
[null,null,null,"ɸbMnx",{"$f":"phi_b*E7","v":140.625},"kip-ft"]
[null,null,null,"Mny",{"$f":"MIN(E16:E17)","v":156.25},"kip-ft"]
[null,null,null,"ɸbMny",{"$f":"phi_b*E9","v":140.625},"kip-ft"]
[]
["For X-axis bending:",null,null,"X-axis:"]
["Flanges:",{"$f":"+HSS_Section_Properties!C42","v":"Compact"},null,"Flange:",{"$f":"IF($B$13=\"Compact\",$C$22,IF($B$13 = \"Noncompact\",$C$36,IF($B$13 = \"Slender\",$C$41)))","v":156.25},"kip-ft"]
["Web:",{"$f":"+HSS_Section_Properties!C57","v":"Compact"},null,"Web:",{"$f":"IF(B14= \"Compact\",\"NA\",C54)","v":"NA"},"kip-ft"]
["For Y-axis bending:",null,null,"Y-axis:"]
["Flanges:",{"$f":"+HSS_Section_Properties!G42","v":"Compact"},null,"Flange:",{"$f":"IF(B16=\"Compact\",F22,IF(B16 = \"Noncompact\",F36,IF(B16= \"Slender\",F41)))","v":156.25},"kip-ft"]
["Web:",{"$f":"+HSS_Section_Properties!G57","v":"Compact"},null,"Web:",{"$f":"IF(B17=\"Compact\", \"NA\",F54)","v":"NA"},"kip-ft"]
[]
["F7. Square and Rectangular HSS and Box-shaped members"]
[null,"X - axis bending",null,null,null,"Y - axis bending"]
["1. Yielding",null," "]
[null,"Mn = Mp = FyZ",{"$f":"Fy*Zx/12","v":156.25},"kip-ft",null,{"$f":"Fy*Zy/12","v":156.25},"kip-ft","F7-1",null,null," "]
[]
["2. Flange Local Buckling"]
[null,"Flanges are:",{"$f":"+HSS_Section_Properties!C42","v":"Compact"},null,null,{"$f":"+HSS_Section_Properties!G42","v":"Compact"}]
["    (a) For compact section, the limit state of flange local buckling does not apply."]
[]
["    (b)For sections with noncompact flanges:"]
[null,null,null,"Mn = Mp - (Mp - FyS)*[(λ - λpf)/(λrf-λpf)] <= Mp",null,null,null,"F7-2"]
[null,"(Mp - FySx)",{"$f":"+$C$22-Fy*Sx/12","v":26.25},"kip-ft",null,{"$f":"+$F$22-Fy*Sy/12","v":26.25},"kip-ft",null," "]
[null,"λ",{"$f":"+HSS_Section_Properties!C39","v":14.2},null,null,{"$f":"+HSS_Section_Properties!G39","v":14.2}]
[null,"λpf",{"$f":"+HSS_Section_Properties!C40","v":26.973171856494744},null,null,{"$f":"+HSS_Section_Properties!G40","v":26.973171856494744}]
[null,"λrf",{"$f":"+HSS_Section_Properties!C41","v":33.716464820618427},null,null,{"$f":"+HSS_Section_Properties!G41","v":33.716464820618427}]
[null,"(λ - λpf)/(λrf-λpf)",{"$f":"+(C31-C32)/(C33-C32)","v":-1.8942039037087377},null,null,{"$f":"+(F31-F32)/(F33-F32)","v":-1.8942039037087377}]
[null," (Mp - FyS)*[(λ - λpf)/(λrf-λpf)]",{"$f":"+C30*C34","v":-49.722852472354361},null,null,{"$f":"+F30*F34","v":-49.722852472354361}]
[null,"Mn",{"$f":"$C$22-$C$35","v":205.97285247235436},"kip-ft",null,{"$f":"$F$22-$F$35","v":205.97285247235436},"kip-ft"]
[]
["     (c) For sections with slender flanges:"]
[" ","Mn = FySe",null,null,null,null,null,"F7-3"]
[null,"Se",{"$f":"+HSS_Section_Properties!C83","v":31.552560045225263},"in^3",null,{"$f":"+HSS_Section_Properties!C98","v":31.552560045225263},"in^3"," "]
[null,"Mn",{"$f":"+Fy*C40/12","v":131.4690001884386},"kip-ft",null,{"$f":"+Fy*F40/12","v":131.4690001884386},"kip-ft"," "]
[]
["3. Web Local Buckling"]
[null,"Web is:",{"$f":"+HSS_Section_Properties!C57","v":"Compact"},null,null,{"$f":"+HSS_Section_Properties!G57","v":"Compact"}]
["     (a) For compact sections, the limit state of web local buckling does not apply."]
[]
["     (b) Non-compact web"]
[null,null,null,"Mn = Mp - (Mp - FyS)*[(λ - λpw)/(λrw-λpw)] <= Mp",null,null,null,"F7-6"]
[null,"(Mp - FyS)",{"$f":"+C22-Fy*Sx/12","v":26.25},"kip-ft",null,{"$f":"+F22-Fy*Sy/12","v":26.25},"kip-ft"]
[null,"λ",{"$f":"+HSS_Section_Properties!C54","v":14.2},null,null,{"$f":"+HSS_Section_Properties!G54","v":14.2}]
[null,"λpw",{"$f":"+HSS_Section_Properties!C55","v":58.281317761354707},null,null,{"$f":"+HSS_Section_Properties!G55","v":58.281317761354707}]
[null,"λrw",{"$f":"+HSS_Section_Properties!C56","v":137.27417819823216},null,null,{"$f":"+HSS_Section_Properties!G56","v":137.27417819823216}]
[null,"(λ - λpw)/(λrf-λpw)",{"$f":"+(C50-C51)/(C52-C51)","v":-0.55804179665806286},null,null,{"$f":"+(F50-F51)/(F52-F51)","v":-0.55804179665806286}]
[null,"Mn",{"$f":"+($C$22-C49*C53)","v":170.89859716227414},"kip-ft",null,{"$f":"+($F$22-F49*F53)","v":170.89859716227414},"kip-ft"]
[]
[]
["     (c) Slender webs and compact or noncompact flanges"]
[null,"User Note states that there are no HSS section with slender webs, so F7-7 cannot apply."]
[]
["4. Lateral-Torsional Buckling"]
["     (a) When Lb <= Lp, the limit state of lateral-torsional buckling does not apply."]
[]
["     (b) When Lp < Lb <= Lr"]
[null,null,null,"Mn = Cb[Mp - (Mp - 0.7FySx)((Lb - Lp)/(Lr - Lp))] <= Mp",null,null,null,"F7-8"]
[null,"(Lb - Lp)/(Lr - Lp)",{"$f":"(Lb-Lp)/(Lr - Lp)","v":-9.9073290764353089E-3}]
[null,"Mp - 0.7FySx",{"$f":"C22-0.7*Fy*Sx/12","v":65.25},"kip-ft"]
[null,"Cb",{"$f":"IF(HSS_Member!H30<>0,HSS_Member!H30, HSS_Member!H31)","v":1}]
[null,"Mn = Cb*(Mp - (Mp -0.7FySx)((Lb - Lp/(Lr - Lp))",{"$f":"C67*(C22-C66*C65)","v":156.8964532222374},"kip-ft",null,null,null,"F7-8"]
[]
["     (c) When Lb > Lr"]
[null,null,null,"Mn = 2ECbsqrt(JArea)/(Lb/ry) =< Mp",null,null,null,"F7-9"]
[null,"sqrt(J*Area)",{"$f":"SQRT(j*area)","v":52.478567053607705},"in^3"]
[null,"Lb/ry",{"$f":"12*Lb/ry","v":78.94736842105263},null," "]
[null,"sqrt(J*area)/(Lb/ry)",{"$f":"+C72/C73","v":0.66472851601236427},"in^3"]
[null,"2ECb",{"$f":"2*E*C67","v":58000},"ksi"]
[null,"Mn = 2ECbsqrt(J*Area)/(Lb/ry) =< Mp",{"$f":"+C75*C74","v":38554.253928717124},"kip-ft",null,null,null,"F7-9"]
[null,"Mn based on Lb",{"$f":"IF(Lb<=Lp, \"NA\",IF(Lb<=Lr,C68,C76))","v":"NA"},"kip-ft"]

{"sheet":"HSS_Tension,_Shear","index":5,"n_rows":34,"n_cols":9,"rows_kept":34,"cut":false,"hidden":false,"merged":[]}
[null,null,"HSS Sections - Rectangular and Square - LRFD",null,null,null,null,null,{"$f":"+HSS_Member!I1","v":"Ver. 2.0"}]
[" ",null,null,null,"AISC 360-22"]
[{"$f":"+HSS_Member!A3","v":"8x8x1/2 section"},null,null,null,{"$f":"+HSS_Member!E3","v":"Test section"},null,null,null,{"$f":"TODAY()","v":"2025-03-25"}]
[null,null,null," ",null," "]
["HSS Tension, Shear","ASTM"]
[{"$f":"+Member","v":"8x8x0.500"},{"$f":"+HSS_Member!B6","v":"HSS 500, Gr. C"}]
[]
[null,"Vnx",{"$f":"+C24","v":184.14},"kips"," TYn",{"$f":"+C30","v":675},"kips"]
[null,"ɸvVnx",{"$f":"+phi_v*C8","v":165.726},"kips","ɸtTYn",{"$f":"+phi_t*F8","v":607.5},"kips"]
[null,"Vny",{"$f":"+E24","v":184.14},"kips","TUn",{"$f":"+C34","v":627.75},"kips"]
[null,"ɸvVny",{"$f":"phi_v*C10","v":165.726},"kips","ɸtuTUn",{"$f":"phi_tu*F10","v":470.8125},"kips"]
["Shear",null,null,null,null,null," "]
["Vn = 0.6FyAwCv2",null,null,null,null,null,"G4-1"]
[null,null,"X-axis",null,"Y-axis"]
[null,"Aw = 2ht",{"$f":"2*h*t","v":6.1379999999999999},"in^2",{"$f":"2*b*t","v":6.1379999999999999},"in^2"]
[null,"kv",5,null,5]
[null,"1.10sqrt(kvE/Fy)",{"$f":"1.1*SQRT($C$16*E/Fy)","v":59.236812878479547},null,{"$f":"+C17","v":59.236812878479547}]
[null,"1.37sqrt(kvE/Fy)",{"$f":"1.37*SQRT($C$16*E/Fy)","v":73.776757857742709},null,{"$f":"+C18","v":73.776757857742709}]
[null,"h/t",{"$f":"+h_t","v":14.2},null,{"$f":"+b_t","v":14.2}]
[null,"Cv2 = 1.0",1,null,{"$f":"+C20","v":1},null,"G2-9"]
[null,"Cv2 = 1.10sqrt(kvE/Fy)/(h/t)",{"$f":"+C17/C19","v":4.1716065407379963},null,{"$f":"1.1*SQRT(E16*E/Fy)/b_t","v":4.1716065407379963},null,"G2-10"]
[null,"Cv2 = 1.51KvE/((h/t)^2Fy)",{"$f":"1.51*C16*E/((C19)^2*Fy)","v":21.716921245784565},null,{"$f":"1.51*E16*E/((b_t)^2*Fy)","v":21.716921245784565},null,"G2-11"]
[null,"Cv2",{"$f":"IF(C19<=C17,C20,IF(C19<=C18,C21,C22))","v":1},null,{"$f":"IF(E19<=E17,E20,IF(E19<=E18,E21,E22))","v":1}," "]
[null,"Vn",{"$f":"0.6*Fy*C15*C23","v":184.14},"kips",{"$f":"0.6*Fy*E15*E23","v":184.14},"kips","G4-1"]
[]
[]
["Tension"]
["(a) Tensile yielding"]
["Pn = FyAg",null,null,null,null,null,"D2-1"]
[null,"Pn = FyAg",{"$f":"+Fy*area","v":675},"kips"]
[]
["(b) Tensile rupture"]
["Pn = FuAe"]
[null,"Pn = FuAe = Fu*0.75*Ag",{"$f":"+Fu*0.75*area","v":627.75},"kips"]

{"sheet":"HSS_Torsion_Calculations","index":6,"n_rows":22,"n_cols":9,"rows_kept":22,"cut":false,"hidden":false,"merged":[]}
[null,null,"HSS Sections - Rectangular and Square - LRFD",null,null,null,null,null,{"$f":"+HSS_Member!I1","v":"Ver. 2.0"}]
[" ",null,null,null,"AISC 360-22"]
[{"$f":"+HSS_Member!A3","v":"8x8x1/2 section"},null,null,null,{"$f":"+HSS_Member!E3","v":"Test section"},null,null,null,{"$f":"TODAY()","v":"2025-03-25"}]
[null,null,null," ",null," "]
["HSS Torsion Calculations"]
["Member","ASTM"]
[{"$f":"+Member","v":"8x8x0.500"},{"$f":"+HSS_Section_Properties!B6","v":"HSS 500, Gr. C"}]
[]
[]
[null,null,"TORn",{"$f":"+D22","v":131}]
[null,null,"ɸTTORn",{"$f":"phi_c*D10","v":117.9},"kips"]
[]
["1. Round and rectangular HSS subject to torsion"]
[null,"Tn = FcrC",null,null,null,null,"H3-1"]
[null,null,"C",{"$f":"+Cw","v":52.4},"in^3"]
[null,null,"2.45sqrt(E/Fy)",{"$f":"2.45*sqrtefy","v":59.003813436082254}]
[null,null,"3.07sqrt(E/Fy)",{"$f":"3.07*sqrtefy","v":73.935390713784699}]
[null,null,"0.6Fy ",{"$f":"0.6*Fy","v":30},"ksi",null,"H3-3"]
[null,null,"0.6Fy(2.45sqrt(E/Fy))/(h/t)",{"$f":"0.6*Fy*(2.45*sqrtefy)/h_t","v":124.65594387904702},"ksi",null,"H3-4"]
[null,null,"0.458π^2E/(h/t)^2",{"$f":"0.458*pi^2*E/(h/t)^2","v":650.69957386696228},"ksi",null,"H3-5"]
[null,null,"Fcr",{"$f":"IF(h_t<=D16,D18,IF(h_t<=D17,D19,IF(h_t<=260,D20,\"Error\")))","v":30},"ksi"]
[null,null,"Tn",{"$f":"+D21*D15/12","v":131},"kip-ft"]

{"sheet":"HSS500_Database","index":7,"n_rows":529,"n_cols":33,"rows_kept":529,"cut":false,"hidden":false,"merged":[]}
["Type","EDI_Std_Nomenclature","AISC_Manual_Label",null,null,null,null,3,null,null,null,null," ","W","A","Ht","h","B","b","tnom","tdes","b/tdes","h/tdes","Ix","Zx","Sx","rx","Iy","Zy","Sy","ry","J","C"]
[null,null,null,"hss_hss","Size","Thickness","Unique","Member","Thickness","Different","t start row","t end row","Sq/Rect","weight","area","depth","h","width","b","tnom","tdes","b_t","h_t","Ix","Zx","Sx","rx","Iy","Zy","Sy","ry","J","C"]
[null,null,null,"Strip HSS",null,null,"sizes",null,null,"thicknesses",null,null,null,"lbs/ft^2","in^2","in","in","in","in","in","in",null,null,"in^4","in^4","in^3","in","in^4","in^4","in^3","in","in^4","in^6"]
["HSS","HSS34x10x1","HSS34x10x1","34x10x1","34x10","1","34x10","22x22",null,4,4,7,"Rectangle",277.07,76.2,34,31.2,10,"7.21",1,0.93,7.75,33.6,9600,750,565,11.2,1340,307,268,4.1900000000000004,4040,555]
["HSS","HSS34x10x0.875","HSS34x10x7/8","34x10x0.875","34x10","0.875","30x10","20x20",null,5,8,12,"Rectangle",244.88,67.3,34,31.6,10,"7.56",0.875,0.81399999999999995,9.2899999999999991,38.799999999999997,8600,668,506,11.3,1210,274,242,4.24,3630,494]
["HSS","HSS34x10x0.750","HSS34x10x3/4","34x10x0.750","34x10","0.750","24x20","18x18",null,5,13,17,"Rectangle",212,58.2,34,31.9,10,"7.91",0.75,0.69799999999999995,11.3,45.7,7550,582,444,11.4,1070,240,215,4.29,3190,431]
["HSS","HSS34x10x0.625","HSS34x10x5/8","34x10x0.625","34x10","0.625","24x18","16x16",null,5,18,22,"Rectangle",178.41,48.9,34,32.299999999999997,10,"8.26",0.625,0.58099999999999996,14.2,55.5,6430,493,378,11.5,924,205,185,4.3499999999999996,2720,365]
["HSS","HSS30x10x1","HSS30x10x1","30x10x1","30x10","1","24x16","14x14",null,5,23,27,"Rectangle",249.85,68.7,30,27.2,10,"7.21",1,0.93,7.75,29.3,6900,606,460,10,1180,273,237,4.1500000000000004,3460,487]
["HSS","HSS30x10x0.875","HSS30x10x7/8","30x10x0.875","30x10","0.875","24x14","12x12",null,6,28,33,"Rectangle",221.06,60.8,30,27.6,10,"7.56",0.875,0.81399999999999995,9.2899999999999991,33.9,6190,540,413,10.1,1070,245,215,4.2,3110,434]
["HSS","HSS30x10x0.750","HSS30x10x3/4","30x10x0.750","30x10","0.750","24x12","10x10",null,8,34,41,"Rectangle",191.58,52.6,30,27.9,10,"7.91",0.75,0.69799999999999995,11.3,40,5440,471,363,10.199999999999999,952,215,190,4.25,2730,379]
["HSS","HSS30x10x0.625","HSS30x10x5/8","30x10x0.625","30x10","0.625","24x8","9x9",null,4,42,45,"Rectangle",161.4,44.3,30,28.3,10,"8.26",0.625,0.58099999999999996,14.2,48.6,4640,400,310,10.199999999999999,820,183,164,4.3099999999999996,2330,321]
["HSS","HSS30x10x0.500","HSS30x10x1/2","30x10x0.500","30x10","0.500","22x20","8x8",null,5,46,50,"Rectangle",130.52000000000001,35.799999999999997,30,28.6,10,"8.61",0.5,0.46500000000000002,18.5,61.5,3810,326,254,10.3,679,149,136,4.3600000000000003,1910,262]
["HSS","HSS24x20x0.750","HSS24x20x3/4","24x20x0.750","24x20","0.750","22x18","7x7",null,5,51,55,"Rectangle",212,58.2,24,21.9,20,"17.9",0.75,0.69799999999999995,25.7,31.4,4960,489,413,9.23,3750,432,375,8.02,6740,627]
["HSS","HSS24x20x0.625","HSS24x20x5/8","24x20x0.625","24x20","0.625","22x16","6x6",null,6,56,61,"Rectangle",178.41,48.9,24,22.3,20,"18.3",0.625,0.58099999999999996,31.4,38.299999999999997,4220,413,351,9.2899999999999991,3190,365,319,8.08,5690,528]
["HSS","HSS24x20x0.500","HSS24x20x1/2","24x20x0.500","24x20","0.500","22x14","5.5x5.5",null,6,62,67,"Rectangle",144.13,39.5,24,22.6,20,"18.6",0.5,0.46500000000000002,40,48.6,3450,336,287,9.34,2610,297,261,8.1300000000000008,4620,427]
["HSS","HSS24x20x0.375","HSS24x20x3/8","24x20x0.375","24x20","0.375","22x10","5x5",null,5,68,72,"Rectangle",109.15,29.9,24,23,20,"19.0",0.375,0.34899999999999998,54.3,65.8,2640,256,220,9.4,2000,226,200,8.19,3510,324]
["HSS","HSS24x20x0.313","HSS24x20x5/16","24x20x0.313","24x20","0.313","20x16","4.5x4.5",null,6,73,78,"Rectangle",91.39,25.1,24,23.1,20,"19.1",0.3125,0.29099999999999998,65.7,79.5,2230,215,186,9.43,1690,190,169,8.2100000000000009,2950,272]
["HSS","HSS24x18x0.750","HSS24x18x3/4","24x18x0.750","24x18","0.750","20x12","4x4",null,7,79,85,"Rectangle",201.79,55.4,24,21.9,18,"15.9",0.75,0.69799999999999995,22.8,31.4,4580,456,382,9.09,2940,375,327,7.29,5690,562]
["HSS","HSS24x18x0.625","HSS24x18x5/8","24x18x0.625","24x18","0.625","20x8","3.5x3.5",null,7,86,92,"Rectangle",169.91,46.6,24,22.3,18,"16.3",0.625,0.58099999999999996,28,38.299999999999997,3900,386,325,9.15,2510,318,279,7.34,4810,473]
["HSS","HSS24x18x0.500","HSS24x18x1/2","24x18x0.500","24x18","0.500","20x6","3x3",null,5,93,97,"Rectangle",137.32,37.6,24,22.6,18,"16.6",0.5,0.46500000000000002,35.700000000000003,48.6,3190,314,266,9.2100000000000009,2060,258,229,7.39,3910,383]
["HSS","HSS24x18x0.375","HSS24x18x3/8","24x18x0.375","24x18","0.375","20x4","2.5x2.5",null,4,98,101,"Rectangle",104.04,28.5,24,23,18,"17.0",0.375,0.34899999999999998,48.6,65.8,2450,240,204,9.27,1580,197,176,7.45,2970,291]
["HSS","HSS24x18x0.313","HSS24x18x5/16","24x18x0.313","24x18","0.313","18x10","2.25x2.25",null,5,102,106,"Rectangle",87.14,23.9,24,23.1,18,"17.1",0.3125,0.29099999999999998,58.9,79.5,2060,201,172,9.3000000000000007,1330,166,148,7.47,2500,244]
["HSS","HSS24x16x0.750","HSS24x16x3/4","24x16x0.750","24x16","0.750","18x8","2x2",null,5,107,111,"Rectangle",191.58,52.6,24,21.9,16,"13.9",0.75,0.69799999999999995,19.899999999999999,31.4,4200,424,350,8.93,2250,321,281,6.53,4680,496]
["HSS","HSS24x16x0.625","HSS24x16x5/8","24x16x0.625","24x16","0.625","18x6","1.5x1.5",null,6,112,117,"Rectangle",161.4,44.3,24,22.3,16,"14.3",0.625,0.58099999999999996,24.5,38.299999999999997,3580,359,298,8.99,1920,272,240,6.59,3960,419]
["HSS","HSS24x16x0.500","HSS24x16x1/2","24x16x0.500","24x16","0.500","16x12",null,null,7,118,124,"Rectangle",130.52000000000001,35.799999999999997,24,22.6,16,"14.6",0.5,0.46500000000000002,31.4,48.6,2930,292,244,9.0500000000000007,1580,222,197,6.64,3220,340]
["HSS","HSS24x16x0.375","HSS24x16x3/8","24x16x0.375","24x16","0.375","16x10",null,null,5,125,129,"Rectangle",98.94,27.1,24,23,16,"15.0",0.375,0.34899999999999998,42.8,65.8,2250,223,188,9.1199999999999992,1210,169,152,6.69,2460,258]
["HSS","HSS24x16x0.313","HSS24x16x5/16","24x16x0.313","24x16","0.313","16x8",null,null,7,130,136,"Rectangle",82.88,22.7,24,23.1,16,"15.1",0.3125,0.29099999999999998,52,79.5,1900,188,158,9.15,1030,143,128,6.72,2070,217]
["HSS","HSS24x14x0.750","HSS24x14x3/4","24x14x0.750","24x14","0.750","16x6",null,null,6,137,142,"Rectangle",181.37,49.8,24,21.9,14,"11.9",0.75,0.69799999999999995,17.100000000000001,31.4,3820,391,318,8.76,1660,270,237,5.77,3730,431]
["HSS","HSS24x14x0.625","HSS24x14x5/8","24x14x0.625","24x14","0.625","16x4",null,null,6,143,148,"Rectangle",152.89000000000001,41.9,24,22.3,14,"12.3",0.625,0.58099999999999996,21.1,38.299999999999997,3260,332,272,8.82,1420,229,203,5.82,3170,364]
["HSS","HSS24x14x0.500","HSS24x14x1/2","24x14x0.500","24x14","0.500","14x12",null,null,5,149,153,"Rectangle",123.71000000000001,33.9,24,22.6,14,"12.6",0.5,0.46500000000000002,27.1,48.6,2680,270,223,8.8800000000000008,1170,187,167,5.87,2580,296]
["HSS","HSS24x14x0.375","HSS24x14x3/8","24x14x0.375","24x14","0.375","14x10",null,null,7,154,160,"Rectangle",93.83,25.7,24,23,14,"13.0",0.375,0.34899999999999998,37.1,65.8,2060,207,171,8.94,902,143,129,5.92,1970,225]
["HSS","HSS24x14x0.313","HSS24x14x5/16","24x14x0.313","24x14","0.313","14x8",null,null,6,161,166,"Rectangle",78.63,21.6,24,23.1,14,"13.1",0.3125,0.29099999999999998,45.1,79.5,1740,174,145,8.98,763,120,109,5.95,1660,189]
["HSS","HSS24x14x0.250","HSS24x14x1/4","24x14x0.250","24x14","0.250","14x6",null,null,6,167,172,"Rectangle",63.25,17.399999999999999,24,23.3,14,"13.3",0.25,0.23300000000000001,57.1,100,1410,140,117,9.01,619,97.4,88.5,5.98,1340,152]
["HSS","HSS24x12x1","HSS24x12x1","24x12x1","24x12","1","14x4",null,null,6,173,178,"Rectangle",222.63,61.3,24,21.2,12,"9.21",1,0.93,9.9,22.8,4340,459,362,8.42,1460,282,243,4.88,3630,472]
["HSS","HSS24x12x0.875","HSS24x12x7/8","24x12x0.875","24x12","0.875","12x10",null,null,6,179,184,"Rectangle",197.24,54.3,24,21.6,12,"9.56",0.875,0.81399999999999995,11.7,26.5,3910,410,326,8.49,1320,252,220,4.93,3250,420]
["HSS","HSS24x12x0.750","HSS24x12x3/4","24x12x0.750","24x12","0.750","12x8",null,null,6,185,190,"Rectangle",171.16,47.1,24,21.9,12,9.91,0.75,0.69799999999999995,14.2,31.4,3440,359,287,8.5500000000000007,1170,221,195,4.9800000000000004,2850,366]
["HSS","HSS24x12x0.625","HSS24x12x5/8","24x12x0.625","24x12","0.625","12x6",null,null,6,191,196,"Rectangle",144.38999999999999,39.6,24,22.3,12,10.3,0.625,0.58099999999999996,17.7,38.4,2940,304,245,8.6199999999999992,1000,188,167,5.03,2430,310]
["HSS","HSS24x12x0.500","HSS24x12x1/2","24x12x0.500","24x12","0.500","12x4",null,null,6,197,202,"Rectangle",116.91,32.1,24,22.6,12,10.6,0.5,0.46500000000000002,22.8,48.6,2420,248,202,8.68,829,154,138,5.08,1980,252]
["HSS","HSS24x12x0.375","HSS24x12x3/8","24x12x0.375","24x12","0.375","12x3",null,null,3,203,205,"Rectangle",88.73,24.3,24,23,12,"11.0",0.375,0.34899999999999998,31.4,65.8,1860,190,155,8.75,642,118,107,5.14,1520,192]
["HSS","HSS24x12x0.313","HSS24x12x5/16","24x12x0.313","24x12","0.313","12x2",null,null,3,206,208,"Rectangle",74.38,20.399999999999999,24,23.1,12,"11.1",0.3125,0.29099999999999998,38.200000000000003,79.5,1570,160,131,8.7799999999999994,543,99.4,90.6,5.16,1280,161]
["HSS","HSS24x12x0.250","HSS24x12x1/4","24x12x0.250","24x12","0.250","10x8",null,null,6,209,214,"Rectangle",59.85,16.399999999999999,24,23.3,12,"11.3",0.25,0.23300000000000001,48.5,100,1280,129,106,8.82,442,80.5,73.599999999999994,5.19,1030,130]
["HSS","HSS24x8x0.500","HSS24x8x1/2","24x8x0.500","24x8","0.500","10x6",null,null,6,215,220,"Rectangle",103.3,28.3,24,22.6,8,"6.61",0.5,0.46500000000000002,14.2,48.6,1900,205,159,8.19,336,93.5,84,3.44,955,165]
["HSS","HSS24x8x0.375","HSS24x8x3/8","24x8x0.375","24x8","0.375","10x5",null,null,3,221,223,"Rectangle",78.52,21.5,24,23,8,"6.95",0.375,0.34899999999999998,19.899999999999999,65.8,1470,157,123,8.27,263,72.2,65.8,3.5,739,126]
["HSS","HSS24x8x0.313","HSS24x8x5/16","24x8x0.313","24x8","0.313","10x4",null,null,7,224,230,"Rectangle",65.87,18.100000000000001,24,23.1,8,"7.13",0.3125,0.29099999999999998,24.5,79.5,1250,132,104,8.3000000000000007,224,61,56,3.52,625,106]
["HSS","HSS24x8x0.250","HSS24x8x1/4","24x8x0.250","24x8","0.250","10x3.5",null,null,4,231,234,"Rectangle",53.050000000000004,14.6,24,23.3,8,"7.30",0.25,0.23300000000000001,31.3,100,1010,107,84.4,8.34,183,49.5,45.8,3.55,508,86]
["HSS","HSS22x20x0.750","HSS22x20x3/4","22x20x0.750","22x20","0.750","10x3",null,null,5,235,239,"Rectangle",201.79,55.4,22,19.899999999999999,20,"17.9",0.75,0.69799999999999995,25.7,28.5,4040,432,367,8.5399999999999991,3490,405,349,7.93,5920,573]
["HSS","HSS22x20x0.625","HSS22x20x5/8","22x20x0.625","22x20","0.625","10x2",null,null,5,240,244,"Rectangle",169.91,46.6,22,20.3,20,"18.3",0.625,0.58099999999999996,31.4,34.9,3440,366,313,8.59,2970,343,297,7.99,5000,483]
["HSS","HSS22x20x0.500","HSS22x20x1/2","22x20x0.500","22x20","0.500","9x7",null,null,6,245,250,"Rectangle",137.32,37.6,22,20.6,20,"18.6",0.5,0.46500000000000002,40,44.3,2820,297,256,8.65,2440,279,244,8.0399999999999991,4060,391]
["HSS","HSS22x20x0.375","HSS22x20x3/8","22x20x0.375","22x20","0.375","9x5",null,null,6,251,256,"Rectangle",104.04,28.5,22,21,20,"19.0",0.375,0.34899999999999998,54.3,60,2160,227,196,8.7100000000000009,1870,213,187,8.1,3090,297]
["HSS","HSS22x20x0.313","HSS22x20x5/16","22x20x0.313","22x20","0.313","9x3",null,null,5,257,261,"Rectangle",87.14,23.9,22,21.1,20,"19.1",0.3125,0.29099999999999998,65.7,72.599999999999994,1820,191,166,8.73,1580,179,158,8.1300000000000008,2590,249]
["HSS","HSS22x18x0.750","HSS22x18x3/4","22x18x0.750","22x18","0.750","8x6",null,null,6,262,267,"Rectangle",191.58,52.6,22,19.899999999999999,18,"15.9",0.75,0.69799999999999995,22.8,28.5,3720,402,338,8.41,2730,351,304,7.21,5000,513]
["HSS","HSS22x18x0.625","HSS22x18x5/8","22x18x0.625","22x18","0.625","8x4",null,null,7,268,274,"Rectangle",161.4,44.3,22,20.3,18,"16.3",0.625,0.58099999999999996,28,34.9,3170,341,288,8.4700000000000006,2330,297,259,7.26,4230,433]
["HSS","HSS22x18x0.500","HSS22x18x1/2","22x18x0.500","22x18","0.500","8x3",null,null,6,275,280,"Rectangle",130.52000000000001,35.799999999999997,22,20.6,18,"16.6",0.5,0.46500000000000002,35.700000000000003,44.3,2600,277,236,8.52,1910,242,213,7.31,3440,351]
["HSS","HSS22x18x0.375","HSS22x18x3/8","22x18x0.375","22x18","0.375","8x2",null,null,6,281,286,"Rectangle",98.94,27.1,22,21,18,"17.0",0.375,0.34899999999999998,48.6,60,2000,212,182,8.58,1470,185,164,7.37,2620,267]
["HSS","HSS22x18x0.313","HSS22x18x5/16","22x18x0.313","22x18","0.313","7x5",null,null,6,287,292,"Rectangle",82.88,22.7,22,21.1,18,"17.1",0.3125,0.29099999999999998,58.9,72.599999999999994,1680,178,153,8.61,1240,156,138,7.4,2200,224]
["HSS","HSS22x16x0.750","HSS22x16x3/4","22x16x0.750","22x16","0.750","7x4",null,null,6,293,298,"Rectangle",181.37,49.8,22,19.899999999999999,16,"13.9",0.75,0.69799999999999995,19.899999999999999,28.5,3400,372,309,8.26,2080,300,260,6.47,4130,454]
["HSS","HSS22x16x0.625","HSS22x16x5/8","22x16x0.625","22x16","0.625","7x3",null,null,6,299,304,"Rectangle",152.89000000000001,41.9,22,20.3,16,"14.3",0.625,0.58099999999999996,24.5,34.9,2910,316,264,8.32,1780,254,223,6.52,3500,383]
["HSS","HSS22x16x0.500","HSS22x16x1/2","22x16x0.500","22x16","0.500","7x2",null,null,3,305,307,"Rectangle",123.71000000000001,33.9,22,20.6,16,"14.6",0.5,0.46500000000000002,31.4,44.3,2380,257,217,8.3800000000000008,1470,207,183,6.57,2850,311]
["HSS","HSS22x16x0.375","HSS22x16x3/8","22x16x0.375","22x16","0.375","6x5",null,null,6,308,313,"Rectangle",93.83,25.7,22,21,16,"15.0",0.375,0.34899999999999998,42.8,60,1830,197,167,8.44,1130,159,141,6.63,2170,236]
["HSS","HSS22x16x0.313","HSS22x16x5/16","22x16x0.313","22x16","0.313","6x4",null,null,6,314,319,"Rectangle",78.63,21.6,22,21.1,16,"15.1",0.3125,0.29099999999999998,52,72.599999999999994,1550,165,141,8.4700000000000006,954,133,119,6.65,1830,198]
["HSS","HSS22x16x0.250","HSS22x16x1/4","22x16x0.250","22x16","0.250","6x3",null,null,6,320,325,"Rectangle",63.25,17.399999999999999,22,21.3,16,"15.3",0.25,0.23300000000000001,65.7,91.4,1250,134,114,8.5,774,108,96.7,6.68,1470,160]
["HSS","HSS22x14x0.750","HSS22x14x3/4","22x14x0.750","22x14","0.750","6x2",null,null,5,326,330,"Rectangle",171.16,47.1,22,19.899999999999999,14,"11.9",0.75,0.69799999999999995,17.100000000000001,28.5,3090,343,281,8.1,1530,251,219,5.71,3300,394]
["HSS","HSS22x14x0.625","HSS22x14x5/8","22x14x0.625","22x14","0.625","5x4",null,null,6,331,336,"Rectangle",144.39000000000001,39.6,22,20.3,14,"12.3",0.625,0.58099999999999996,21.1,34.9,2640,291,240,8.16,1320,213,188,5.76,2800,333]
["HSS","HSS22x14x0.500","HSS22x14x1/2","22x14x0.500","22x14","0.500","5x3",null,null,6,337,342,"Rectangle",116.91,32.1,22,20.6,14,"12.6",0.5,0.46500000000000002,27.1,44.3,2170,237,197,8.2200000000000006,1080,174,155,5.81,2290,271]
["HSS","HSS22x14x0.375","HSS22x14x3/8","22x14x0.375","22x14","0.375","5x2.5",null,null,3,343,345,"Rectangle",88.73,24.3,22,21,14,"13.0",0.375,0.34899999999999998,37.1,60,1670,182,152,8.2899999999999991,837,134,120,5.87,1750,206]
["HSS","HSS22x14x0.313","HSS22x14x5/16","22x14x0.313","22x14","0.313","5x2",null,null,5,346,350,"Rectangle",74.38,20.399999999999999,22,21.1,14,"13.1",0.3125,0.29099999999999998,45.1,72.599999999999994,1410,153,128,8.32,708,112,101,5.89,1470,173]
["HSS","HSS22x14x0.250","HSS22x14x1/4","22x14x0.250","22x14","0.250","4x3",null,null,5,351,355,"Rectangle",59.85,16.399999999999999,22,21.3,14,"13.3",0.25,0.23300000000000001,57.1,91.4,1140,123,104,8.35,575,90.9,82.2,5.92,1190,140]
["HSS","HSS22x10x0.625","HSS22x10x5/8","22x10x0.625","22x10","0.625","4x2.5",null,null,3,356,358,"Rectangle",127.37,35,22,20.3,10,"8.26",0.625,0.58099999999999996,14.2,34.9,2110,241,191,7.76,614,139,123,4.1900000000000004,1560,234]
["HSS","HSS22x10x0.500","HSS22x10x1/2","22x10x0.500","22x10","0.500","4x2",null,null,5,359,363,"Rectangle",103.3,28.3,22,20.6,10,"8.61",0.5,0.46500000000000002,18.5,44.3,1740,197,158,7.83,510,114,102,4.24,1280,191]
["HSS","HSS22x10x0.375","HSS22x10x3/8","22x10x0.375","22x10","0.375","4x1.5",null,null,3,364,366,"Rectangle",78.52,21.5,22,21,10,"8.95",0.375,0.34899999999999998,25.7,60,1340,151,122,7.9,397,87.7,79.400000000000006,4.29,986,146]
["HSS","HSS22x10x0.313","HSS22x10x5/16","22x10x0.313","22x10","0.313","3.5x2.5",null,null,5,367,371,"Rectangle",65.87,18.100000000000001,22,21.1,10,"9.13",0.3125,0.29099999999999998,31.4,72.599999999999994,1140,128,103,7.93,337,74,67.400000000000006,4.32,832,123]
["HSS","HSS22x10x0.250","HSS22x10x1/4","22x10x0.250","22x10","0.250","3.5x2",null,null,3,372,374,"Rectangle",53.050000000000004,14.6,22,21.3,10,"9.30",0.25,0.23300000000000001,39.9,91.4,923,103,83.9,7.96,275,60,55,4.34,674,99]
["HSS","HSS20x16x0.750","HSS20x16x3/4","20x16x0.750","20x16","0.750","3.5x1.5",null,null,3,375,377,"Rectangle",171.16,47.1,20,17.899999999999999,16,"13.9",0.75,0.69799999999999995,19.899999999999999,25.7,2710,324,271,7.59,1920,278,240,6.39,3590,411]
["HSS","HSS20x16x0.625","HSS20x16x5/8","20x16x0.625","20x16","0.625","3x2.5",null,null,4,378,381,"Rectangle",144.39000000000001,39.6,20,18.3,16,"14.3",0.625,0.58099999999999996,24.5,31.4,2320,275,232,7.65,1640,236,206,6.44,3040,347]
["HSS","HSS20x16x0.500","HSS20x16x1/2","20x16x0.500","20x16","0.500","3x2",null,null,4,382,385,"Rectangle",116.91,32.1,20,18.600000000000001,16,"14.6",0.5,0.46500000000000002,31.4,40,1900,224,190,7.7,1350,193,169,6.5,2480,282]
["HSS","HSS20x16x0.375","HSS20x16x3/8","20x16x0.375","20x16","0.375","3x1.5",null,null,3,386,388,"Rectangle",88.73,24.3,20,19,16,"15.0",0.375,0.34899999999999998,42.8,54.3,1470,172,147,7.76,1040,148,130,6.55,1890,215]
["HSS","HSS20x16x0.313","HSS20x16x5/16","20x16x0.313","20x16","0.313","3x1",null,null,2,389,390,"Rectangle",74.38,20.399999999999999,20,19.100000000000001,16,"15.1",0.3125,0.29099999999999998,52,65.7,1240,144,124,7.79,882,124,110,6.58,1590,180]
["HSS","HSS20x16x0.250","HSS20x16x1/4","20x16x0.250","20x16","0.250","2.5x2",null,null,3,391,393,"Rectangle",59.85,16.399999999999999,20,19.3,16,"15.3",0.25,0.23300000000000001,65.7,82.8,1000,117,100,7.82,716,100,89.5,6.6,1280,145]
["HSS","HSS20x12x1","HSS20x12x1","20x12x1","20x12","1","2.5x1.5",null,null,3,394,396,"Rectangle",195.4,53.8,20,17.2,12,"9.21",1,0.93,9.9,18.5,2740,344,274,7.14,1230,241,205,4.78,2820,390]
["HSS","HSS20x12x0.875","HSS20x12x7/8","20x12x0.875","20x12","0.875","2.5x1",null,null,2,397,398,"Rectangle",173.43,47.7,20,17.600000000000001,12,"9.56",0.875,0.81399999999999995,11.7,21.6,2480,308,248,7.2,1110,216,186,4.83,2530,347]
["HSS","HSS20x12x0.750","HSS20x12x3/4","20x12x0.750","20x12","0.750","2x1.5",null,null,2,399,400,"Rectangle",150.75,41.5,20,17.899999999999999,12,9.91,0.75,0.69799999999999995,14.2,25.6,2190,270,219,7.26,988,190,165,4.88,2220,303]
["HSS","HSS20x12x0.625","HSS20x12x5/8","20x12x0.625","20x12","0.625","2x1",null,null,2,401,402,"Rectangle",127.37,35,20,18.3,12,10.3,0.625,0.58099999999999996,17.7,31.4,1880,230,188,7.33,851,162,142,4.93,1890,257]
["HSS","HSS20x12x0.500","HSS20x12x1/2","20x12x0.500","20x12","0.500",null,null,null,null,null,null,"Rectangle",103.3,28.3,20,18.600000000000001,12,10.6,0.5,0.46500000000000002,22.8,40,1550,188,155,7.39,705,132,117,4.99,1540,209]
["HSS","HSS20x12x0.375","HSS20x12x3/8","20x12x0.375","20x12","0.375",null,null,null,null,null,null,"Rectangle",78.52,21.5,20,19,12,11,0.375,0.34899999999999998,31.4,54.3,1200,144,120,7.45,547,102,91.1,5.04,1180,160]
["HSS","HSS20x12x0.313","HSS20x12x5/16","20x12x0.313","20x12","0.313",null,null,null,null,null,null,"Rectangle",65.87,18.100000000000001,20,19.100000000000001,12,11.1,0.3125,0.29099999999999998,38.200000000000003,65.7,1010,122,101,7.48,464,85.8,77.3,5.07,997,134]
["HSS","HSS20x8x1","HSS20x8x1","20x8x1","20x8","1",null,null,null,null,null,null,"Rectangle",168.18,46.4,20,17.2,8,"5.21",1,0.93,5.6,18.5,2060,273,206,6.67,472,141,118,3.19,1320,248]
["HSS","HSS20x8x0.875","HSS20x8x7/8","20x8x0.875","20x8","0.875",null,null,null,null,null,null,"Rectangle",149.61000000000001,41.2,20,17.600000000000001,8,"5.56",0.875,0.81399999999999995,6.83,21.6,1880,246,188,6.74,432,127,108,3.24,1200,222]
["HSS","HSS20x8x0.750","HSS20x8x3/4","20x8x0.750","20x8","0.750",null,null,null,null,null,null,"Rectangle",130.33000000000001,35.9,20,17.899999999999999,8,"5.91",0.75,0.69799999999999995,8.4600000000000009,25.7,1670,216,167,6.82,388,112,97.1,3.29,1060,195]
["HSS","HSS20x8x0.625","HSS20x8x5/8","20x8x0.625","20x8","0.625",null,null,null,null,null,null,"Rectangle",110.36,30.3,20,18.3,8,6.26,0.625,0.58099999999999996,10.8,31.4,1440,185,144,6.89,338,96.4,84.6,3.34,916,167]
["HSS","HSS20x8x0.500","HSS20x8x1/2","20x8x0.500","20x8","0.500",null,null,null,null,null,null,"Rectangle",89.68,24.6,20,18.600000000000001,8,6.6,0.5,0.46500000000000002,14.2,40,1190,152,119,6.96,283,79.5,70.8,3.39,757,137]
["HSS","HSS20x8x0.375","HSS20x8x3/8","20x8x0.375","20x8","0.375",null,null,null,null,null,null,"Rectangle",68.31,18.7,20,19,8,6.95,0.375,0.34899999999999998,19.899999999999999,54.3,926,117,92.6,7.03,222,61.5,55.6,3.44,586,105]
["HSS","HSS20x8x0.313","HSS20x8x5/16","20x8x0.313","20x8","0.313",null,null,null,null,null,null,"Rectangle",57.36,15.7,20,19.100000000000001,8,7.13,0.3125,0.29099999999999998,24.5,65.7,786,98.6,78.599999999999994,7.07,189,52,47.4,3.47,496,88.3]
["HSS","HSS20x6x0.625","HSS20x6x5/8","20x6x0.625","20x6","0.625",null,null,null,null,null,null,"Rectangle",101.85000000000001,28,20,18.3,6,"4.26",0.625,0.58099999999999996,7.33,31.4,1220,162,122,6.6,175,67.3,58.4,2.5,528,122]
["HSS","HSS20x6x0.500","HSS20x6x1/2","20x6x0.500","20x6","0.500",null,null,null,null,null,null,"Rectangle",82.88,22.8,20,18.600000000000001,6,"4.61",0.5,0.46500000000000002,9.9,40,1020,134,102,6.68,148,55.8,49.4,2.5499999999999998,441,100]
["HSS","HSS20x6x0.375","HSS20x6x3/8","20x6x0.375","20x6","0.375",null,null,null,null,null,null,"Rectangle",63.21,17.3,20,19,6,"4.95",0.375,0.34899999999999998,14.2,54.3,792,103,79.2,6.76,118,43.4,39.200000000000003,2.6,345,77.3]
["HSS","HSS20x6x0.313","HSS20x6x5/16","20x6x0.313","20x6","0.313",null,null,null,null,null,null,"Rectangle",53.11,14.6,20,19.100000000000001,6,"5.13",0.3125,0.29099999999999998,17.600000000000001,65.7,673,87.1,67.3,6.79,101,36.9,33.6,2.63,293,65.400000000000006]
["HSS","HSS20x6x0.250","HSS20x6x1/4","20x6x0.250","20x6","0.250",null,null,null,null,null,null,"Rectangle",42.84,11.8,20,19.3,6,"5.30",0.25,0.23300000000000001,22.8,82.8,549,70.7,54.9,6.83,82.9,30,27.6,2.66,240,53.1]
["HSS","HSS20x4x0.500","HSS20x4x1/2","20x4x0.500","20x4","0.500",null,null,null,null,null,null,"Rectangle",76.069999999999993,20.9,20,18.600000000000001,4,2.6,0.5,0.46500000000000002,5.6,40,838,115,83.8,6.33,58.7,34,29.3,1.68,195,63.8]
["HSS","HSS20x4x0.375","HSS20x4x3/8","20x4x0.375","20x4","0.375",null,null,null,null,null,null,"Rectangle",58.1,16,20,19,4,2.95,0.375,0.34899999999999998,8.4600000000000009,54.3,657,89.3,65.7,6.42,47.6,26.8,23.8,1.73,156,49.9]
["HSS","HSS20x4x0.313","HSS20x4x5/16","20x4x0.313","20x4","0.313",null,null,null,null,null,null,"Rectangle",48.86,13.4,20,19.100000000000001,4,3.13,0.3125,0.29099999999999998,10.7,65.7,560,75.599999999999994,56,6.46,41.2,22.9,20.6,1.75,134,42.4]
["HSS","HSS20x4x0.250","HSS20x4x1/4","20x4x0.250","20x4","0.250",null,null,null,null,null,null,"Rectangle",39.43,10.8,20,19.3,4,3.3,0.25,0.23300000000000001,14.2,82.8,458,61.5,45.8,6.5,34.299999999999997,18.7,17.100000000000001,1.78,111,34.700000000000003]
["HSS","HSS18x10x0.625","HSS18x10x5/8","18x10x0.625","18x10","0.625",null,null,null,null,null,null,"Rectangle",110.36,30.3,18,16.3,10,"8.26",0.625,0.58099999999999996,14.2,28,1280,176,142,6.49,511,117,102,4.0999999999999996,1190,190]
["HSS","HSS18x10x0.500","HSS18x10x1/2","18x10x0.500","18x10","0.500",null,null,null,null,null,null,"Rectangle",89.68,24.6,18,16.600000000000001,10,"8.61",0.5,0.46500000000000002,18.5,35.700000000000003,1060,144,117,6.55,425,96.2,85,4.16,977,155]
["HSS","HSS18x10x0.375","HSS18x10x3/8","18x10x0.375","18x10","0.375",null,null,null,null,null,null,"Rectangle",68.31,18.7,18,17,10,"8.95",0.375,0.34899999999999998,25.7,48.6,820,111,91.1,6.61,332,74.2,66.400000000000006,4.21,752,119]
["HSS","HSS18x10x0.313","HSS18x10x5/16","18x10x0.313","18x10","0.313",null,null,null,null,null,null,"Rectangle",57.36,15.7,18,17.100000000000001,10,"9.13",0.3125,0.29099999999999998,31.4,58.9,695,93.7,77.2,6.65,282,62.7,56.4,4.2300000000000004,635,100]
["HSS","HSS18x10x0.250","HSS18x10x1/4","18x10x0.250","18x10","0.250",null,null,null,null,null,null,"Rectangle",46.24,12.7,18,17.3,10,"9.30",0.25,0.23300000000000001,39.9,74.3,566,76,62.9,6.68,230,50.9,46.1,4.26,515,80.8]
["HSS","HSS18x8x0.625","HSS18x8x5/8","18x8x0.625","18x8","0.625",null,null,null,null,null,null,"Rectangle",101.85000000000001,28,18,16.3,8,"6.26",0.625,0.58099999999999996,10.8,28,1100,156,122,6.27,306,87.8,76.599999999999994,3.31,797,149]
["HSS","HSS18x8x0.500","HSS18x8x1/2","18x8x0.500","18x8","0.500",null,null,null,null,null,null,"Rectangle",82.88,22.8,18,16.600000000000001,8,"6.61",0.5,0.46500000000000002,14.2,35.700000000000003,913,128,101,6.33,257,72.5,64.2,3.36,659,122]
["HSS","HSS18x8x0.375","HSS18x8x3/8","18x8x0.375","18x8","0.375",null,null,null,null,null,null,"Rectangle",63.21,17.3,18,17,8,"6.95",0.375,0.34899999999999998,19.899999999999999,48.6,711,98.7,79,6.4,202,56.1,50.5,3.41,510,94.1]
["HSS","HSS18x8x0.313","HSS18x8x5/16","18x8x0.313","18x8","0.313",null,null,null,null,null,null,"Rectangle",53.11,14.6,18,17.100000000000001,8,"7.13",0.3125,0.29099999999999998,24.5,58.9,604,83.4,67.099999999999994,6.44,172,47.5,43,3.44,432,79.400000000000006]
["HSS","HSS18x8x0.250","HSS18x8x1/4","18x8x0.250","18x8","0.250",null,null,null,null,null,null,"Rectangle",42.84,11.8,18,17.3,8,"7.30",0.25,0.23300000000000001,31.3,74.3,492,67.7,54.7,6.47,141,38.6,35.200000000000003,3.46,351,64.3]
["HSS","HSS18x6x0.750","HSS18x6x3/4","18x6x0.750","18x6","0.750",null,null,null,null,null,null,"Rectangle",109.91,30.3,18,15.9,6,"3.91",0.75,0.69799999999999995,5.6,22.8,1060,158,118,5.92,179,70.400000000000006,59.6,2.4300000000000002,530,127]
["HSS","HSS18x6x0.625","HSS18x6x5/8","18x6x0.625","18x6","0.625",null,null,null,null,null,null,"Rectangle",93.34,25.7,18,16.3,6,4.26,0.625,0.58099999999999996,7.33,28,923,135,103,6,158,61,52.7,2.48,462,109]
["HSS","HSS18x6x0.500","HSS18x6x1/2","18x6x0.500","18x6","0.500",null,null,null,null,null,null,"Rectangle",76.069999999999993,20.9,18,16.600000000000001,6,4.6100000000000003,0.5,0.46500000000000002,9.9,35.700000000000003,770,112,85.6,6.07,134,50.7,44.6,2.5299999999999998,387,89.9]
["HSS","HSS18x6x0.375","HSS18x6x3/8","18x6x0.375","18x6","0.375",null,null,null,null,null,null,"Rectangle",58.1,16,18,17,6,4.95,0.375,0.34899999999999998,14.2,48.6,602,86.4,66.900000000000006,6.15,106,39.5,35.5,2.58,302,69.5]
["HSS","HSS18x6x0.313","HSS18x6x5/16","18x6x0.313","18x6","0.313",null,null,null,null,null,null,"Rectangle",48.86,13.4,18,17.100000000000001,6,5.13,0.3125,0.29099999999999998,17.600000000000001,58.9,513,73.099999999999994,57,6.18,91.3,33.5,30.4,2.61,257,58.7]
["HSS","HSS18x6x0.250","HSS18x6x1/4","18x6x0.250","18x6","0.250",null,null,null,null,null,null,"Rectangle",39.43,10.8,18,17.3,6,5.3,0.25,0.23300000000000001,22.8,74.3,419,59.4,46.5,6.22,75.099999999999994,27.3,25,2.63,210,47.7]
["HSS","HSS16x12x1","HSS16x12x1","16x12x1","16x12","1",null,null,null,null,null,null,"Rectangle",168.18,46.4,16,13.2,12,"9.21",1,0.93,9.9,14.2,1570,244,196,5.82,1000,200,167,4.6399999999999997,2030,307]
["HSS","HSS16x12x0.875","HSS16x12x7/8","16x12x0.875","16x12","0.875",null,null,null,null,null,null,"Rectangle",149.61000000000001,41.2,16,13.6,12,"9.56",0.875,0.81399999999999995,11.7,16.7,1430,219,178,5.88,910,179,152,4.7,1830,274]
["HSS","HSS16x12x0.750","HSS16x12x3/4","16x12x0.750","16x12","0.750",null,null,null,null,null,null,"Rectangle",130.33000000000001,35.9,16,13.9,12,9.91,0.75,0.69799999999999995,14.2,19.899999999999999,1270,193,159,5.95,810,158,135,4.75,1610,240]
["HSS","HSS16x12x0.625","HSS16x12x5/8","16x12x0.625","16x12","0.625",null,null,null,null,null,null,"Rectangle",110.36,30.3,16,14.3,12,10.3,0.625,0.58099999999999996,17.7,24.5,1090,165,136,6,700,135,117,4.8,1370,204]
["HSS","HSS16x12x0.500","HSS16x12x1/2","16x12x0.500","16x12","0.500",null,null,null,null,null,null,"Rectangle",89.68,24.6,16,14.6,12,10.6,0.5,0.46500000000000002,22.8,31.4,904,135,113,6.06,581,111,96.8,4.8600000000000003,1120,166]
["HSS","HSS16x12x0.375","HSS16x12x3/8","16x12x0.375","16x12","0.375",null,null,null,null,null,null,"Rectangle",68.31,18.7,16,15,12,11,0.375,0.34899999999999998,31.4,42.8,702,104,87.7,6.12,452,85.5,75.3,4.91,862,127]
["HSS","HSS16x12x0.313","HSS16x12x5/16","16x12x0.313","16x12","0.313",null,null,null,null,null,null,"Rectangle",57.36,15.7,16,15.1,12,11.1,0.3125,0.29099999999999998,38.200000000000003,52,595,87.7,74.400000000000006,6.15,384,72.2,64,4.9400000000000004,727,107]
["HSS","HSS16x10x0.625","HSS16x10x5/8","16x10x0.625","16x10","0.625",null,null,null,null,null,null,"Rectangle",101.85000000000001,28,16,14.3,10,"8.26",0.625,0.58099999999999996,14.2,24.5,953,147,119,5.84,459,106,91.8,4.05,1010,168]
["HSS","HSS16x10x0.500","HSS16x10x1/2","16x10x0.500","16x10","0.500",null,null,null,null,null,null,"Rectangle",82.88,22.8,16,14.6,10,"8.61",0.5,0.46500000000000002,18.5,31.4,792,121,99,5.9,383,87.3,76.599999999999994,4.0999999999999996,829,137]
["HSS","HSS16x10x0.375","HSS16x10x3/8","16x10x0.375","16x10","0.375",null,null,null,null,null,null,"Rectangle",63.21,17.3,16,15,10,"8.95",0.375,0.34899999999999998,25.7,42.8,616,93,77,5.96,299,67.400000000000006,59.9,4.1500000000000004,639,105]
["HSS","HSS16x10x0.313","HSS16x10x5/16","16x10x0.313","16x10","0.313",null,null,null,null,null,null,"Rectangle",53.11,14.6,16,15.1,10,"9.13",0.3125,0.29099999999999998,31.4,52,523,78.599999999999994,65.400000000000006,5.99,255,57,50.9,4.18,539,88.7]
["HSS","HSS16x10x0.250","HSS16x10x1/4","16x10x0.250","16x10","0.250",null,null,null,null,null,null,"Rectangle",42.84,11.8,16,15.3,10,"9.30",0.25,0.23300000000000001,39.9,65.7,426,63.7,53.3,6.02,208,46.3,41.6,4.21,437,71.7]
["HSS","HSS16x8x0.875","HSS16x8x7/8","16x8x0.875","16x8","0.875",null,null,null,null,null,null,"Rectangle",125.79,34.700000000000003,16,13.6,8,"5.56",0.875,0.81399999999999995,6.83,16.7,1050,170,131,5.5,348,104,87,3.17,888,176]
["HSS","HSS16x8x0.750","HSS16x8x3/4","16x8x0.750","16x8","0.750",null,null,null,null,null,null,"Rectangle",109.91,30.3,16,13.9,8,"5.91",0.75,0.69799999999999995,8.4600000000000009,19.899999999999999,939,150,117,5.57,314,91.9,78.400000000000006,3.22,790,155]
["HSS","HSS16x8x0.625","HSS16x8x5/8","16x8x0.625","16x8","0.625",null,null,null,null,null,null,"Rectangle",93.34,25.7,16,14.3,8,6.26,0.625,0.58099999999999996,10.8,24.5,815,129,102,5.64,274,79.2,68.599999999999994,3.27,681,132]
["HSS","HSS16x8x0.500","HSS16x8x1/2","16x8x0.500","16x8","0.500",null,null,null,null,null,null,"Rectangle",76.069999999999993,20.9,16,14.6,8,6.6,0.5,0.46500000000000002,14.2,31.4,679,106,84.9,5.7,230,65.5,57.6,3.32,563,108]
["HSS","HSS16x8x0.375","HSS16x8x3/8","16x8x0.375","16x8","0.375",null,null,null,null,null,null,"Rectangle",58.1,16,16,15,8,6.95,0.375,0.34899999999999998,19.899999999999999,42.8,531,82.1,66.3,5.77,181,50.8,45.3,3.37,436,83.4]
["HSS","HSS16x8x0.313","HSS16x8x5/16","16x8x0.313","16x8","0.313",null,null,null,null,null,null,"Rectangle",48.86,13.4,16,15.1,8,7.13,0.3125,0.29099999999999998,24.5,52,451,69.400000000000006,56.4,5.8,155,43,38.700000000000003,3.4,369,70.400000000000006]
["HSS","HSS16x8x0.250","HSS16x8x1/4","16x8x0.250","16x8","0.250",null,null,null,null,null,null,"Rectangle",39.43,10.8,16,15.3,8,7.3,0.25,0.23300000000000001,31.3,65.7,368,56.4,46.1,5.83,127,35,31.7,3.42,300,57]
["HSS","HSS16x6x0.625","HSS16x6x5/8","16x6x0.625","16x6","0.625",null,null,null,null,null,null,"Rectangle",84.84,23.3,16,14.3,6,"4.26",0.625,0.58099999999999996,7.33,24.5,677,111,84.6,5.38,141,54.7,46.9,2.46,398,96.3]
["HSS","HSS16x6x0.500","HSS16x6x1/2","16x6x0.500","16x6","0.500",null,null,null,null,null,null,"Rectangle",69.27,19,16,14.6,6,"4.61",0.5,0.46500000000000002,9.9,31.4,567,91.7,70.900000000000006,5.46,120,45.5,39.9,2.5099999999999998,333,79.599999999999994]
["HSS","HSS16x6x0.375","HSS16x6x3/8","16x6x0.375","16x6","0.375",null,null,null,null,null,null,"Rectangle",53,14.6,16,15,6,"4.95",0.375,0.34899999999999998,14.2,42.8,445,71.099999999999994,55.6,5.53,95.3,35.5,31.8,2.56,260,61.6]
["HSS","HSS16x6x0.313","HSS16x6x5/16","16x6x0.313","16x6","0.313",null,null,null,null,null,null,"Rectangle",44.6,12.2,16,15.1,6,"5.13",0.3125,0.29099999999999998,17.600000000000001,52,379,60.3,47.4,5.57,81.8,30.2,27.3,2.58,222,52.1]
["HSS","HSS16x6x0.250","HSS16x6x1/4","16x6x0.250","16x6","0.250",null,null,null,null,null,null,"Rectangle",36.03,9.9,16,15.3,6,"5.30",0.25,0.23300000000000001,22.8,65.7,311,49,38.799999999999997,5.6,67.400000000000006,24.7,22.5,2.61,181,42.3]
["HSS","HSS16x6x0.188","HSS16x6x3/16","16x6x0.188","16x6","0.188",null,null,null,null,null,null,"Rectangle",27.29,7.46,16,15.5,6,"5.48",0.1875,0.17399999999999999,31.5,89,237,37.200000000000003,29.6,5.64,51.8,18.8,17.3,2.64,138,32.1]
["HSS","HSS16x4x0.625","HSS16x4x5/8","16x4x0.625","16x4","0.625",null,null,null,null,null,null,"Rectangle",76.33,21,16,14.3,4,2.2599999999999998,0.625,0.58099999999999996,3.88,24.5,539,92.9,67.3,5.0599999999999996,54.1,32.5,27,1.6,174,60.5]
["HSS","HSS16x4x0.500","HSS16x4x1/2","16x4x0.500","16x4","0.500",null,null,null,null,null,null,"Rectangle",62.46,17.2,16,14.6,4,2.6,0.5,0.46500000000000002,5.6,31.4,455,77.3,56.9,5.15,47,27.4,23.5,1.65,150,50.7]
["HSS","HSS16x4x0.375","HSS16x4x3/8","16x4x0.375","16x4","0.375",null,null,null,null,null,null,"Rectangle",47.9,13.2,16,15,4,2.95,0.375,0.34899999999999998,8.4600000000000009,42.8,360,60.2,45,5.23,38.299999999999997,21.7,19.100000000000001,1.71,120,39.700000000000003]
["HSS","HSS16x4x0.313","HSS16x4x5/16","16x4x0.313","16x4","0.313",null,null,null,null,null,null,"Rectangle",40.35,11.1,16,15.1,4,3.13,0.3125,0.29099999999999998,10.7,52,308,51.1,38.5,5.27,33.200000000000003,18.5,16.600000000000001,1.73,103,33.799999999999997]
["HSS","HSS16x4x0.250","HSS16x4x1/4","16x4x0.250","16x4","0.250",null,null,null,null,null,null,"Rectangle",32.630000000000003,8.9600000000000009,16,15.3,4,3.3,0.25,0.23300000000000001,14.2,65.7,253,41.7,31.6,5.31,27.7,15.2,13.8,1.76,85.2,27.6]
["HSS","HSS16x4x0.188","HSS16x4x3/16","16x4x0.188","16x4","0.188",null,null,null,null,null,null,"Rectangle",24.73,6.76,16,15.5,4,3.48,0.1875,0.17399999999999999,20,89,193,31.7,24.2,5.35,21.5,11.7,10.8,1.78,65.5,21.1]
["HSS","HSS14x12x0.625","HSS14x12x5/8","14x12x0.625","14x12","0.625",null,null,null,null,null,null,"Rectangle",101.85000000000001,28,14,12.3,12,"10.3",0.625,0.58099999999999996,17.7,21.1,792,135,113,5.32,624,122,104,4.72,1120,177]
["HSS","HSS14x12x0.500","HSS14x12x1/2","14x12x0.500","14x12","0.500",null,null,null,null,null,null,"Rectangle",82.88,22.8,14,12.6,12,"10.6",0.5,0.46500000000000002,22.8,27.1,658,111,94,5.38,519,100,86.5,4.78,921,145]
["HSS","HSS14x12x0.375","HSS14x12x3/8","14x12x0.375","14x12","0.375",null,null,null,null,null,null,"Rectangle",63.21,17.3,14,13,12,"11.0",0.375,0.34899999999999998,31.4,37.1,512,85.9,73.2,5.43,405,77.400000000000006,67.400000000000006,4.83,708,111]
["HSS","HSS14x12x0.313","HSS14x12x5/16","14x12x0.313","14x12","0.313",null,null,null,null,null,null,"Rectangle",53.11,14.6,14,13.1,12,"11.1",0.3125,0.29099999999999998,38.200000000000003,45.1,435,72.599999999999994,62.1,5.46,344,65.400000000000006,57.3,4.8600000000000003,598,93.3]
["HSS","HSS14x12x0.250","HSS14x12x1/4","14x12x0.250","14x12","0.250",null,null,null,null,null,null,"Rectangle",42.84,11.8,14,13.3,12,"11.3",0.25,0.23300000000000001,48.5,57.1,354,58.9,50.6,5.49,280,53,46.7,4.88,484,75.400000000000006]
["HSS","HSS14x10x0.875","HSS14x10x7/8","14x10x0.875","14x10","0.875",null,null,null,null,null,null,"Rectangle",125.79,34.700000000000003,14,11.6,10,"7.56",0.875,0.81399999999999995,9.2899999999999991,14.2,886,158,127,5.05,522,125,104,3.88,1100,195]
["HSS","HSS14x10x0.750","HSS14x10x3/4","14x10x0.750","14x10","0.750",null,null,null,null,null,null,"Rectangle",109.91,30.3,14,11.9,10,"7.91",0.75,0.69799999999999995,11.3,17.100000000000001,792,140,113,5.1100000000000003,468,111,93.6,3.93,970,171]
["HSS","HSS14x10x0.625","HSS14x10x5/8","14x10x0.625","14x10","0.625",null,null,null,null,null,null,"Rectangle",93.34,25.7,14,12.3,10,8.26,0.625,0.58099999999999996,14.2,21.1,687,120,98.2,5.17,407,95.1,81.5,3.98,832,146]
["HSS","HSS14x10x0.500","HSS14x10x1/2","14x10x0.500","14x10","0.500",null,null,null,null,null,null,"Rectangle",76.069999999999993,20.9,14,12.6,10,8.6,0.5,0.46500000000000002,18.5,27.1,573,98.8,81.8,5.23,341,78.5,68.099999999999994,4.04,685,120]
["HSS","HSS14x10x0.375","HSS14x10x3/8","14x10x0.375","14x10","0.375",null,null,null,null,null,null,"Rectangle",58.1,16,14,13,10,8.9499999999999993,0.375,0.34899999999999998,25.7,37.1,447,76.3,63.9,5.29,267,60.7,53.4,4.09,528,91.8]
["HSS","HSS14x10x0.313","HSS14x10x5/16","14x10x0.313","14x10","0.313",null,null,null,null,null,null,"Rectangle",48.86,13.4,14,13.1,10,9.1300000000000008,0.3125,0.29099999999999998,31.4,45.1,380,64.599999999999994,54.3,5.32,227,51.4,45.5,4.12,446,77.400000000000006]
["HSS","HSS14x10x0.250","HSS14x10x1/4","14x10x0.250","14x10","0.250",null,null,null,null,null,null,"Rectangle",39.43,10.8,14,13.3,10,9.3000000000000007,0.25,0.23300000000000001,39.9,57.1,310,52.4,44.3,5.35,186,41.8,37.200000000000003,4.1399999999999997,362,62.6]
["HSS","HSS14x8x0.625","HSS14x8x5/8","14x8x0.625","14x8","0.625",null,null,null,null,null,null,"Rectangle",84.84,23.3,14,12.3,8,"6.26",0.625,0.58099999999999996,10.8,21.1,582,104,83.2,5,242,70.5,60.6,3.22,566,115]
["HSS","HSS14x8x0.500","HSS14x8x1/2","14x8x0.500","14x8","0.500",null,null,null,null,null,null,"Rectangle",69.27,19,14,12.6,8,"6.61",0.5,0.46500000000000002,14.2,27.1,487,86.2,69.599999999999994,5.0599999999999996,204,58.5,51,3.27,469,94.5]
["HSS","HSS14x8x0.375","HSS14x8x3/8","14x8x0.375","14x8","0.375",null,null,null,null,null,null,"Rectangle",53,14.6,14,13,8,"6.95",0.375,0.34899999999999998,19.899999999999999,37.1,382,66.8,54.6,5.12,161,45.5,40.200000000000003,3.32,363,72.7]
["HSS","HSS14x8x0.313","HSS14x8x5/16","14x8x0.313","14x8","0.313",null,null,null,null,null,null,"Rectangle",44.6,12.2,14,13.1,8,"7.13",0.3125,0.29099999999999998,24.5,45.1,325,56.6,46.5,5.15,138,38.6,34.4,3.35,308,61.4]
["HSS","HSS14x8x0.250","HSS14x8x1/4","14x8x0.250","14x8","0.250",null,null,null,null,null,null,"Rectangle",36.03,9.9,14,13.3,8,"7.30",0.25,0.23300000000000001,31.3,57.1,266,46,38,5.19,113,31.4,28.2,3.38,250,49.8]
["HSS","HSS14x8x0.188","HSS14x8x3/16","14x8x0.188","14x8","0.188",null,null,null,null,null,null,"Rectangle",27.29,7.46,14,13.5,8,"7.48",0.1875,0.17399999999999999,43,77.5,203,34.9,29,5.22,86.4,23.8,21.6,3.4,190,37.6]
["HSS","HSS14x6x0.625","HSS14x6x5/8","14x6x0.625","14x6","0.625",null,null,null,null,null,null,"Rectangle",76.33,21,14,12.3,6,4.26,0.625,0.58099999999999996,7.33,21.1,478,88.7,68.3,4.7699999999999996,124,48.4,41.2,2.4300000000000002,334,83.7]
["HSS","HSS14x6x0.500","HSS14x6x1/2","14x6x0.500","14x6","0.500",null,null,null,null,null,null,"Rectangle",62.46,17.2,14,12.6,6,4.6100000000000003,0.5,0.46500000000000002,9.9,27.1,402,73.599999999999994,57.4,4.84,105,40.4,35.1,2.48,279,69.3]
["HSS","HSS14x6x0.375","HSS14x6x3/8","14x6x0.375","14x6","0.375",null,null,null,null,null,null,"Rectangle",47.9,13.2,14,13,6,4.95,0.375,0.34899999999999998,14.2,37.1,317,57.3,45.3,4.91,84.1,31.6,28,2.5299999999999998,219,53.7]
["HSS","HSS14x6x0.313","HSS14x6x5/16","14x6x0.313","14x6","0.313",null,null,null,null,null,null,"Rectangle",40.35,11.1,14,13.1,6,5.13,0.3125,0.29099999999999998,17.600000000000001,45.1,271,48.6,38.700000000000003,4.9400000000000004,72.3,26.9,24.1,2.5499999999999998,186,45.5]
["HSS","HSS14x6x0.250","HSS14x6x1/4","14x6x0.250","14x6","0.250",null,null,null,null,null,null,"Rectangle",32.630000000000003,8.9600000000000009,14,13.3,6,5.3,0.25,0.23300000000000001,22.8,57.1,222,39.6,31.7,4.9800000000000004,59.6,22,19.899999999999999,2.58,152,36.9]
["HSS","HSS14x6x0.188","HSS14x6x3/16","14x6x0.188","14x6","0.188",null,null,null,null,null,null,"Rectangle",24.73,6.76,14,13.5,6,5.48,0.1875,0.17399999999999999,31.5,77.5,170,30.1,24.3,5.01,45.9,16.7,15.3,2.61,116,28]
["HSS","HSS14x4x0.625","HSS14x4x5/8","14x4x0.625","14x4","0.625",null,null,null,null,null,null,"Rectangle",67.819999999999993,18.7,14,12.3,4,2.2599999999999998,0.625,0.58099999999999996,3.88,21.1,373,73.099999999999994,53.3,4.47,47.2,28.5,23.6,1.59,148,52.6]
["HSS","HSS14x4x0.500","HSS14x4x1/2","14x4x0.500","14x4","0.500",null,null,null,null,null,null,"Rectangle",55.66,15.3,14,12.6,4,2.6,0.5,0.46500000000000002,5.6,27.1,317,61,45.3,4.55,41.2,24.1,20.6,1.64,127,44.1]
["HSS","HSS14x4x0.375","HSS14x4x3/8","14x4x0.375","14x4","0.375",null,null,null,null,null,null,"Rectangle",42.79,11.8,14,13,4,2.95,0.375,0.34899999999999998,8.4600000000000009,37.1,252,47.8,36,4.63,33.6,19.100000000000001,16.8,1.69,102,34.6]
["HSS","HSS14x4x0.313","HSS14x4x5/16","14x4x0.313","14x4","0.313",null,null,null,null,null,null,"Rectangle",36.1,9.92,14,13.1,4,3.13,0.3125,0.29099999999999998,10.7,45.1,216,40.6,30.9,4.67,29.2,16.399999999999999,14.6,1.72,87.7,29.5]
["HSS","HSS14x4x0.250","HSS14x4x1/4","14x4x0.250","14x4","0.250",null,null,null,null,null,null,"Rectangle",29.23,8.0299999999999994,14,13.3,4,3.3,0.25,0.23300000000000001,14.2,57.1,178,33.200000000000003,25.4,4.71,24.4,13.5,12.2,1.74,72.400000000000006,24.1]
["HSS","HSS14x4x0.188","HSS14x4x3/16","14x4x0.188","14x4","0.188",null,null,null,null,null,null,"Rectangle",22.18,6.06,14,13.5,4,3.48,0.1875,0.17399999999999999,20,77.5,137,25.3,19.5,4.74,19,10.3,9.48,1.77,55.8,18.399999999999999]
["HSS","HSS12x10x0.625","HSS12x10x5/8","12x10x0.625","12x10","0.625",null,null,null,null,null,null,"Rectangle",84.84,23.3,12,10.3,10,"8.26",0.625,0.58099999999999996,14.2,17.7,472,95.3,78.7,4.5,356,84.1,71.2,3.9,661,124]
["HSS","HSS12x10x0.500","HSS12x10x1/2","12x10x0.500","12x10","0.500",null,null,null,null,null,null,"Rectangle",69.27,19,12,10.6,10,8.6,0.5,0.46500000000000002,18.5,22.8,395,78.8,65.900000000000006,4.5599999999999996,298,69.599999999999994,59.7,3.96,545,102]
["HSS","HSS12x10x0.375","HSS12x10x3/8","12x10x0.375","12x10","0.375",null,null,null,null,null,null,"Rectangle",53,14.6,12,11,10,8.9499999999999993,0.375,0.34899999999999998,25.7,31.4,310,61.1,51.6,4.6100000000000003,234,54,46.9,4.01,421,78.3]
["HSS","HSS12x10x0.313","HSS12x10x5/16","12x10x0.313","12x10","0.313",null,null,null,null,null,null,"Rectangle",44.6,12.2,12,11.1,10,9.1300000000000008,0.3125,0.29099999999999998,31.4,38.200000000000003,264,51.7,44,4.6399999999999997,200,45.7,40,4.04,356,66.099999999999994]
["HSS","HSS12x10x0.250","HSS12x10x1/4","12x10x0.250","12x10","0.250",null,null,null,null,null,null,"Rectangle",36.03,9.9,12,11.3,10,9.3000000000000007,0.25,0.23300000000000001,39.9,48.5,216,42.1,36,4.67,164,37.200000000000003,32.700000000000003,4.07,289,53.5]
["HSS","HSS12x10x0.188","HSS12x10x3/16","12x10x0.188","12x10","0.188",null,null,null,null,null,null,"Rectangle",27.29,7.46,12,11.5,10,"9.48",0.1875,0.17399999999999999,54.5,66,165,31.9,27.5,4.7,125,28.2,25,4.09,219,40.4]
["HSS","HSS12x8x0.625","HSS12x8x5/8","12x8x0.625","12x8","0.625",null,null,null,null,null,null,"Rectangle",76.33,21,12,10.3,8,6.26,0.625,0.58099999999999996,10.8,17.7,397,82.1,66.099999999999994,4.34,210,61.9,52.5,3.16,454,97.7]
["HSS","HSS12x8x0.500","HSS12x8x1/2","12x8x0.500","12x8","0.500",null,null,null,null,null,null,"Rectangle",62.46,17.2,12,10.6,8,6.6,0.5,0.46500000000000002,14.2,22.8,333,68.099999999999994,55.6,4.41,178,51.5,44.4,3.21,377,80.400000000000006]
["HSS","HSS12x8x0.375","HSS12x8x3/8","12x8x0.375","12x8","0.375",null,null,null,null,null,null,"Rectangle",47.9,13.2,12,11,8,6.95,0.375,0.34899999999999998,19.899999999999999,31.4,262,53,43.7,4.47,140,40.1,35.1,3.27,293,62.1]
["HSS","HSS12x8x0.313","HSS12x8x5/16","12x8x0.313","12x8","0.313",null,null,null,null,null,null,"Rectangle",40.35,11.1,12,11.1,8,7.13,0.3125,0.29099999999999998,24.5,38.200000000000003,224,44.9,37.4,4.5,120,34.1,30.1,3.29,248,52.4]
["HSS","HSS12x8x0.250","HSS12x8x1/4","12x8x0.250","12x8","0.250",null,null,null,null,null,null,"Rectangle",32.630000000000003,8.9600000000000009,12,11.3,8,7.3,0.25,0.23300000000000001,31.3,48.5,184,36.6,30.6,4.53,98.8,27.8,24.7,3.32,202,42.5]
["HSS","HSS12x8x0.188","HSS12x8x3/16","12x8x0.188","12x8","0.188",null,null,null,null,null,null,"Rectangle",24.73,6.76,12,11.5,8,7.48,0.1875,0.17399999999999999,43,66,140,27.8,23.4,4.5599999999999996,75.7,21.1,18.899999999999999,3.35,153,32.200000000000003]
["HSS","HSS12x6x0.625","HSS12x6x5/8","12x6x0.625","12x6","0.625",null,null,null,null,null,null,"Rectangle",67.819999999999993,18.7,12,10.3,6,4.26,0.625,0.58099999999999996,7.33,17.7,321,68.8,53.4,4.1399999999999997,107,42.1,35.5,2.39,271,71.099999999999994]
["HSS","HSS12x6x0.500","HSS12x6x1/2","12x6x0.500","12x6","0.500",null,null,null,null,null,null,"Rectangle",55.66,15.3,12,10.6,6,4.6100000000000003,0.5,0.46500000000000002,9.9,22.8,271,57.4,45.2,4.21,91.1,35.200000000000003,30.4,2.44,227,59]
["HSS","HSS12x6x0.375","HSS12x6x3/8","12x6x0.375","12x6","0.375",null,null,null,null,null,null,"Rectangle",42.79,11.8,12,11,6,4.95,0.375,0.34899999999999998,14.2,31.4,215,44.8,35.9,4.28,72.900000000000006,27.7,24.3,2.4900000000000002,178,45.8]
["HSS","HSS12x6x0.313","HSS12x6x5/16","12x6x0.313","12x6","0.313",null,null,null,null,null,null,"Rectangle",36.1,9.92,12,11.1,6,5.13,0.3125,0.29099999999999998,17.600000000000001,38.200000000000003,184,38.1,30.7,4.3099999999999996,62.8,23.6,20.9,2.52,152,38.799999999999997]
["HSS","HSS12x6x0.250","HSS12x6x1/4","12x6x0.250","12x6","0.250",null,null,null,null,null,null,"Rectangle",29.23,8.0299999999999994,12,11.3,6,5.3,0.25,0.23300000000000001,22.8,48.5,151,31.1,25.2,4.34,51.9,19.3,17.3,2.54,124,31.6]
["HSS","HSS12x6x0.188","HSS12x6x3/16","12x6x0.188","12x6","0.188",null,null,null,null,null,null,"Rectangle",22.18,6.06,12,11.5,6,5.48,0.1875,0.17399999999999999,31.5,66,116,23.7,19.399999999999999,4.38,40,14.7,13.3,2.57,94.6,24]
["HSS","HSS12x4x0.625","HSS12x4x5/8","12x4x0.625","12x4","0.625",null,null,null,null,null,null,"Rectangle",59.32,16.399999999999999,12,10.3,4,2.2599999999999998,0.625,0.58099999999999996,3.88,17.7,245,55.5,40.799999999999997,3.87,40.4,24.5,20.2,1.57,122,44.6]
["HSS","HSS12x4x0.500","HSS12x4x1/2","12x4x0.500","12x4","0.500",null,null,null,null,null,null,"Rectangle",48.85,13.5,12,10.6,4,2.6,0.5,0.46500000000000002,5.6,22.8,210,46.7,34.9,3.95,35.299999999999997,20.9,17.7,1.62,105,37.5]
["HSS","HSS12x4x0.375","HSS12x4x3/8","12x4x0.375","12x4","0.375",null,null,null,null,null,null,"Rectangle",37.69,10.4,12,11,4,2.95,0.375,0.34899999999999998,8.4600000000000009,31.4,168,36.700000000000003,28,4.0199999999999996,28.9,16.600000000000001,14.5,1.67,84.1,29.5]
["HSS","HSS12x4x0.313","HSS12x4x5/16","12x4x0.313","12x4","0.313",null,null,null,null,null,null,"Rectangle",31.84,8.76,12,11.1,4,3.13,0.3125,0.29099999999999998,10.7,38.200000000000003,144,31.3,24.1,4.0599999999999996,25.2,14.2,12.6,1.7,72.400000000000006,25.2]
["HSS","HSS12x4x0.250","HSS12x4x1/4","12x4x0.250","12x4","0.250",null,null,null,null,null,null,"Rectangle",25.82,7.1,12,11.3,4,3.3,0.25,0.23300000000000001,14.2,48.5,119,25.6,19.899999999999999,4.0999999999999996,21,11.7,10.5,1.72,59.8,20.6]
["HSS","HSS12x4x0.188","HSS12x4x3/16","12x4x0.188","12x4","0.188",null,null,null,null,null,null,"Rectangle",19.63,5.37,12,11.5,4,3.48,0.1875,0.17399999999999999,20,66,91.8,19.600000000000001,15.3,4.13,16.399999999999999,9,8.1999999999999993,1.75,46.1,15.7]
["HSS","HSS12x3x0.313","HSS12x3x5/16","12x3x0.313","12x3","0.313",null,null,null,null,null,null,"Rectangle",29.72,8.17,12,11.1,3,2.13,0.3125,0.29099999999999998,7.31,38.200000000000003,124,27.9,20.7,3.9,13.1,10,8.73,1.27,41.3,18.399999999999999]
["HSS","HSS12x3x0.250","HSS12x3x1/4","12x3x0.250","12x3","0.250",null,null,null,null,null,null,"Rectangle",24.12,6.63,12,11.3,3,2.2999999999999998,0.25,0.23300000000000001,9.8800000000000008,48.5,103,22.9,17.2,3.94,11.1,8.2799999999999994,7.38,1.29,34.5,15.1]
["HSS","HSS12x3x0.188","HSS12x3x3/16","12x3x0.188","12x3","0.188",null,null,null,null,null,null,"Rectangle",18.350000000000001,5.0199999999999996,12,11.5,3,2.48,0.1875,0.17399999999999999,14.2,66,79.599999999999994,17.5,13.3,3.98,8.7200000000000006,6.4,5.81,1.32,26.8,11.6]
["HSS","HSS12x2x0.313","HSS12x2x5/16","12x2x0.313","12x2","0.313",null,null,null,null,null,null,"Rectangle",27.59,7.59,12,11.1,2,1.1299999999999999,0.3125,0.29099999999999998,3.87,38.200000000000003,104,24.5,17.399999999999999,3.71,5.0999999999999996,6.05,5.0999999999999996,0.82,17.600000000000001,11.6]
["HSS","HSS12x2x0.250","HSS12x2x1/4","12x2x0.250","12x2","0.250",null,null,null,null,null,null,"Rectangle",22.42,6.17,12,11.3,2,1.3,0.25,0.23300000000000001,5.58,48.5,86.9,20.100000000000001,14.5,3.75,4.41,5.08,4.41,0.84499999999999997,15.1,9.64]
["HSS","HSS12x2x0.188","HSS12x2x3/16","12x2x0.188","12x2","0.188",null,null,null,null,null,null,"Rectangle",17.079999999999998,4.67,12,11.5,2,1.48,0.1875,0.17399999999999999,8.49,66,67.400000000000006,15.5,11.2,3.8,3.55,3.97,3.55,0.872,12,7.49]
["HSS","HSS10x8x0.625","HSS10x8x5/8","10x8x0.625","10x8","0.625",null,null,null,null,null,null,"Rectangle",67.819999999999993,18.7,10,8.26,8,6.26,0.625,0.58099999999999996,10.8,14.2,253,62.2,50.5,3.68,178,53.3,44.5,3.09,346,80.400000000000006]
["HSS","HSS10x8x0.500","HSS10x8x1/2","10x8x0.500","10x8","0.500",null,null,null,null,null,null,"Rectangle",55.66,15.3,10,8.6,8,6.6,0.5,0.46500000000000002,14.2,18.5,214,51.9,42.7,3.73,151,44.5,37.799999999999997,3.14,288,66.400000000000006]
["HSS","HSS10x8x0.375","HSS10x8x3/8","10x8x0.375","10x8","0.375",null,null,null,null,null,null,"Rectangle",42.79,11.8,10,8.9499999999999993,8,6.95,0.375,0.34899999999999998,19.899999999999999,25.7,169,40.5,33.9,3.79,120,34.799999999999997,30,3.19,224,51.4]
["HSS","HSS10x8x0.313","HSS10x8x5/16","10x8x0.313","10x8","0.313",null,null,null,null,null,null,"Rectangle",36.1,9.92,10,9.1300000000000008,8,7.13,0.3125,0.29099999999999998,24.5,31.4,145,34.4,29,3.82,103,29.6,25.7,3.22,190,43.5]
["HSS","HSS10x8x0.250","HSS10x8x1/4","10x8x0.250","10x8","0.250",null,null,null,null,null,null,"Rectangle",29.23,8.0299999999999994,10,9.3000000000000007,8,7.3,0.25,0.23300000000000001,31.3,39.9,119,28.1,23.8,3.85,84.7,24.2,21.2,3.25,155,35.299999999999997]
["HSS","HSS10x8x0.188","HSS10x8x3/16","10x8x0.188","10x8","0.188",null,null,null,null,null,null,"Rectangle",22.18,6.06,10,9.48,8,7.48,0.1875,0.17399999999999999,43,54.5,91.4,21.4,18.3,3.88,65.099999999999994,18.399999999999999,16.3,3.28,118,26.7]
["HSS","HSS10x6x0.625","HSS10x6x5/8","10x6x0.625","10x6","0.625",null,null,null,null,null,null,"Rectangle",59.32,16.399999999999999,10,8.26,6,4.26,0.625,0.58099999999999996,7.33,14.2,201,51.3,40.200000000000003,3.5,89.4,35.799999999999997,29.8,2.34,209,58.6]
["HSS","HSS10x6x0.500","HSS10x6x1/2","10x6x0.500","10x6","0.500",null,null,null,null,null,null,"Rectangle",48.85,13.5,10,8.6,6,4.6100000000000003,0.5,0.46500000000000002,9.9,18.5,171,43,34.299999999999997,3.57,76.8,30.1,25.6,2.39,176,48.7]
["HSS","HSS10x6x0.375","HSS10x6x3/8","10x6x0.375","10x6","0.375",null,null,null,null,null,null,"Rectangle",37.69,10.4,10,8.9499999999999993,6,4.95,0.375,0.34899999999999998,14.2,25.7,137,33.799999999999997,27.4,3.63,61.8,23.7,20.6,2.44,139,37.9]
["HSS","HSS10x6x0.313","HSS10x6x5/16","10x6x0.313","10x6","0.313",null,null,null,null,null,null,"Rectangle",31.84,8.76,10,9.1300000000000008,6,5.13,0.3125,0.29099999999999998,17.600000000000001,31.4,118,28.8,23.5,3.66,53.3,20.2,17.8,2.4700000000000002,118,32.200000000000003]
["HSS","HSS10x6x0.250","HSS10x6x1/4","10x6x0.250","10x6","0.250",null,null,null,null,null,null,"Rectangle",25.82,7.1,10,9.3000000000000007,6,5.3,0.25,0.23300000000000001,22.8,39.9,96.9,23.6,19.399999999999999,3.69,44.1,16.600000000000001,14.7,2.4900000000000002,96.7,26.2]
["HSS","HSS10x6x0.188","HSS10x6x3/16","10x6x0.188","10x6","0.188",null,null,null,null,null,null,"Rectangle",19.63,5.37,10,9.48,6,5.48,0.1875,0.17399999999999999,31.5,54.5,74.599999999999994,18,14.9,3.73,34.1,12.7,11.4,2.52,73.8,19.899999999999999]
["HSS","HSS10x5x0.375","HSS10x5x3/8","10x5x0.375","10x5","0.375",null,null,null,null,null,null,"Rectangle",35.130000000000003,9.67,10,8.9499999999999993,5,3.95,0.375,0.34899999999999998,11.3,25.7,120,30.4,24.1,3.53,40.6,18.7,16.2,2.0499999999999998,100,31.2]
["HSS","HSS10x5x0.313","HSS10x5x5/16","10x5x0.313","10x5","0.313",null,null,null,null,null,null,"Rectangle",29.72,8.17,10,9.1300000000000008,5,4.13,0.3125,0.29099999999999998,14.2,31.4,104,26,20.8,3.56,35.200000000000003,16,14.1,2.0699999999999998,86,26.5]
["HSS","HSS10x5x0.250","HSS10x5x1/4","10x5x0.250","10x5","0.250",null,null,null,null,null,null,"Rectangle",24.12,6.63,10,9.3000000000000007,5,4.3,0.25,0.23300000000000001,18.5,39.9,85.8,21.3,17.2,3.6,29.3,13.2,11.7,2.1,70.7,21.6]
["HSS","HSS10x4x0.625","HSS10x4x5/8","10x4x0.625","10x4","0.625",null,null,null,null,null,null,"Rectangle",50.81,14,10,8.26,4,2.2599999999999998,0.625,0.58099999999999996,3.88,14.2,149,40.299999999999997,29.9,3.26,33.5,20.6,16.8,1.54,95.7,36.700000000000003]
["HSS","HSS10x4x0.500","HSS10x4x1/2","10x4x0.500","10x4","0.500",null,null,null,null,null,null,"Rectangle",42.05,11.6,10,8.6,4,2.6,0.5,0.46500000000000002,5.6,18.5,129,34.1,25.8,3.34,29.5,17.600000000000001,14.7,1.59,82.6,31]
["HSS","HSS10x4x0.375","HSS10x4x3/8","10x4x0.375","10x4","0.375",null,null,null,null,null,null,"Rectangle",32.58,8.9700000000000006,10,8.9499999999999993,4,2.95,0.375,0.34899999999999998,8.4600000000000009,25.7,104,27,20.8,3.41,24.3,14,12.1,1.64,66.5,24.4]
["HSS","HSS10x4x0.313","HSS10x4x5/16","10x4x0.313","10x4","0.313",null,null,null,null,null,null,"Rectangle",27.59,7.59,10,9.1300000000000008,4,3.13,0.3125,0.29099999999999998,10.7,31.4,90.1,23.1,18,3.44,21.2,12.1,10.6,1.67,57.3,20.9]
["HSS","HSS10x4x0.250","HSS10x4x1/4","10x4x0.250","10x4","0.250",null,null,null,null,null,null,"Rectangle",22.42,6.17,10,9.3000000000000007,4,3.3,0.25,0.23300000000000001,14.2,39.9,74.7,19,14.9,3.48,17.7,10,8.8699999999999992,1.7,47.4,17.100000000000001]
["HSS","HSS10x4x0.188","HSS10x4x3/16","10x4x0.188","10x4","0.188",null,null,null,null,null,null,"Rectangle",17.079999999999998,4.67,10,9.48,4,3.48,0.1875,0.17399999999999999,20,54.5,57.8,14.6,11.6,3.52,13.9,7.66,6.93,1.72,36.5,13.1]
["HSS","HSS10x4x0.125","HSS10x4x1/8","10x4x0.125","10x4","0.125",null,null,null,null,null,null,"Rectangle",11.56,3.16,10,9.65,4,3.65,0.125,0.11600000000000001,31.5,83.2,39.799999999999997,10,7.97,3.55,9.65,5.26,4.83,1.75,25.1,8.9]
["HSS","HSS10x3.5x0.375","HSS10x3.5x3/8","10x3.5x0.375","10x3.5","0.375",null,null,null,null,null,null,"Rectangle",31.31,8.6199999999999992,10,8.9499999999999993,3.5,2.4500000000000002,0.375,0.34899999999999998,7.03,25.7,96.1,25.3,19.2,3.34,17.8,11.8,10.199999999999999,1.44,51.5,21.1]
["HSS","HSS10x3.5x0.313","HSS10x3.5x5/16","10x3.5x0.313","10x3.5","0.313",null,null,null,null,null,null,"Rectangle",26.53,7.3,10,9.1300000000000008,3.5,2.63,0.3125,0.29099999999999998,9.0299999999999994,31.4,83.2,21.7,16.600000000000001,3.38,15.6,10.199999999999999,8.92,1.46,44.6,18]
["HSS","HSS10x3.5x0.250","HSS10x3.5x1/4","10x3.5x0.250","10x3.5","0.250",null,null,null,null,null,null,"Rectangle",21.57,5.93,10,9.3000000000000007,3.5,2.8,0.25,0.23300000000000001,12,39.9,69.099999999999994,17.899999999999999,13.8,3.41,13.1,8.4499999999999993,7.51,1.49,37,14.8]
["HSS","HSS10x3.5x0.188","HSS10x3.5x3/16","10x3.5x0.188","10x3.5","0.188",null,null,null,null,null,null,"Rectangle",16.440000000000001,4.5,10,9.48,3.5,2.98,0.1875,0.17399999999999999,17.100000000000001,54.5,53.6,13.7,10.7,3.45,10.3,6.52,5.89,1.51,28.6,11.4]
["HSS","HSS10x3x0.375","HSS10x3x3/8","10x3x0.375","10x3","0.375",null,null,null,null,null,null,"Rectangle",30.03,8.27,10,8.9499999999999993,3,1.95,0.375,0.34899999999999998,5.6,25.7,88,23.7,17.600000000000001,3.26,12.4,9.73,8.2799999999999994,1.22,37.799999999999997,17.7]
["HSS","HSS10x3x0.313","HSS10x3x5/16","10x3x0.313","10x3","0.313",null,null,null,null,null,null,"Rectangle",25.46,7.01,10,9.1300000000000008,3,2.13,0.3125,0.29099999999999998,7.31,31.4,76.3,20.3,15.3,3.3,11,8.42,7.3,1.25,33,15.2]
["HSS","HSS10x3x0.250","HSS10x3x1/4","10x3x0.250","10x3","0.250",null,null,null,null,null,null,"Rectangle",20.72,5.7,10,9.3000000000000007,3,2.2999999999999998,0.25,0.23300000000000001,9.8800000000000008,39.9,63.6,16.7,12.7,3.34,9.2799999999999994,6.99,6.19,1.28,27.6,12.5]
["HSS","HSS10x3x0.188","HSS10x3x3/16","10x3x0.188","10x3","0.188",null,null,null,null,null,null,"Rectangle",15.8,4.32,10,9.48,3,2.48,0.1875,0.17399999999999999,14.2,54.5,49.4,12.8,9.8699999999999992,3.38,7.33,5.41,4.8899999999999997,1.3,21.5,9.64]
["HSS","HSS10x3x0.125","HSS10x3x1/8","10x3x0.125","10x3","0.125",null,null,null,null,null,null,"Rectangle",10.71,2.93,10,9.65,3,2.65,0.125,0.11600000000000001,22.9,83.2,34.200000000000003,8.8000000000000007,6.83,3.42,5.16,3.74,3.44,1.33,14.9,6.61]
["HSS","HSS10x2x0.375","HSS10x2x3/8","10x2x0.375","10x2","0.375",null,null,null,null,null,null,"Rectangle",27.48,7.58,10,8.9499999999999993,2,0.95299999999999996,0.375,0.34899999999999998,2.73,25.7,71.7,20.3,14.3,3.08,4.7,5.76,4.7,0.78700000000000003,15.9,11]
["HSS","HSS10x2x0.313","HSS10x2x5/16","10x2x0.313","10x2","0.313",null,null,null,null,null,null,"Rectangle",23.34,6.43,10,9.1300000000000008,2,1.1299999999999999,0.3125,0.29099999999999998,3.87,31.4,62.6,17.5,12.5,3.12,4.24,5.0599999999999996,4.24,0.81200000000000006,14.2,9.56]
["HSS","HSS10x2x0.250","HSS10x2x1/4","10x2x0.250","10x2","0.250",null,null,null,null,null,null,"Rectangle",19.02,5.24,10,9.3000000000000007,2,1.3,0.25,0.23300000000000001,5.58,39.9,52.5,14.4,10.5,3.17,3.67,4.26,3.67,0.83799999999999997,12.2,7.99]
["HSS","HSS10x2x0.188","HSS10x2x3/16","10x2x0.188","10x2","0.188",null,null,null,null,null,null,"Rectangle",14.53,3.98,10,9.48,2,1.48,0.1875,0.17399999999999999,8.49,54.5,41,11.1,8.19,3.21,2.97,3.34,2.97,0.86399999999999999,9.74,6.22]
["HSS","HSS10x2x0.125","HSS10x2x1/8","10x2x0.125","10x2","0.125",null,null,null,null,null,null,"Rectangle",9.86,2.7,10,9.65,2,1.65,0.125,0.11600000000000001,14.2,83.2,28.5,7.65,5.7,3.25,2.14,2.33,2.14,0.89,6.9,4.3099999999999996]
["HSS","HSS9x7x0.625","HSS9x7x5/8","9x7x0.625","9x7","0.625",null,null,null,null,null,null,"Rectangle",59.32,16.399999999999999,9,7.26,7,5.26,0.625,0.58099999999999996,9.0500000000000007,12.5,174,48.3,38.700000000000003,3.26,117,40.5,33.5,2.68,235,62]
["HSS","HSS9x7x0.500","HSS9x7x1/2","9x7x0.500","9x7","0.500",null,null,null,null,null,null,"Rectangle",48.85,13.5,9,7.6,7,5.6,0.5,0.46500000000000002,12.1,16.399999999999999,149,40.5,33,3.32,100,34,28.7,2.73,197,51.5]
["HSS","HSS9x7x0.375","HSS9x7x3/8","9x7x0.375","9x7","0.375",null,null,null,null,null,null,"Rectangle",37.69,10.4,9,7.95,7,5.95,0.375,0.34899999999999998,17.100000000000001,22.8,119,31.8,26.4,3.38,80.400000000000006,26.7,23,2.78,154,40]
["HSS","HSS9x7x0.313","HSS9x7x5/16","9x7x0.313","9x7","0.313",null,null,null,null,null,null,"Rectangle",31.84,8.76,9,8.1300000000000008,7,6.13,0.3125,0.29099999999999998,21.1,27.9,102,27.1,22.6,3.41,69.2,22.8,19.8,2.81,131,33.9]
["HSS","HSS9x7x0.250","HSS9x7x1/4","9x7x0.250","9x7","0.250",null,null,null,null,null,null,"Rectangle",25.82,7.1,9,8.3000000000000007,7,6.3,0.25,0.23300000000000001,27,35.6,84.1,22.2,18.7,3.44,57.2,18.7,16.3,2.84,107,27.6]
["HSS","HSS9x7x0.188","HSS9x7x3/16","9x7x0.188","9x7","0.188",null,null,null,null,null,null,"Rectangle",19.63,5.37,9,8.48,7,6.48,0.1875,0.17399999999999999,37.200000000000003,48.7,64.7,16.899999999999999,14.4,3.47,44.1,14.3,12.6,2.87,81.7,20.9]
["HSS","HSS9x5x0.625","HSS9x5x5/8","9x5x0.625","9x5","0.625",null,null,null,null,null,null,"Rectangle",50.81,14,9,7.26,5,3.26,0.625,0.58099999999999996,5.61,12.5,133,38.5,29.6,3.08,52,25.3,20.8,1.92,128,42.5]
["HSS","HSS9x5x0.500","HSS9x5x1/2","9x5x0.500","9x5","0.500",null,null,null,null,null,null,"Rectangle",42.05,11.6,9,7.6,5,3.6,0.5,0.46500000000000002,7.75,16.399999999999999,115,32.5,25.5,3.14,45.2,21.5,18.100000000000001,1.97,109,35.6]
["HSS","HSS9x5x0.375","HSS9x5x3/8","9x5x0.375","9x5","0.375",null,null,null,null,null,null,"Rectangle",32.58,8.9700000000000006,9,7.95,5,3.95,0.375,0.34899999999999998,11.3,22.8,92.5,25.7,20.5,3.21,36.799999999999997,17.100000000000001,14.7,2.0299999999999998,86.9,27.9]
["HSS","HSS9x5x0.313","HSS9x5x5/16","9x5x0.313","9x5","0.313",null,null,null,null,null,null,"Rectangle",27.59,7.59,9,8.1300000000000008,5,4.13,0.3125,0.29099999999999998,14.2,27.9,79.8,22,17.7,3.24,32,14.6,12.8,2.0499999999999998,74.400000000000006,23.8]
["HSS","HSS9x5x0.250","HSS9x5x1/4","9x5x0.250","9x5","0.250",null,null,null,null,null,null,"Rectangle",22.42,6.17,9,8.3000000000000007,5,4.3,0.25,0.23300000000000001,18.5,35.6,66.099999999999994,18.100000000000001,14.7,3.27,26.6,12,10.6,2.08,61.2,19.399999999999999]
["HSS","HSS9x5x0.188","HSS9x5x3/16","9x5x0.188","9x5","0.188",null,null,null,null,null,null,"Rectangle",17.079999999999998,4.67,9,8.48,5,4.4800000000000004,0.1875,0.17399999999999999,25.7,48.7,51.1,13.8,11.4,3.31,20.7,9.25,8.2799999999999994,2.1,46.9,14.8]
["HSS","HSS9x3x0.500","HSS9x3x1/2","9x3x0.500","9x3","0.500",null,null,null,null,null,null,"Rectangle",35.24,9.74,9,7.6,3,1.6,0.5,0.46500000000000002,3.45,16.399999999999999,80.8,24.6,18,2.88,13.2,10.8,8.81,1.17,40,19.7]
["HSS","HSS9x3x0.375","HSS9x3x3/8","9x3x0.375","9x3","0.375",null,null,null,null,null,null,"Rectangle",27.48,7.58,9,7.95,3,1.95,0.375,0.34899999999999998,5.6,22.8,66.3,19.7,14.7,2.96,11.2,8.8000000000000007,7.45,1.21,33.1,15.8]
["HSS","HSS9x3x0.313","HSS9x3x5/16","9x3x0.313","9x3","0.313",null,null,null,null,null,null,"Rectangle",23.34,6.43,9,8.1300000000000008,3,2.13,0.3125,0.29099999999999998,7.31,27.9,57.7,16.899999999999999,12.8,3,9.8800000000000008,7.63,6.59,1.24,28.9,13.6]
["HSS","HSS9x3x0.250","HSS9x3x1/4","9x3x0.250","9x3","0.250",null,null,null,null,null,null,"Rectangle",19.02,5.24,9,8.3000000000000007,3,2.2999999999999998,0.25,0.23300000000000001,9.8800000000000008,35.6,48.2,14,10.7,3.04,8.3800000000000008,6.35,5.59,1.27,24.2,11.3]
["HSS","HSS9x3x0.188","HSS9x3x3/16","9x3x0.188","9x3","0.188",null,null,null,null,null,null,"Rectangle",14.53,3.98,9,8.48,3,2.48,0.1875,0.17399999999999999,14.2,48.7,37.6,10.8,8.35,3.07,6.64,4.92,4.42,1.29,18.899999999999999,8.66]
["HSS","HSS8x6x0.625","HSS8x6x5/8","8x6x0.625","8x6","0.625",null,null,null,null,null,null,"Rectangle",50.81,14,8,6.26,6,4.26,0.625,0.58099999999999996,7.33,10.8,114,36.1,28.5,2.85,72.3,29.5,24.1,2.27,150,46]
["HSS","HSS8x6x0.500","HSS8x6x1/2","8x6x0.500","8x6","0.500",null,null,null,null,null,null,"Rectangle",42.05,11.6,8,6.6,6,4.6100000000000003,0.5,0.46500000000000002,9.9,14.2,98.2,30.5,24.6,2.91,62.5,24.9,20.8,2.3199999999999998,127,38.4]
["HSS","HSS8x6x0.375","HSS8x6x3/8","8x6x0.375","8x6","0.375",null,null,null,null,null,null,"Rectangle",32.58,8.9700000000000006,8,6.95,6,4.95,0.375,0.34899999999999998,14.2,19.899999999999999,79.099999999999994,24.1,19.8,2.97,50.6,19.8,16.899999999999999,2.38,100,30]
["HSS","HSS8x6x0.313","HSS8x6x5/16","8x6x0.313","8x6","0.313",null,null,null,null,null,null,"Rectangle",27.59,7.59,8,7.13,6,5.13,0.3125,0.29099999999999998,17.600000000000001,24.5,68.3,20.6,17.100000000000001,3,43.8,16.899999999999999,14.6,2.4,85.8,25.5]
["HSS","HSS8x6x0.250","HSS8x6x1/4","8x6x0.250","8x6","0.250",null,null,null,null,null,null,"Rectangle",22.42,6.17,8,7.3,6,5.3,0.25,0.23300000000000001,22.8,31.3,56.6,16.899999999999999,14.2,3.03,36.4,13.9,12.1,2.4300000000000002,70.3,20.8]
["HSS","HSS8x6x0.188","HSS8x6x3/16","8x6x0.188","8x6","0.188",null,null,null,null,null,null,"Rectangle",17.079999999999998,4.67,8,7.48,6,5.48,0.1875,0.17399999999999999,31.5,43,43.7,13,10.9,3.06,28.2,10.7,9.39,2.46,53.7,15.8]
["HSS","HSS8x4x0.625","HSS8x4x5/8","8x4x0.625","8x4","0.625",null,null,null,null,null,null,"Rectangle",42.3,11.7,8,6.26,4,2.2599999999999998,0.625,0.58099999999999996,3.88,10.8,82,27.4,20.5,2.64,26.6,16.600000000000001,13.3,1.51,70.3,28.7]
["HSS","HSS8x4x0.500","HSS8x4x1/2","8x4x0.500","8x4","0.500",null,null,null,null,null,null,"Rectangle",35.24,9.74,8,6.6,4,2.6,0.5,0.46500000000000002,5.6,14.2,71.8,23.5,17.899999999999999,2.71,23.6,14.3,11.8,1.56,61.1,24.4]
["HSS","HSS8x4x0.375","HSS8x4x3/8","8x4x0.375","8x4","0.375",null,null,null,null,null,null,"Rectangle",27.48,7.58,8,6.95,4,2.95,0.375,0.34899999999999998,8.4600000000000009,19.899999999999999,58.7,18.8,14.7,2.78,19.600000000000001,11.5,9.8000000000000007,1.61,49.3,19.3]
["HSS","HSS8x4x0.313","HSS8x4x5/16","8x4x0.313","8x4","0.313",null,null,null,null,null,null,"Rectangle",23.34,6.43,8,7.13,4,3.13,0.3125,0.29099999999999998,10.7,24.5,51,16.100000000000001,12.8,2.82,17.2,9.91,8.58,1.63,42.6,16.5]
["HSS","HSS8x4x0.250","HSS8x4x1/4","8x4x0.250","8x4","0.250",null,null,null,null,null,null,"Rectangle",19.02,5.24,8,7.3,4,3.3,0.25,0.23300000000000001,14.2,31.3,42.5,13.3,10.6,2.85,14.4,8.1999999999999993,7.21,1.66,35.299999999999997,13.6]
["HSS","HSS8x4x0.188","HSS8x4x3/16","8x4x0.188","8x4","0.188",null,null,null,null,null,null,"Rectangle",14.53,3.98,8,7.48,4,3.48,0.1875,0.17399999999999999,20,43,33.1,10.199999999999999,8.27,2.88,11.3,6.33,5.65,1.69,27.2,10.4]
["HSS","HSS8x4x0.125","HSS8x4x1/8","8x4x0.125","8x4","0.125",null,null,null,null,null,null,"Rectangle",9.86,2.7,8,7.65,4,3.65,0.125,0.11600000000000001,31.5,66,22.9,7.02,5.73,2.92,7.9,4.3600000000000003,3.95,1.71,18.7,7.1]
["HSS","HSS8x3x0.500","HSS8x3x1/2","8x3x0.500","8x3","0.500",null,null,null,null,null,null,"Rectangle",31.84,8.81,8,6.6,3,1.6,0.5,0.46500000000000002,3.45,14.2,58.6,20,14.6,2.58,11.7,9.64,7.81,1.1499999999999999,34.299999999999997,17.399999999999999]
["HSS","HSS8x3x0.375","HSS8x3x3/8","8x3x0.375","8x3","0.375",null,null,null,null,null,null,"Rectangle",24.93,6.88,8,6.95,3,1.95,0.375,0.34899999999999998,5.6,19.899999999999999,48.5,16.100000000000001,12.1,2.65,10,7.88,6.63,1.2,28.5,14]
["HSS","HSS8x3x0.313","HSS8x3x5/16","8x3x0.313","8x3","0.313",null,null,null,null,null,null,"Rectangle",21.21,5.85,8,7.13,3,2.13,0.3125,0.29099999999999998,7.31,24.5,42.4,13.9,10.6,2.69,8.81,6.84,5.87,1.23,24.9,12.1]
["HSS","HSS8x3x0.250","HSS8x3x1/4","8x3x0.250","8x3","0.250",null,null,null,null,null,null,"Rectangle",17.32,4.7699999999999996,8,7.3,3,2.2999999999999998,0.25,0.23300000000000001,9.8800000000000008,31.3,35.5,11.5,8.8800000000000008,2.73,7.49,5.7,4.99,1.25,20.8,10]
["HSS","HSS8x3x0.188","HSS8x3x3/16","8x3x0.188","8x3","0.188",null,null,null,null,null,null,"Rectangle",13.25,3.63,8,7.48,3,2.48,0.1875,0.17399999999999999,14.2,43,27.8,8.8699999999999992,6.94,2.77,5.94,4.43,3.96,1.28,16.2,7.68]
["HSS","HSS8x3x0.125","HSS8x3x1/8","8x3x0.125","8x3","0.125",null,null,null,null,null,null,"Rectangle",9.01,2.46,8,7.65,3,2.65,0.125,0.11600000000000001,22.9,66,19.3,6.11,4.83,2.8,4.2,3.07,2.8,1.31,11.3,5.27]
["HSS","HSS8x2x0.500","HSS8x2x1/2","8x2x0.500","8x2","0.500",null,null,null,null,null,null,"Rectangle",28.43,7.88,8,6.61,2,"0.605",0.5,0.46500000000000002,1.3,14.2,45.3,16.5,11.3,2.4,4.1900000000000004,5.47,4.1900000000000004,0.73,13.6,10.4]
["HSS","HSS8x2x0.375","HSS8x2x3/8","8x2x0.375","8x2","0.375",null,null,null,null,null,null,"Rectangle",22.37,6.18,8,6.95,2,0.95299999999999996,0.375,0.34899999999999998,2.73,19.899999999999999,38.200000000000003,13.4,9.56,2.4900000000000002,3.73,4.6100000000000003,3.73,0.77700000000000002,12.1,8.65]
["HSS","HSS8x2x0.313","HSS8x2x5/16","8x2x0.313","8x2","0.313",null,null,null,null,null,null,"Rectangle",19.079999999999998,5.26,8,7.13,2,1.1299999999999999,0.3125,0.29099999999999998,3.87,24.5,33.700000000000003,11.6,8.43,2.5299999999999998,3.38,4.0599999999999996,3.38,0.80200000000000005,10.9,7.57]
["HSS","HSS8x2x0.250","HSS8x2x1/4","8x2x0.250","8x2","0.250",null,null,null,null,null,null,"Rectangle",15.62,4.3,8,7.3,2,1.3,0.25,0.23300000000000001,5.58,31.3,28.5,9.68,7.12,2.57,2.94,3.43,2.94,0.82699999999999996,9.36,6.35]
["HSS","HSS8x2x0.188","HSS8x2x3/16","8x2x0.188","8x2","0.188",null,null,null,null,null,null,"Rectangle",11.97,3.28,8,7.48,2,1.48,0.1875,0.17399999999999999,8.49,43,22.4,7.51,5.61,2.61,2.39,2.7,2.39,0.85299999999999998,7.48,4.95]
["HSS","HSS8x2x0.125","HSS8x2x1/8","8x2x0.125","8x2","0.125",null,null,null,null,null,null,"Rectangle",8.16,2.23,8,7.65,2,1.65,0.125,0.11600000000000001,14.2,66,15.7,5.19,3.93,2.65,1.72,1.9,1.72,0.879,5.3,3.44]
["HSS","HSS7x5x0.500","HSS7x5x1/2","7x5x0.500","7x5","0.500",null,null,null,null,null,null,"Rectangle",35.24,9.74,7,5.6,5,3.6,0.5,0.46500000000000002,7.75,12.1,60.6,21.9,17.3,2.5,35.6,17.3,14.2,1.91,75.8,27.2]
["HSS","HSS7x5x0.375","HSS7x5x3/8","7x5x0.375","7x5","0.375",null,null,null,null,null,null,"Rectangle",27.48,7.58,7,5.95,5,3.95,0.375,0.34899999999999998,11.3,17.100000000000001,49.5,17.5,14.1,2.56,29.3,13.8,11.7,1.97,60.6,21.4]
["HSS","HSS7x5x0.313","HSS7x5x5/16","7x5x0.313","7x5","0.313",null,null,null,null,null,null,"Rectangle",23.34,6.43,7,6.13,5,4.13,0.3125,0.29099999999999998,14.2,21.1,43,15,12.3,2.59,25.5,11.9,10.199999999999999,1.99,52.1,18.3]
["HSS","HSS7x5x0.250","HSS7x5x1/4","7x5x0.250","7x5","0.250",null,null,null,null,null,null,"Rectangle",19.02,5.24,7,6.3,5,4.3,0.25,0.23300000000000001,18.5,27,35.9,12.4,10.199999999999999,2.62,21.3,9.83,8.5299999999999994,2.02,42.9,15]
["HSS","HSS7x5x0.188","HSS7x5x3/16","7x5x0.188","7x5","0.188",null,null,null,null,null,null,"Rectangle",14.53,3.98,7,6.48,5,4.4800000000000004,0.1875,0.17399999999999999,25.7,37.200000000000003,27.9,9.52,7.96,2.65,16.600000000000001,7.57,6.65,2.0499999999999998,32.9,11.4]
["HSS","HSS7x5x0.125","HSS7x5x1/8","7x5x0.125","7x5","0.125",null,null,null,null,null,null,"Rectangle",9.86,2.7,7,6.65,5,4.6500000000000004,0.125,0.11600000000000001,40.1,57.3,19.3,6.53,5.52,2.68,11.6,5.2,4.63,2.0699999999999998,22.5,7.79]
["HSS","HSS7x4x0.500","HSS7x4x1/2","7x4x0.500","7x4","0.500",null,null,null,null,null,null,"Rectangle",31.84,8.81,7,5.6,4,2.6,0.5,0.46500000000000002,5.6,12.1,50.7,18.8,14.5,2.4,20.7,12.6,10.4,1.53,50.5,21.1]
["HSS","HSS7x4x0.375","HSS7x4x3/8","7x4x0.375","7x4","0.375",null,null,null,null,null,null,"Rectangle",24.93,6.88,7,5.95,4,2.95,0.375,0.34899999999999998,8.4600000000000009,17.100000000000001,41.8,15.1,11.9,2.46,17.3,10.199999999999999,8.6300000000000008,1.58,41,16.8]
["HSS","HSS7x4x0.313","HSS7x4x5/16","7x4x0.313","7x4","0.313",null,null,null,null,null,null,"Rectangle",21.21,5.85,7,6.13,4,3.13,0.3125,0.29099999999999998,10.7,21.1,36.5,13.1,10.4,2.5,15.2,8.83,7.58,1.61,35.4,14.4]
["HSS","HSS7x4x0.250","HSS7x4x1/4","7x4x0.250","7x4","0.250",null,null,null,null,null,null,"Rectangle",17.32,4.7699999999999996,7,6.3,4,3.3,0.25,0.23300000000000001,14.2,27,30.5,10.8,8.7200000000000006,2.5299999999999998,12.8,7.33,6.38,1.64,29.3,11.8]
["HSS","HSS7x4x0.188","HSS7x4x3/16","7x4x0.188","7x4","0.188",null,null,null,null,null,null,"Rectangle",13.25,3.63,7,6.48,4,3.48,0.1875,0.17399999999999999,20,37.200000000000003,23.8,8.33,6.81,2.56,10,5.67,5.0199999999999996,1.66,22.7,9.07]
["HSS","HSS7x4x0.125","HSS7x4x1/8","7x4x0.125","7x4","0.125",null,null,null,null,null,null,"Rectangle",9.01,2.46,7,6.65,4,3.65,0.125,0.11600000000000001,31.5,57.3,16.600000000000001,5.73,4.7300000000000004,2.59,7.03,3.91,3.51,1.69,15.6,6.2]
["HSS","HSS7x3x0.500","HSS7x3x1/2","7x3x0.500","7x3","0.500",null,null,null,null,null,null,"Rectangle",28.43,7.88,7,5.6,3,1.6,0.5,0.46500000000000002,3.45,12.1,40.700000000000003,15.8,11.6,2.27,10.199999999999999,8.4600000000000009,6.8,1.1399999999999999,28.6,15]
["HSS","HSS7x3x0.375","HSS7x3x3/8","7x3x0.375","7x3","0.375",null,null,null,null,null,null,"Rectangle",22.37,6.18,7,5.95,3,1.95,0.375,0.34899999999999998,5.6,17.100000000000001,34.1,12.8,9.73,2.35,8.7100000000000009,6.95,5.81,1.19,23.9,12.1]
["HSS","HSS7x3x0.313","HSS7x3x5/16","7x3x0.313","7x3","0.313",null,null,null,null,null,null,"Rectangle",19.079999999999998,5.26,7,6.13,3,2.13,0.3125,0.29099999999999998,7.31,21.1,29.9,11.1,8.5399999999999991,2.38,7.74,6.05,5.16,1.21,20.9,10.5]
["HSS","HSS7x3x0.250","HSS7x3x1/4","7x3x0.250","7x3","0.250",null,null,null,null,null,null,"Rectangle",15.62,4.3,7,6.3,3,2.2999999999999998,0.25,0.23300000000000001,9.8800000000000008,27,25.2,9.2200000000000006,7.19,2.42,6.6,5.0599999999999996,4.4000000000000004,1.24,17.5,8.68]
["HSS","HSS7x3x0.188","HSS7x3x3/16","7x3x0.188","7x3","0.188",null,null,null,null,null,null,"Rectangle",11.97,3.28,7,6.48,3,2.48,0.1875,0.17399999999999999,14.2,37.200000000000003,19.8,7.14,5.65,2.4500000000000002,5.24,3.94,3.5,1.26,13.7,6.69]
["HSS","HSS7x3x0.125","HSS7x3x1/8","7x3x0.125","7x3","0.125",null,null,null,null,null,null,"Rectangle",8.16,2.23,7,6.65,3,2.65,0.125,0.11600000000000001,22.9,57.3,13.8,4.93,3.95,2.4900000000000002,3.71,2.73,2.48,1.29,9.48,4.5999999999999996]
["HSS","HSS7x2x0.250","HSS7x2x1/4","7x2x0.250","7x2","0.250",null,null,null,null,null,null,"Rectangle",13.91,3.84,7,6.3,2,1.3,0.25,0.23300000000000001,5.58,27,19.8,7.64,5.67,2.27,2.58,3.02,2.58,0.81899999999999995,7.95,5.52]
["HSS","HSS7x2x0.188","HSS7x2x3/16","7x2x0.188","7x2","0.188",null,null,null,null,null,null,"Rectangle",10.7,2.93,7,6.48,2,1.48,0.1875,0.17399999999999999,8.49,37.200000000000003,15.7,5.95,4.49,2.31,2.1,2.39,2.1,0.84499999999999997,6.35,4.32]
["HSS","HSS7x2x0.125","HSS7x2x1/8","7x2x0.125","7x2","0.125",null,null,null,null,null,null,"Rectangle",7.31,2,7,6.65,2,1.65,0.125,0.11600000000000001,14.2,57.3,11.1,4.13,3.16,2.35,1.52,1.68,1.52,0.871,4.51,3]
["HSS","HSS6x5x0.500","HSS6x5x1/2","6x5x0.500","6x5","0.500",null,null,null,null,null,null,"Rectangle",31.84,8.81,6,4.6100000000000003,5,3.6,0.5,0.46500000000000002,7.75,9.9,41.1,17.2,13.7,2.16,30.8,15.2,12.3,1.87,59.8,23]
["HSS","HSS6x5x0.375","HSS6x5x3/8","6x5x0.375","6x5","0.375",null,null,null,null,null,null,"Rectangle",24.93,6.88,6,4.95,5,3.95,0.375,0.34899999999999998,11.3,14.2,33.9,13.8,11.3,2.2200000000000002,25.5,12.2,10.199999999999999,1.92,48.1,18.2]
["HSS","HSS6x5x0.313","HSS6x5x5/16","6x5x0.313","6x5","0.313",null,null,null,null,null,null,"Rectangle",21.21,5.85,6,5.13,5,4.13,0.3125,0.29099999999999998,14.2,17.600000000000001,29.6,11.9,9.85,2.25,22.3,10.5,8.91,1.95,41.4,15.6]
["HSS","HSS6x5x0.250","HSS6x5x1/4","6x5x0.250","6x5","0.250",null,null,null,null,null,null,"Rectangle",17.32,4.7699999999999996,6,5.3,5,4.3,0.25,0.23300000000000001,18.5,22.8,24.7,9.8699999999999992,8.25,2.2799999999999998,18.7,8.7200000000000006,7.47,1.98,34.200000000000003,12.8]
["HSS","HSS6x5x0.188","HSS6x5x3/16","6x5x0.188","6x5","0.188",null,null,null,null,null,null,"Rectangle",13.25,3.63,6,5.48,5,4.4800000000000004,0.1875,0.17399999999999999,25.7,31.5,19.3,7.62,6.44,2.31,14.6,6.73,5.84,2.0099999999999998,26.3,9.76]
["HSS","HSS6x5x0.125","HSS6x5x1/8","6x5x0.125","6x5","0.125",null,null,null,null,null,null,"Rectangle",9.01,2.46,6,5.65,5,4.6500000000000004,0.125,0.11600000000000001,40.1,48.7,13.4,5.24,4.4800000000000004,2.34,10.199999999999999,4.63,4.07,2.0299999999999998,18,6.66]
["HSS","HSS6x4x0.500","HSS6x4x1/2","6x4x0.500","6x4","0.500",null,null,null,null,null,null,"Rectangle",28.43,7.88,6,4.6100000000000003,4,2.6,0.5,0.46500000000000002,5.6,9.9,34,14.6,11.3,2.08,17.8,11,8.89,1.5,40.299999999999997,17.8]
["HSS","HSS6x4x0.375","HSS6x4x3/8","6x4x0.375","6x4","0.375",null,null,null,null,null,null,"Rectangle",22.37,6.18,6,4.95,4,2.95,0.375,0.34899999999999998,8.4600000000000009,14.2,28.3,11.9,9.43,2.14,14.9,8.94,7.47,1.55,32.799999999999997,14.2]
["HSS","HSS6x4x0.313","HSS6x4x5/16","6x4x0.313","6x4","0.313",null,null,null,null,null,null,"Rectangle",19.079999999999998,5.26,6,5.13,4,3.13,0.3125,0.29099999999999998,10.7,17.600000000000001,24.8,10.3,8.27,2.17,13.2,7.75,6.58,1.58,28.4,12.2]
["HSS","HSS6x4x0.250","HSS6x4x1/4","6x4x0.250","6x4","0.250",null,null,null,null,null,null,"Rectangle",15.62,4.3,6,5.3,4,3.3,0.25,0.23300000000000001,14.2,22.8,20.9,8.5299999999999994,6.96,2.2000000000000002,11.1,6.45,5.56,1.61,23.6,10.1]
["HSS","HSS6x4x0.188","HSS6x4x3/16","6x4x0.188","6x4","0.188",null,null,null,null,null,null,"Rectangle",11.97,3.28,6,5.48,4,3.48,0.1875,0.17399999999999999,20,31.5,16.399999999999999,6.6,5.46,2.23,8.76,5,4.38,1.63,18.2,7.74]
["HSS","HSS6x4x0.125","HSS6x4x1/8","6x4x0.125","6x4","0.125",null,null,null,null,null,null,"Rectangle",8.16,2.23,6,5.65,4,3.65,0.125,0.11600000000000001,31.5,48.7,11.4,4.5599999999999996,3.81,2.2599999999999998,6.15,3.46,3.08,1.66,12.6,5.3]
["HSS","HSS6x3x0.500","HSS6x3x1/2","6x3x0.500","6x3","0.500",null,null,null,null,null,null,"Rectangle",25.03,6.95,6,4.6100000000000003,3,1.6,0.5,0.46500000000000002,3.45,9.9,26.8,12.1,8.9499999999999993,1.97,8.69,7.28,5.79,1.1200000000000001,23.1,12.7]
["HSS","HSS6x3x0.375","HSS6x3x3/8","6x3x0.375","6x3","0.375",null,null,null,null,null,null,"Rectangle",19.82,5.48,6,4.95,3,1.95,0.375,0.34899999999999998,5.6,14.2,22.7,9.9,7.57,2.04,7.48,6.03,4.99,1.17,19.3,10.3]
["HSS","HSS6x3x0.313","HSS6x3x5/16","6x3x0.313","6x3","0.313",null,null,null,null,null,null,"Rectangle",16.96,4.68,6,5.13,3,2.13,0.3125,0.29099999999999998,7.31,17.600000000000001,20.100000000000001,8.61,6.69,2.0699999999999998,6.67,5.27,4.45,1.19,16.899999999999999,8.91]
["HSS","HSS6x3x0.250","HSS6x3x1/4","6x3x0.250","6x3","0.250",null,null,null,null,null,null,"Rectangle",13.91,3.84,6,5.3,3,2.2999999999999998,0.25,0.23300000000000001,9.8800000000000008,22.8,17,7.19,5.66,2.1,5.7,4.41,3.8,1.22,14.2,7.39]
["HSS","HSS6x3x0.188","HSS6x3x3/16","6x3x0.188","6x3","0.188",null,null,null,null,null,null,"Rectangle",10.7,2.93,6,5.48,3,2.48,0.1875,0.17399999999999999,14.2,31.5,13.4,5.59,4.47,2.14,4.55,3.45,3.03,1.25,11.1,5.71]
["HSS","HSS6x3x0.125","HSS6x3x1/8","6x3x0.125","6x3","0.125",null,null,null,null,null,null,"Rectangle",7.31,2,6,5.65,3,2.65,0.125,0.11600000000000001,22.9,48.7,9.43,3.87,3.14,2.17,3.23,2.4,2.15,1.27,7.73,3.93]
["HSS","HSS6x2x0.375","HSS6x2x3/8","6x2x0.375","6x2","0.375",null,null,null,null,null,null,"Rectangle",17.27,4.78,6,4.95,2,0.95299999999999996,0.375,0.34899999999999998,2.73,14.2,17.100000000000001,7.93,5.71,1.89,2.77,3.46,2.77,0.76,8.42,6.35]
["HSS","HSS6x2x0.313","HSS6x2x5/16","6x2x0.313","6x2","0.313",null,null,null,null,null,null,"Rectangle",14.83,4.0999999999999996,6,5.13,2,1.1299999999999999,0.3125,0.29099999999999998,3.87,17.600000000000001,15.3,6.95,5.1100000000000003,1.93,2.52,3.07,2.52,0.78500000000000003,7.6,5.58]
["HSS","HSS6x2x0.250","HSS6x2x1/4","6x2x0.250","6x2","0.250",null,null,null,null,null,null,"Rectangle",12.21,3.37,6,5.3,2,1.3,0.25,0.23300000000000001,5.58,22.8,13.1,5.84,4.37,1.97,2.21,2.61,2.21,0.81,6.55,4.7]
["HSS","HSS6x2x0.188","HSS6x2x3/16","6x2x0.188","6x2","0.188",null,null,null,null,null,null,"Rectangle",9.42,2.58,6,5.48,2,1.48,0.1875,0.17399999999999999,8.49,31.5,10.5,4.58,3.49,2.0099999999999998,1.8,2.0699999999999998,1.8,0.83599999999999997,5.24,3.68]
["HSS","HSS6x2x0.125","HSS6x2x1/8","6x2x0.125","6x2","0.125",null,null,null,null,null,null,"Rectangle",6.46,1.77,6,5.65,2,1.65,0.125,0.11600000000000001,14.2,48.7,7.42,3.19,2.4700000000000002,2.0499999999999998,1.31,1.46,1.31,0.86099999999999999,3.72,2.57]
["HSS","HSS5x4x0.500","HSS5x4x1/2","5x4x0.500","5x4","0.500",null,null,null,null,null,null,"Rectangle",25.03,6.95,5,3.6,4,2.6,0.5,0.46500000000000002,5.6,7.75,21.2,10.9,8.49,1.75,14.9,9.35,7.43,1.46,30.3,14.5]
["HSS","HSS5x4x0.375","HSS5x4x3/8","5x4x0.375","5x4","0.375",null,null,null,null,null,null,"Rectangle",19.82,5.48,5,3.95,4,2.95,0.375,0.34899999999999998,8.4600000000000009,11.3,17.899999999999999,8.9600000000000009,7.17,1.81,12.6,7.67,6.3,1.52,24.9,11.7]
["HSS","HSS5x4x0.313","HSS5x4x5/16","5x4x0.313","5x4","0.313",null,null,null,null,null,null,"Rectangle",16.96,4.68,5,4.13,4,3.13,0.3125,0.29099999999999998,10.7,14.2,15.8,7.79,6.32,1.84,11.1,6.67,5.57,1.54,21.7,10.1]
["HSS","HSS5x4x0.250","HSS5x4x1/4","5x4x0.250","5x4","0.250",null,null,null,null,null,null,"Rectangle",13.91,3.84,5,4.3,4,3.3,0.25,0.23300000000000001,14.2,18.5,13.4,6.49,5.35,1.87,9.4600000000000009,5.57,4.7300000000000004,1.57,18,8.32]
["HSS","HSS5x4x0.188","HSS5x4x3/16","5x4x0.188","5x4","0.188",null,null,null,null,null,null,"Rectangle",10.7,2.93,5,4.4800000000000004,4,3.48,0.1875,0.17399999999999999,20,25.7,10.6,5.05,4.22,1.9,7.48,4.34,3.74,1.6,14,6.41]
["HSS","HSS5x4x0.125","HSS5x4x1/8","5x4x0.125","5x4","0.125",null,null,null,null,null,null,"Rectangle",7.31,2,5,4.6500000000000004,4,3.65,0.125,0.11600000000000001,31.5,40.1,7.42,3.5,2.97,1.93,5.27,3.01,2.64,1.62,9.66,4.3899999999999997]
["HSS","HSS5x3x0.500","HSS5x3x1/2","5x3x0.500","5x3","0.500",null,null,null,null,null,null,"Rectangle",21.63,6.02,5,3.6,3,1.6,0.5,0.46500000000000002,3.45,7.75,16.399999999999999,8.83,6.57,1.65,7.18,6.1,4.78,1.0900000000000001,17.600000000000001,10.3]
["HSS","HSS5x3x0.375","HSS5x3x3/8","5x3x0.375","5x3","0.375",null,null,null,null,null,null,"Rectangle",17.27,4.78,5,3.95,3,1.95,0.375,0.34899999999999998,5.6,11.3,14.1,7.34,5.65,1.72,6.25,5.0999999999999996,4.16,1.1399999999999999,14.9,8.44]
["HSS","HSS5x3x0.313","HSS5x3x5/16","5x3x0.313","5x3","0.313",null,null,null,null,null,null,"Rectangle",14.83,4.0999999999999996,5,4.13,3,2.13,0.3125,0.29099999999999998,7.31,14.2,12.6,6.42,5.03,1.75,5.6,4.4800000000000004,3.73,1.17,13.1,7.33]
["HSS","HSS5x3x0.250","HSS5x3x1/4","5x3x0.250","5x3","0.250",null,null,null,null,null,null,"Rectangle",12.21,3.37,5,4.3,3,2.2999999999999998,0.25,0.23300000000000001,9.8800000000000008,18.5,10.7,5.38,4.29,1.78,4.8099999999999996,3.77,3.21,1.19,11,6.1]
["HSS","HSS5x3x0.188","HSS5x3x3/16","5x3x0.188","5x3","0.188",null,null,null,null,null,null,"Rectangle",9.42,2.58,5,4.4800000000000004,3,2.48,0.1875,0.17399999999999999,14.2,25.7,8.5299999999999994,4.21,3.41,1.82,3.85,2.96,2.57,1.22,8.64,4.7300000000000004]
["HSS","HSS5x3x0.125","HSS5x3x1/8","5x3x0.125","5x3","0.125",null,null,null,null,null,null,"Rectangle",6.46,1.77,5,4.6500000000000004,3,2.65,0.125,0.11600000000000001,22.9,40.1,6.03,2.93,2.41,1.85,2.75,2.0699999999999998,1.83,1.25,6.02,3.26]
["HSS","HSS5x2.5x0.250","HSS5x2.5x1/4","5x2.5x0.250","5x2.5","0.250",null,null,null,null,null,null,"Rectangle",11.36,3.14,5,4.3,2.5,1.8,0.25,0.23300000000000001,7.73,18.5,9.4,4.83,3.76,1.73,3.13,2.95,2.5,0.999,7.93,4.99]
["HSS","HSS5x2.5x0.188","HSS5x2.5x3/16","5x2.5x0.188","5x2.5","0.188",null,null,null,null,null,null,"Rectangle",8.7799999999999994,2.41,5,4.4800000000000004,2.5,1.98,0.1875,0.17399999999999999,11.4,25.7,7.51,3.79,3.01,1.77,2.5299999999999998,2.33,2.0299999999999998,1.02,6.26,3.89]
["HSS","HSS5x2.5x0.125","HSS5x2.5x1/8","5x2.5x0.125","5x2.5","0.125",null,null,null,null,null,null,"Rectangle",6.03,1.65,5,4.6500000000000004,2.5,2.15,0.125,0.11600000000000001,18.600000000000001,40.1,5.34,2.65,2.14,1.8,1.82,1.64,1.46,1.05,4.4000000000000004,2.7]
["HSS","HSS5x2x0.375","HSS5x2x3/8","5x2x0.375","5x2","0.375",null,null,null,null,null,null,"Rectangle",14.72,4.09,5,3.95,2,0.95299999999999996,0.375,0.34899999999999998,2.73,11.3,10.4,5.71,4.1399999999999997,1.59,2.2799999999999998,2.88,2.2799999999999998,0.748,6.61,5.2]
["HSS","HSS5x2x0.313","HSS5x2x5/16","5x2x0.313","5x2","0.313",null,null,null,null,null,null,"Rectangle",12.7,3.52,5,4.13,2,1.1299999999999999,0.3125,0.29099999999999998,3.87,14.2,9.35,5.05,3.74,1.63,2.1,2.57,2.1,0.77200000000000002,5.99,4.59]
["HSS","HSS5x2x0.250","HSS5x2x1/4","5x2x0.250","5x2","0.250",null,null,null,null,null,null,"Rectangle",10.51,2.91,5,4.3,2,1.3,0.25,0.23300000000000001,5.58,18.5,8.08,4.2699999999999996,3.23,1.67,1.84,2.2000000000000002,1.84,0.79700000000000004,5.17,3.88]
["HSS","HSS5x2x0.188","HSS5x2x3/16","5x2x0.188","5x2","0.188",null,null,null,null,null,null,"Rectangle",8.15,2.2400000000000002,5,4.4800000000000004,2,1.48,0.1875,0.17399999999999999,8.49,25.7,6.5,3.37,2.6,1.7,1.51,1.75,1.51,0.82299999999999995,4.1500000000000004,3.05]
["HSS","HSS5x2x0.125","HSS5x2x1/8","5x2x0.125","5x2","0.125",null,null,null,null,null,null,"Rectangle",5.61,1.54,5,4.6500000000000004,2,1.65,0.125,0.11600000000000001,14.2,40.1,4.6500000000000004,2.37,1.86,1.74,1.1000000000000001,1.24,1.1000000000000001,0.84799999999999998,2.95,2.13]
["HSS","HSS4x3x0.375","HSS4x3x3/8","4x3x0.375","4x3","0.375",null,null,null,null,null,null,"Rectangle",14.72,4.09,4,2.95,3,1.95,0.375,0.34899999999999998,5.6,8.4600000000000009,7.93,5.12,3.97,1.39,5.01,4.18,3.34,1.1100000000000001,10.6,6.59]
["HSS","HSS4x3x0.313","HSS4x3x5/16","4x3x0.313","4x3","0.313",null,null,null,null,null,null,"Rectangle",12.7,3.52,4,3.13,3,2.13,0.3125,0.29099999999999998,7.31,10.7,7.14,4.51,3.57,1.42,4.5199999999999996,3.69,3.02,1.1299999999999999,9.41,5.75]
["HSS","HSS4x3x0.250","HSS4x3x1/4","4x3x0.250","4x3","0.250",null,null,null,null,null,null,"Rectangle",10.51,2.91,4,3.3,3,2.2999999999999998,0.25,0.23300000000000001,9.8800000000000008,14.2,6.15,3.81,3.07,1.45,3.91,3.12,2.61,1.1599999999999999,7.96,4.8099999999999996]
["HSS","HSS4x3x0.188","HSS4x3x3/16","4x3x0.188","4x3","0.188",null,null,null,null,null,null,"Rectangle",8.15,2.2400000000000002,4,3.48,3,2.48,0.1875,0.17399999999999999,14.2,20,4.93,3,2.4700000000000002,1.49,3.16,2.46,2.1,1.19,6.26,3.74]
["HSS","HSS4x3x0.125","HSS4x3x1/8","4x3x0.125","4x3","0.125",null,null,null,null,null,null,"Rectangle",5.61,1.54,4,3.65,3,2.65,0.125,0.11600000000000001,22.9,31.5,3.52,2.11,1.76,1.52,2.27,1.73,1.51,1.21,4.38,2.59]
["HSS","HSS4x2.5x0.250","HSS4x2.5x1/4","4x2.5x0.250","4x2.5","0.250",null,null,null,null,null,null,"Rectangle",9.66,2.67,4,3.3,2.5,1.8,0.25,0.23300000000000001,7.73,14.2,5.32,3.38,2.66,1.41,2.5299999999999998,2.4300000000000002,2.02,0.97299999999999998,5.78,3.93]
["HSS","HSS4x2.5x0.188","HSS4x2.5x3/16","4x2.5x0.188","4x2.5","0.188",null,null,null,null,null,null,"Rectangle",7.51,2.06,4,3.48,2.5,1.98,0.1875,0.17399999999999999,11.4,20,4.3,2.67,2.15,1.44,2.06,1.93,1.65,0.999,4.59,3.08]
["HSS","HSS4x2.5x0.125","HSS4x2.5x1/8","4x2.5x0.125","4x2.5","0.125",null,null,null,null,null,null,"Rectangle",5.18,1.42,4,3.65,2.5,2.15,0.125,0.11600000000000001,18.600000000000001,31.5,3.09,1.88,1.54,1.47,1.49,1.36,1.19,1.03,3.23,2.14]
["HSS","HSS4x2x0.375","HSS4x2x3/8","4x2x0.375","4x2","0.375",null,null,null,null,null,null,"Rectangle",12.17,3.39,4,2.95,2,0.95299999999999996,0.375,0.34899999999999998,2.73,8.4600000000000009,5.6,3.84,2.8,1.29,1.8,2.31,1.8,0.72899999999999998,4.83,4.04]
["HSS","HSS4x2x0.313","HSS4x2x5/16","4x2x0.313","4x2","0.313",null,null,null,null,null,null,"Rectangle",10.58,2.94,4,3.13,2,1.1299999999999999,0.3125,0.29099999999999998,3.87,10.7,5.13,3.43,2.56,1.32,1.67,2.08,1.67,0.754,4.4000000000000004,3.59]
["HSS","HSS4x2x0.250","HSS4x2x1/4","4x2x0.250","4x2","0.250",null,null,null,null,null,null,"Rectangle",8.81,2.44,4,3.3,2,1.3,0.25,0.23300000000000001,5.58,14.2,4.49,2.94,2.25,1.36,1.48,1.79,1.48,0.77900000000000003,3.82,3.05]
["HSS","HSS4x2x0.188","HSS4x2x3/16","4x2x0.188","4x2","0.188",null,null,null,null,null,null,"Rectangle",6.87,1.89,4,3.48,2,1.48,0.1875,0.17399999999999999,8.49,20,3.66,2.34,1.83,1.39,1.22,1.43,1.22,0.80400000000000005,3.08,2.41]
["HSS","HSS4x2x0.125","HSS4x2x1/8","4x2x0.125","4x2","0.125",null,null,null,null,null,null,"Rectangle",4.75,1.3,4,3.65,2,1.65,0.125,0.11600000000000001,14.2,31.5,2.65,1.66,1.32,1.43,0.89800000000000002,1.02,0.89800000000000002,0.83,2.2000000000000002,1.69]
["HSS","HSS4x1.5x0.250","HSS4x1.5x1/4","4x1.5x0.250","4x1.5","0.250",null,null,null,null,null,null,"Rectangle",7.96,2.21,4,3.3,1.5,"0.801",0.25,0.23300000000000001,3.44,14.2,3.66,2.5,1.83,1.29,0.73299999999999998,1.21,0.97699999999999998,0.57599999999999996,2.14,2.1800000000000002]
["HSS","HSS4x1.5x0.188","HSS4x1.5x3/16","4x1.5x0.188","4x1.5","0.188",null,null,null,null,null,null,"Rectangle",6.23,1.71,4,3.48,1.5,"0.978",0.1875,0.17399999999999999,5.62,20,3.02,2.0099999999999998,1.51,1.33,0.621,0.98199999999999998,0.82699999999999996,0.60199999999999998,1.78,1.75]
["HSS","HSS4x1.5x0.125","HSS4x1.5x1/8","4x1.5x0.125","4x1.5","0.125",null,null,null,null,null,null,"Rectangle",4.33,1.19,4,3.65,1.5,"1.15",0.125,0.11600000000000001,9.93,31.5,2.21,1.43,1.1100000000000001,1.36,0.46700000000000003,0.71,0.622,0.627,1.3,1.24]
["HSS","HSS3.5x2.5x0.375","HSS3.5x2.5x3/8","3.5x2.5x0.375","3.5x2.5","0.375",null,null,null,null,null,null,"Rectangle",12.17,3.39,3.5,2.4500000000000002,2.5,1.45,0.375,0.34899999999999998,4.16,7.03,4.75,3.59,2.72,1.18,2.77,2.82,2.21,0.90400000000000003,6.16,4.57]
["HSS","HSS3.5x2.5x0.313","HSS3.5x2.5x5/16","3.5x2.5x0.313","3.5x2.5","0.313",null,null,null,null,null,null,"Rectangle",10.58,2.94,3.5,2.63,2.5,1.63,0.3125,0.29099999999999998,5.59,9.0299999999999994,4.34,3.2,2.48,1.22,2.54,2.52,2.0299999999999998,0.93,5.53,4.03]
["HSS","HSS3.5x2.5x0.250","HSS3.5x2.5x1/4","3.5x2.5x0.250","3.5x2.5","0.250",null,null,null,null,null,null,"Rectangle",8.81,2.44,3.5,2.8,2.5,1.8,0.25,0.23300000000000001,7.73,12,3.79,2.74,2.17,1.25,2.23,2.16,1.78,0.95599999999999996,4.75,3.4]
["HSS","HSS3.5x2.5x0.188","HSS3.5x2.5x3/16","3.5x2.5x0.188","3.5x2.5","0.188",null,null,null,null,null,null,"Rectangle",6.87,1.89,3.5,2.98,2.5,1.98,0.1875,0.17399999999999999,11.4,17.100000000000001,3.09,2.1800000000000002,1.76,1.28,1.82,1.72,1.46,0.98299999999999998,3.78,2.67]
["HSS","HSS3.5x2.5x0.125","HSS3.5x2.5x1/8","3.5x2.5x0.125","3.5x2.5","0.125",null,null,null,null,null,null,"Rectangle",4.75,1.3,3.5,3.15,2.5,2.15,0.125,0.11600000000000001,18.600000000000001,27.2,2.23,1.54,1.28,1.31,1.33,1.22,1.06,1.01,2.67,1.87]
["HSS","HSS3.5x2x0.250","HSS3.5x2x1/4","3.5x2x0.250","3.5x2","0.250",null,null,null,null,null,null,"Rectangle",7.96,2.21,3.5,2.8,2,1.3,0.25,0.23300000000000001,5.58,12,3.17,2.36,1.81,1.2,1.3,1.58,1.3,0.76600000000000001,3.16,2.64]
["HSS","HSS3.5x2x0.188","HSS3.5x2x3/16","3.5x2x0.188","3.5x2","0.188",null,null,null,null,null,null,"Rectangle",6.23,1.71,3.5,2.98,2,1.48,0.1875,0.17399999999999999,8.49,17.100000000000001,2.61,1.89,1.49,1.23,1.08,1.27,1.08,0.79200000000000004,2.5499999999999998,2.09]
["HSS","HSS3.5x2x0.125","HSS3.5x2x1/8","3.5x2x0.125","3.5x2","0.125",null,null,null,null,null,null,"Rectangle",4.33,1.19,3.5,3.15,2,1.65,0.125,0.11600000000000001,14.2,27.2,1.9,1.34,1.0900000000000001,1.27,0.79500000000000004,0.91200000000000003,0.79500000000000004,0.81799999999999995,1.83,1.47]
["HSS","HSS3.5x1.5x0.250","HSS3.5x1.5x1/4","3.5x1.5x0.250","3.5x1.5","0.250",null,null,null,null,null,null,"Rectangle",7.11,1.97,3.5,2.8,1.5,0.80100000000000005,0.25,0.23300000000000001,3.44,12,2.5499999999999998,1.98,1.46,1.1399999999999999,0.63800000000000001,1.06,0.85099999999999998,0.56899999999999995,1.79,1.88]
["HSS","HSS3.5x1.5x0.188","HSS3.5x1.5x3/16","3.5x1.5x0.188","3.5x1.5","0.188",null,null,null,null,null,null,"Rectangle",5.59,1.54,3.5,2.98,1.5,0.97799999999999998,0.1875,0.17399999999999999,5.62,17.100000000000001,2.12,1.6,1.21,1.17,0.54400000000000004,0.86699999999999999,0.72499999999999998,0.59399999999999997,1.49,1.51]
["HSS","HSS3.5x1.5x0.125","HSS3.5x1.5x1/8","3.5x1.5x0.125","3.5x1.5","0.125",null,null,null,null,null,null,"Rectangle",3.9,1.07,3.5,3.15,1.5,1.1499999999999999,0.125,0.11600000000000001,9.93,27.2,1.57,1.1499999999999999,0.89600000000000002,1.21,0.41099999999999998,0.63,0.54800000000000004,0.61899999999999999,1.0900000000000001,1.08]
["HSS","HSS3x2.5x0.313","HSS3x2.5x5/16","3x2.5x0.313","3x2.5","0.313",null,null,null,null,null,null,"Rectangle",9.51,2.64,3,2.13,2.5,1.63,0.3125,0.29099999999999998,5.59,7.31,2.92,2.5099999999999998,1.94,1.05,2.1800000000000002,2.2000000000000002,1.74,0.90800000000000003,4.34,3.39]
["HSS","HSS3x2.5x0.250","HSS3x2.5x1/4","3x2.5x0.250","3x2.5","0.250",null,null,null,null,null,null,"Rectangle",7.96,2.21,3,2.2999999999999998,2.5,1.8,0.25,0.23300000000000001,7.73,9.8800000000000008,2.57,2.16,1.72,1.08,1.93,1.9,1.54,0.93500000000000005,3.74,2.87]
["HSS","HSS3x2.5x0.188","HSS3x2.5x3/16","3x2.5x0.188","3x2.5","0.188",null,null,null,null,null,null,"Rectangle",6.23,1.71,3,2.48,2.5,1.98,0.1875,0.17399999999999999,11.4,14.2,2.11,1.73,1.41,1.1100000000000001,1.59,1.52,1.27,0.96299999999999997,3,2.27]
["HSS","HSS3x2.5x0.125","HSS3x2.5x1/8","3x2.5x0.125","3x2.5","0.125",null,null,null,null,null,null,"Rectangle",4.33,1.19,3,2.65,2.5,2.15,0.125,0.11600000000000001,18.600000000000001,22.9,1.54,1.23,1.03,1.1399999999999999,1.1599999999999999,1.0900000000000001,0.93100000000000005,0.99,2.13,1.59]
["HSS","HSS3x2x0.313","HSS3x2x5/16","3x2x0.313","3x2","0.313",null,null,null,null,null,null,"Rectangle",8.4499999999999993,2.35,3,2.13,2,1.1299999999999999,0.3125,0.29099999999999998,3.87,7.31,2.38,2.11,1.59,1.01,1.24,1.58,1.24,0.72499999999999998,2.87,2.6]
["HSS","HSS3x2x0.250","HSS3x2x1/4","3x2x0.250","3x2","0.250",null,null,null,null,null,null,"Rectangle",7.11,1.97,3,2.2999999999999998,2,1.3,0.25,0.23300000000000001,5.58,9.8800000000000008,2.13,1.83,1.42,1.04,1.1100000000000001,1.38,1.1100000000000001,0.751,2.52,2.23]
["HSS","HSS3x2x0.188","HSS3x2x3/16","3x2x0.188","3x2","0.188",null,null,null,null,null,null,"Rectangle",5.59,1.54,3,2.48,2,1.48,0.1875,0.17399999999999999,8.49,14.2,1.77,1.48,1.18,1.07,0.93200000000000005,1.1200000000000001,0.93200000000000005,0.77800000000000002,2.0499999999999998,1.78]
["HSS","HSS3x2x0.125","HSS3x2x1/8","3x2x0.125","3x2","0.125",null,null,null,null,null,null,"Rectangle",3.9,1.07,3,2.65,2,1.65,0.125,0.11600000000000001,14.2,22.9,1.3,1.06,0.86699999999999999,1.1000000000000001,0.69199999999999995,0.80300000000000005,0.69199999999999995,0.80400000000000005,1.47,1.25]
["HSS","HSS3x1.5x0.250","HSS3x1.5x1/4","3x1.5x0.250","3x1.5","0.250",null,null,null,null,null,null,"Rectangle",6.26,1.74,3,2.2999999999999998,1.5,0.80100000000000005,0.25,0.23300000000000001,3.44,9.8800000000000008,1.68,1.51,1.1200000000000001,0.98199999999999998,0.54300000000000004,0.91100000000000003,0.72499999999999998,0.55900000000000005,1.44,1.58]
["HSS","HSS3x1.5x0.188","HSS3x1.5x3/16","3x1.5x0.188","3x1.5","0.188",null,null,null,null,null,null,"Rectangle",4.96,1.37,3,2.48,1.5,0.97799999999999998,0.1875,0.17399999999999999,5.62,14.2,1.42,1.24,0.94499999999999995,1.02,0.46700000000000003,0.752,0.622,0.58399999999999996,1.21,1.28]
["HSS","HSS3x1.5x0.125","HSS3x1.5x1/8","3x1.5x0.125","3x1.5","0.125",null,null,null,null,null,null,"Rectangle",3.48,0.95599999999999996,3,2.65,1.5,1.1499999999999999,0.125,0.11600000000000001,9.93,22.9,1.06,0.89500000000000002,0.70599999999999996,1.05,0.35499999999999998,0.55000000000000004,0.47399999999999998,0.61,0.88600000000000001,0.92]
["HSS","HSS3x1x0.188","HSS3x1x3/16","3x1x0.188","3x1","0.188",null,null,null,null,null,null,"Rectangle",4.32,1.19,3,2.48,1,0.47799999999999998,0.1875,0.17399999999999999,2.75,14.2,1.07,0.98899999999999999,0.71299999999999997,0.94699999999999995,0.17299999999999999,0.432,0.34499999999999997,0.38,0.52600000000000002,0.79200000000000004]
["HSS","HSS3x1x0.125","HSS3x1x1/8","3x1x0.125","3x1","0.125",null,null,null,null,null,null,"Rectangle",3.05,0.84,3,2.65,1,0.65200000000000002,0.125,0.11600000000000001,5.62,22.9,0.81699999999999995,0.72799999999999998,0.54500000000000004,0.98699999999999999,0.13800000000000001,0.32500000000000001,0.27600000000000002,0.40500000000000003,0.40799999999999997,0.58499999999999996]
["HSS","HSS2.5x2x0.250","HSS2.5x2x1/4","2.5x2x0.250","2.5x2","0.250",null,null,null,null,null,null,"Rectangle",6.26,1.74,2.5,1.8,2,1.3,0.25,0.23300000000000001,5.58,7.73,1.33,1.37,1.06,0.874,0.93,1.17,0.93,0.73099999999999998,1.9,1.82]
["HSS","HSS2.5x2x0.188","HSS2.5x2x3/16","2.5x2x0.188","2.5x2","0.188",null,null,null,null,null,null,"Rectangle",4.96,1.37,2.5,1.98,2,1.48,0.1875,0.17399999999999999,8.49,11.4,1.1200000000000001,1.1200000000000001,0.89400000000000002,0.90400000000000003,0.78600000000000003,0.95599999999999996,0.78600000000000003,0.75800000000000001,1.55,1.46]
["HSS","HSS2.5x2x0.125","HSS2.5x2x1/8","2.5x2x0.125","2.5x2","0.125",null,null,null,null,null,null,"Rectangle",3.48,0.95599999999999996,2.5,2.15,2,1.65,0.125,0.11600000000000001,14.2,18.600000000000001,0.83299999999999996,0.80900000000000005,0.66700000000000004,0.93400000000000005,0.58899999999999997,0.69399999999999995,0.58899999999999997,0.78500000000000003,1.1200000000000001,1.04]
["HSS","HSS2.5x1.5x0.250","HSS2.5x1.5x1/4","2.5x1.5x0.250","2.5x1.5","0.250",null,null,null,null,null,null,"Rectangle",5.41,1.51,2.5,1.8,1.5,0.80100000000000005,0.25,0.23300000000000001,3.44,7.73,1.03,1.1100000000000001,0.82199999999999995,0.82599999999999996,0.44900000000000001,0.76400000000000001,0.59899999999999998,0.54600000000000004,1.1000000000000001,1.29]
["HSS","HSS2.5x1.5x0.188","HSS2.5x1.5x3/16","2.5x1.5x0.188","2.5x1.5","0.188",null,null,null,null,null,null,"Rectangle",4.32,1.19,2.5,1.98,1.5,0.97799999999999998,0.1875,0.17399999999999999,5.62,11.4,0.88200000000000001,0.91500000000000004,0.70499999999999996,0.86,0.39,0.63600000000000001,0.52,0.57199999999999995,0.92900000000000005,1.05]
["HSS","HSS2.5x1.5x0.125","HSS2.5x1.5x1/8","2.5x1.5x0.125","2.5x1.5","0.125",null,null,null,null,null,null,"Rectangle",3.05,0.84,2.5,2.15,1.5,1.1499999999999999,0.125,0.11600000000000001,9.93,18.600000000000001,0.66800000000000004,0.67100000000000004,0.53500000000000003,0.89200000000000002,0.3,0.46899999999999997,0.39900000000000002,0.59699999999999998,0.68700000000000006,0.75900000000000001]
["HSS","HSS2.5x1x0.188","HSS2.5x1x3/16","2.5x1x0.188","2.5x1","0.188",null,null,null,null,null,null,"Rectangle",3.68,1.02,2.5,1.98,1,0.47799999999999998,0.1875,0.17399999999999999,2.75,11.4,0.64600000000000002,0.71299999999999997,0.51700000000000002,0.79600000000000004,0.14299999999999999,0.36,0.28499999999999998,0.374,0.41199999999999998,0.64800000000000002]
["HSS","HSS2.5x1x0.125","HSS2.5x1x1/8","2.5x1x0.125","2.5x1","0.125",null,null,null,null,null,null,"Rectangle",2.63,0.72399999999999998,2.5,2.15,1,0.65200000000000002,0.125,0.11600000000000001,5.62,18.600000000000001,0.503,0.53200000000000003,0.40300000000000002,0.83399999999999996,0.115,0.27400000000000002,0.23,0.39900000000000002,0.32200000000000001,0.48299999999999998]
["HSS","HSS2x1.5x0.188","HSS2x1.5x3/16","2x1.5x0.188","2x1.5","0.188",null,null,null,null,null,null,"Rectangle",3.68,1.02,2,1.48,1.5,0.97799999999999998,0.1875,0.17399999999999999,5.62,8.49,0.495,0.63900000000000001,0.495,0.69699999999999995,0.313,0.52100000000000002,0.41699999999999998,0.55400000000000005,0.66400000000000003,0.82199999999999995]
["HSS","HSS2x1.5x0.125","HSS2x1.5x1/8","2x1.5x0.125","2x1.5","0.125",null,null,null,null,null,null,"Rectangle",2.63,0.72399999999999998,2,1.65,1.5,1.1499999999999999,0.125,0.11600000000000001,9.93,14.2,0.38300000000000001,0.47499999999999998,0.38300000000000001,0.72799999999999998,0.24399999999999999,0.38900000000000001,0.32500000000000001,0.58099999999999996,0.496,0.59899999999999998]
["HSS","HSS2x1x0.188","HSS2x1x3/16","2x1x0.188","2x1","0.188",null,null,null,null,null,null,"Rectangle",3.04,0.84499999999999997,2,1.48,1,0.47799999999999998,0.1875,0.17399999999999999,2.75,8.49,0.35,0.48,0.35,0.64300000000000002,0.112,0.28799999999999998,0.22500000000000001,0.36499999999999999,0.30099999999999999,0.505]
["HSS","HSS2x1x0.125","HSS2x1x1/8","2x1x0.125","2x1","0.125",null,null,null,null,null,null,"Rectangle",2.2000000000000002,0.60799999999999998,2,1.65,1,0.65200000000000002,0.125,0.11600000000000001,5.62,14.2,0.28000000000000003,0.36599999999999999,0.28000000000000003,0.67900000000000005,9.2200000000000004E-2,0.223,0.184,0.39,0.23799999999999999,0.38]
[]
["HSS","HSS22x22x1","HSS22x22x1","22x22x1","22x22","1","22x22",null,null,5,404,408,"Square",277.07,76.2,22,19.2,22,"19.2",1,0.93,20.7,20.7,5550,596,505,8.5399999999999991,5550,596,505,8.5399999999999991,8890,823]
["HSS","HSS22x22x0.875","HSS22x22x7/8","22x22x0.875","22x22","0.875","20x20",null,null,7,409,415,"Square",244.88,67.3,22,19.600000000000001,22,19.600000000000001,0.875,0.81399999999999995,24.1,24.1,4970,530,452,8.59,4970,530,452,8.59,7890,729]
["HSS","HSS22x22x0.750","HSS22x22x3/4","22x22x0.750","22x22","0.750","18x18",null,null,8,416,423,"Square",212,58.2,22,19.899999999999999,22,19.899999999999999,0.75,0.69799999999999995,28.5,28.5,4350,462,395,8.65,4350,462,395,8.65,6860,632]
["HSS","HSS22x22x0.625","HSS22x22x5/8","22x22x0.625","22x22",0.625,"16x16",null,null,8,424,431,"Square",178.41,48.9,22,20.3,22,"20.3",0.625,0.58099999999999996,34.9,34.9,3710,390,337,8.6999999999999993,3710,390,337,8.6999999999999993,5790,532]
["HSS","HSS22x22x0.500","HSS22x22x1/2","22x22x0.500","22x22",0.5,"14x14",null,null,8,432,439,"Square",144.13,39.5,22,20.6,22,"20.6",0.5,0.46500000000000002,44.3,44.3,3030,317,276,8.76,3030,317,276,8.76,4700,431]
["HSS","HSS20x20x1","HSS20x20x1","20x20x1","20x20",1,"12x12",null,null,9,440,448,"Square",249.85,68.7,20,17.2,20,"17.2",1,0.93,18.5,18.5,4100,486,410,7.72,4100,486,410,7.72,6600,673]
["HSS","HSS20x20x0.875","HSS20x20x7/8","20x20x0.875","20x20","0.875","10x10",null,null,7,449,455,"Square",221.06,60.8,20,17.600000000000001,20,17.600000000000001,0.875,0.81399999999999995,21.6,21.6,3670,433,367,7.77,3670,433,367,7.77,5870,597]
["HSS","HSS20x20x0.750","HSS20x20x3/4","20x20x0.750","20x20","0.750","9x9",null,null,7,456,462,"Square",191.58,52.6,20,17.899999999999999,20,17.899999999999999,0.75,0.69799999999999995,25.6,25.6,3230,378,323,7.84,3230,378,323,7.84,5110,519]
["HSS","HSS20x20x0.625","HSS20x20x5/8","20x20x0.625","20x20","0.625","8x8",null,null,7,463,469,"Square",161.4,44.3,20,18.3,20,18.3,0.625,0.58099999999999996,31.5,31.5,2750,320,275,7.88,2750,320,275,7.88,4320,437]
["HSS","HSS20x20x0.500","HSS20x20x1/2","20x20x0.500","20x20","0.500","7x7",null,null,7,470,476,"Square",130.52000000000001,35.799999999999997,20,18.600000000000001,20,18.600000000000001,0.5,0.46500000000000002,40,40,2260,261,226,7.95,2260,261,226,7.95,3510,355]
["HSS","HSS20x20x0.375","HSS20x20x3/8","20x20x0.375","20x20","0.375","6x6",null,null,7,477,483,"Square",98.94,27.1,20,19,20,"19.0",0.375,0.34899999999999998,54.3,54.3,1740,199,174,8,1740,199,174,8,2680,269]
["HSS","HSS20x20x0.313","HSS20x20x5/16","20x20x0.313","20x20","0.313","5.5x5.5",null,null,5,484,488,"Square",82.88,22.7,20,19.100000000000001,20,"19.1",0.3125,0.29099999999999998,65.7,65.7,1460,167,146,8.0299999999999994,1460,167,146,8.0299999999999994,2250,226]
["HSS","HSS18x18x1","HSS18x18x1","18x18x1","18x18","1","5x5",null,null,6,489,494,"Square",222.63,61.3,18,15.2,18,"15.2",1,0.93,16.399999999999999,16.399999999999999,2920,387,324,6.9,2920,387,324,6.9,4740,539]
["HSS","HSS18x18x0.875","HSS18x18x7/8","18x18x0.875","18x18","0.875","4.5x4.5",null,null,6,495,500,"Square",197.24,54.3,18,15.6,18,15.6,0.875,0.81399999999999995,19.2,19.2,2630,346,292,6.96,2630,346,292,6.96,4220,479]
["HSS","HSS18x18x0.750","HSS18x18x3/4","18x18x0.750","18x18","0.750","4x4",null,null,6,501,506,"Square",171.16,47.1,18,15.9,18,15.9,0.75,0.69799999999999995,22.8,22.8,2320,302,258,7.02,2320,302,258,7.02,3690,417]
["HSS","HSS18x18x0.625","HSS18x18x5/8","18x18x0.625","18x18","0.625","3.5x3.5",null,null,5,507,511,"Square",144.38999999999999,39.6,18,16.3,18,16.3,0.625,0.58099999999999996,28.1,28.1,1980,257,220,7.07,1980,257,220,7.07,3120,352]
["HSS","HSS18x18x0.500","HSS18x18x1/2","18x18x0.500","18x18","0.500","3x3",null,null,5,512,516,"Square",116.91,32.1,18,16.600000000000001,18,16.600000000000001,0.5,0.46500000000000002,35.700000000000003,35.700000000000003,1630,210,181,7.13,1630,210,181,7.13,2540,286]
["HSS","HSS18x18x0.375","HSS18x18x3/8","18x18x0.375","18x18","0.375","2.5x2.5",null,null,4,517,520,"Square",88.73,24.3,18,17,18,"17.0",0.375,0.34899999999999998,48.6,48.6,1250,160,139,7.18,1250,160,139,7.18,1940,217]
["HSS","HSS18x18x0.313","HSS18x18x5/16","18x18x0.313","18x18","0.313","2.25x2.25",null,null,3,521,523,"Square",74.38,20.399999999999999,18,17.100000000000001,18,"17.1",0.3125,0.29099999999999998,58.9,58.9,1060,135,118,7.21,1060,135,118,7.21,1630,182]
["HSS","HSS18x18x0.250","HSS18x18x1/4","18x18x0.250","18x18","0.250","2x2",null,null,3,524,526,"Square",59.85,16.399999999999999,18,17.3,18,"17.3",0.25,0.23300000000000001,74.3,74.3,860,109,95.6,7.24,860,109,95.6,7.24,1320,147]
["HSS","HSS16x16x1","HSS16x16x1","16x16x1","16x16","1","1.5x1.5",null,null,3,527,529,"Square",195.4,53.8,16,13.2,16,"13.2",1,0.93,14.2,14.2,1990,300,249,6.09,1990,300,249,6.09,3270,419]
["HSS","HSS16x16x0.875","HSS16x16x7/8","16x16x0.875","16x16","0.875",null,null,null,null,null,null,"Square",173.43,47.7,16,13.6,16,13.6,0.875,0.81399999999999995,16.7,16.7,1800,268,225,6.14,1800,268,225,6.14,2920,373]
["HSS","HSS16x16x0.750","HSS16x16x3/4","16x16x0.750","16x16","0.750",null,null,null,null,null,null,"Square",150.75,41.5,16,13.9,16,13.9,0.75,0.69799999999999995,19.899999999999999,19.899999999999999,1590,235,199,6.19,1590,235,199,6.19,2560,326]
["HSS","HSS16x16x0.625","HSS16x16x5/8","16x16x0.625","16x16","0.625",null,null,null,null,null,null,"Square",127.37,35,16,14.3,16,14.3,0.625,0.58099999999999996,24.5,24.5,1370,200,171,6.25,1370,200,171,6.25,2170,276]
["HSS","HSS16x16x0.500","HSS16x16x1/2","16x16x0.500","16x16","0.500",null,null,null,null,null,null,"Square",103.3,28.3,16,14.6,16,14.6,0.5,0.46500000000000002,31.4,31.4,1130,164,141,6.31,1130,164,141,6.31,1770,224]
["HSS","HSS16x16x0.375","HSS16x16x3/8","16x16x0.375","16x16","0.375",null,null,null,null,null,null,"Square",78.52,21.5,16,15,16,15,0.375,0.34899999999999998,42.8,42.8,873,126,109,6.37,873,126,109,6.37,1350,171]
["HSS","HSS16x16x0.313","HSS16x16x5/16","16x16x0.313","16x16","0.313",null,null,null,null,null,null,"Square",65.87,18.100000000000001,16,15.1,16,15.1,0.3125,0.29099999999999998,52,52,739,106,92.3,6.39,739,106,92.3,6.39,1140,144]
["HSS","HSS16x16x0.250","HSS16x16x1/4","16x16x0.250","16x16","0.250",null,null,null,null,null,null,"Square",53.050000000000004,14.6,16,15.3,16,"15.3",0.25,0.23300000000000001,65.7,65.7,600,85.8,75,6.42,600,85.8,75,6.42,921,116]
["HSS","HSS14x14x1","HSS14x14x1","14x14x1","14x14","1",null,null,null,null,null,null,"Square",168.18,46.4,14,11.2,14,"11.2",1,0.93,12.1,12.1,1290,224,184,5.27,1290,224,184,5.27,2130,315]
["HSS","HSS14x14x0.875","HSS14x14x7/8","14x14x0.875","14x14","0.875",null,null,null,null,null,null,"Square",149.61000000000001,41.2,14,11.6,14,11.6,0.875,0.81399999999999995,14.3,14.3,1170,201,167,5.33,1170,201,167,5.33,1910,281]
["HSS","HSS14x14x0.750","HSS14x14x3/4","14x14x0.750","14x14","0.750",null,null,null,null,null,null,"Square",130.33000000000001,35.9,14,11.9,14,11.9,0.75,0.69799999999999995,17,17,1040,177,149,5.38,1040,177,149,5.38,1680,246]
["HSS","HSS14x14x0.625","HSS14x14x5/8","14x14x0.625","14x14","0.625",null,null,null,null,null,null,"Square",110.36,30.3,14,12.3,14,12.3,0.625,0.58099999999999996,21.1,21.1,897,151,128,5.44,897,151,128,5.44,1430,208]
["HSS","HSS14x14x0.500","HSS14x14x1/2","14x14x0.500","14x14","0.500",null,null,null,null,null,null,"Square",89.68,24.6,14,12.6,14,12.6,0.5,0.46500000000000002,27.1,27.1,743,124,106,5.49,743,124,106,5.49,1170,170]
["HSS","HSS14x14x0.375","HSS14x14x3/8","14x14x0.375","14x14","0.375",null,null,null,null,null,null,"Square",68.31,18.7,14,13,14,13,0.375,0.34899999999999998,37.1,37.1,577,95.4,82.5,5.55,577,95.4,82.5,5.55,900,130]
["HSS","HSS14x14x0.313","HSS14x14x5/16","14x14x0.313","14x14","0.313",null,null,null,null,null,null,"Square",57.36,15.7,14,13.1,14,13.1,0.3125,0.29099999999999998,45.1,45.1,490,80.5,69.900000000000006,5.58,490,80.5,69.900000000000006,5.58,759,109]
["HSS","HSS14x14x0.250","HSS14x14x1/4","14x14x0.250","14x14","0.250",null,null,null,null,null,null,"Square",46.24,12.7,14,13.3,14,"13.3",0.25,0.23300000000000001,57.1,57.1,399,65.3,57,5.6,399,65.3,57,5.6,614,88.3]
["HSS","HSS12x12x1","HSS12x12x1","12x12x1","12x12","1",null,null,null,null,null,null,"Square",140.96,39,12,9.2100000000000009,12,"9.21",1,0.93,9.9,9.9,772,158,129,4.45,772,158,129,4.45,1300,225]
["HSS","HSS12x12x0.875","HSS12x12x7/8","12x12x0.875","12x12","0.875",null,null,null,null,null,null,"Square",125.79,34.700000000000003,12,9.56,12,"9.56",0.875,0.81399999999999995,11.7,11.7,706,143,118,4.51,706,143,118,4.51,1170,202]
["HSS","HSS12x12x0.750","HSS12x12x3/4","12x12x0.750","12x12","0.750",null,null,null,null,null,null,"Square",109.91,30.3,12,9.91,12,9.91,0.75,0.69799999999999995,14.2,14.2,631,127,105,4.5599999999999996,631,127,105,4.5599999999999996,1030,177]
["HSS","HSS12x12x0.625","HSS12x12x5/8","12x12x0.625","12x12","0.625",null,null,null,null,null,null,"Square",93.34,25.7,12,10.3,12,10.3,0.625,0.58099999999999996,17.7,17.7,548,109,91.4,4.62,548,109,91.4,4.62,885,151]
["HSS","HSS12x12x0.500","HSS12x12x1/2","12x12x0.500","12x12","0.500",null,null,null,null,null,null,"Square",76.069999999999993,20.9,12,10.6,12,10.6,0.5,0.46500000000000002,22.8,22.8,457,89.6,76.2,4.68,457,89.6,76.2,4.68,728,123]
["HSS","HSS12x12x0.375","HSS12x12x3/8","12x12x0.375","12x12","0.375",null,null,null,null,null,null,"Square",58.1,16,12,11,12,11,0.375,0.34899999999999998,31.4,31.4,357,69.2,59.5,4.7300000000000004,357,69.2,59.5,4.7300000000000004,561,94.6]
["HSS","HSS12x12x0.313","HSS12x12x5/16","12x12x0.313","12x12","0.313",null,null,null,null,null,null,"Square",48.86,13.4,12,11.1,12,11.1,0.3125,0.29099999999999998,38.200000000000003,38.200000000000003,304,58.6,50.7,4.76,304,58.6,50.7,4.76,474,79.7]
["HSS","HSS12x12x0.250","HSS12x12x1/4","12x12x0.250","12x12","0.250",null,null,null,null,null,null,"Square",39.43,10.8,12,11.3,12,11.3,0.25,0.23300000000000001,48.5,48.5,248,47.6,41.4,4.79,248,47.6,41.4,4.79,384,64.5]
["HSS","HSS12x12x0.188","HSS12x12x3/16","12x12x0.188","12x12","0.188",null,null,null,null,null,null,"Square",29.84,8.15,12,11.5,12,11.5,0.1875,0.17399999999999999,66,66,189,36,31.5,4.82,189,36,31.5,4.82,290,48.6]
["HSS","HSS10x10x0.750","HSS10x10x3/4","10x10x0.750","10x10","0.750",null,null,null,null,null,null,"Square",89.5,24.7,10,7.91,10,7.91,0.75,0.69799999999999995,11.3,11.3,347,84.7,69.400000000000006,3.75,347,84.7,69.400000000000006,3.75,578,119]
["HSS","HSS10x10x0.625","HSS10x10x5/8","10x10x0.625","10x10","0.625",null,null,null,null,null,null,"Square",76.33,21,10,8.26,10,8.26,0.625,0.58099999999999996,14.2,14.2,304,73.2,60.8,3.8,304,73.2,60.8,3.8,498,102]
["HSS","HSS10x10x0.500","HSS10x10x1/2","10x10x0.500","10x10","0.500",null,null,null,null,null,null,"Square",62.46,17.2,10,8.6,10,8.6,0.5,0.46500000000000002,18.5,18.5,256,60.7,51.2,3.86,256,60.7,51.2,3.86,412,84.2]
["HSS","HSS10x10x0.375","HSS10x10x3/8","10x10x0.375","10x10","0.375",null,null,null,null,null,null,"Square",47.9,13.2,10,8.9499999999999993,10,8.9499999999999993,0.375,0.34899999999999998,25.7,25.7,202,47.2,40.4,3.92,202,47.2,40.4,3.92,320,64.8]
["HSS","HSS10x10x0.313","HSS10x10x5/16","10x10x0.313","10x10","0.313",null,null,null,null,null,null,"Square",40.35,11.1,10,9.1300000000000008,10,9.1300000000000008,0.3125,0.29099999999999998,31.4,31.4,172,40.1,34.5,3.94,172,40.1,34.5,3.94,271,54.8]
["HSS","HSS10x10x0.250","HSS10x10x1/4","10x10x0.250","10x10","0.250",null,null,null,null,null,null,"Square",32.630000000000003,8.9600000000000009,10,9.3000000000000007,10,9.3000000000000007,0.25,0.23300000000000001,39.9,39.9,141,32.700000000000003,28.3,3.97,141,32.700000000000003,28.3,3.97,220,44.4]
["HSS","HSS10x10x0.188","HSS10x10x3/16","10x10x0.188","10x10","0.188",null,null,null,null,null,null,"Square",24.73,6.76,10,9.48,10,9.48,0.1875,0.17399999999999999,54.5,54.5,108,24.8,21.6,4,108,24.8,21.6,4,167,33.6]
["HSS","HSS9x9x0.625","HSS9x9x5/8","9x9x0.625","9x9","0.625",null,null,null,null,null,null,"Square",67.819999999999993,18.7,9,7.26,9,7.26,0.625,0.58099999999999996,12.5,12.5,216,58.1,47.9,3.4,216,58.1,47.9,3.4,356,81.599999999999994]
["HSS","HSS9x9x0.500","HSS9x9x1/2","9x9x0.500","9x9","0.500",null,null,null,null,null,null,"Square",55.66,15.3,9,7.6,9,7.6,0.5,0.46500000000000002,16.399999999999999,16.399999999999999,183,48.4,40.6,3.45,183,48.4,40.6,3.45,296,67.400000000000006]
["HSS","HSS9x9x0.375","HSS9x9x3/8","9x9x0.375","9x9","0.375",null,null,null,null,null,null,"Square",42.79,11.8,9,7.95,9,7.95,0.375,0.34899999999999998,22.8,22.8,145,37.799999999999997,32.200000000000003,3.51,145,37.799999999999997,32.200000000000003,3.51,231,52.1]
["HSS","HSS9x9x0.313","HSS9x9x5/16","9x9x0.313","9x9","0.313",null,null,null,null,null,null,"Square",36.1,9.92,9,8.1300000000000008,9,8.1300000000000008,0.3125,0.29099999999999998,27.9,27.9,124,32.1,27.6,3.54,124,32.1,27.6,3.54,196,44]
["HSS","HSS9x9x0.250","HSS9x9x1/4","9x9x0.250","9x9","0.250",null,null,null,null,null,null,"Square",29.23,8.0299999999999994,9,8.3000000000000007,9,8.3000000000000007,0.25,0.23300000000000001,35.6,35.6,102,26.2,22.7,3.56,102,26.2,22.7,3.56,159,35.799999999999997]
["HSS","HSS9x9x0.188","HSS9x9x3/16","9x9x0.188","9x9","0.188",null,null,null,null,null,null,"Square",22.18,6.06,9,8.48,9,8.48,0.1875,0.17399999999999999,48.7,48.7,78.2,20,17.399999999999999,3.59,78.2,20,17.399999999999999,3.59,121,27.1]
["HSS","HSS9x9x0.125","HSS9x9x1/8","9x9x0.125","9x9","0.125",null,null,null,null,null,null,"Square",14.96,4.09,9,8.65,9,8.65,0.125,0.11600000000000001,74.599999999999994,74.599999999999994,53.5,13.6,11.9,3.62,53.5,13.6,11.9,3.62,82,18.3]
["HSS","HSS8x8x0.625","HSS8x8x5/8","8x8x0.625","8x8","0.625",null,null,null,null,null,null,"Square",59.32,16.399999999999999,8,6.26,8,6.26,0.625,0.58099999999999996,10.8,10.8,146,44.7,36.5,2.99,146,44.7,36.5,2.99,244,63.2]
["HSS","HSS8x8x0.500","HSS8x8x1/2","8x8x0.500","8x8","0.500",null,null,null,null,null,null,"Square",48.85,13.5,8,6.6,8,6.6,0.5,0.46500000000000002,14.2,14.2,125,37.5,31.2,3.04,125,37.5,31.2,3.04,204,52.4]
["HSS","HSS8x8x0.375","HSS8x8x3/8","8x8x0.375","8x8","0.375",null,null,null,null,null,null,"Square",37.69,10.4,8,6.95,8,6.95,0.375,0.34899999999999998,19.899999999999999,19.899999999999999,100,29.4,24.9,3.1,100,29.4,24.9,3.1,160,40.700000000000003]
["HSS","HSS8x8x0.313","HSS8x8x5/16","8x8x0.313","8x8","0.313",null,null,null,null,null,null,"Square",31.84,8.76,8,7.13,8,7.13,0.3125,0.29099999999999998,24.5,24.5,85.6,25.1,21.4,3.13,85.6,25.1,21.4,3.13,136,34.5]
["HSS","HSS8x8x0.250","HSS8x8x1/4","8x8x0.250","8x8","0.250",null,null,null,null,null,null,"Square",25.82,7.1,8,7.3,8,7.3,0.25,0.23300000000000001,31.3,31.3,70.7,20.5,17.7,3.15,70.7,20.5,17.7,3.15,111,28.1]
["HSS","HSS8x8x0.188","HSS8x8x3/16","8x8x0.188","8x8","0.188",null,null,null,null,null,null,"Square",19.63,5.37,8,7.48,8,7.48,0.1875,0.17399999999999999,43,43,54.4,15.7,13.6,3.18,54.4,15.7,13.6,3.18,84.5,21.3]
["HSS","HSS8x8x0.125","HSS8x8x1/8","8x8x0.125","8x8","0.125",null,null,null,null,null,null,"Square",13.26,3.62,8,7.65,8,7.65,0.125,0.11600000000000001,66,66,37.4,10.7,9.34,3.21,37.4,10.7,9.34,3.21,57.3,14.4]
["HSS","HSS7x7x0.625","HSS7x7x5/8","7x7x0.625","7x7","0.625",null,null,null,null,null,null,"Square",50.81,14,7,5.26,7,5.26,0.625,0.58099999999999996,9.0500000000000007,9.0500000000000007,93.4,33.1,26.7,2.58,93.4,33.1,26.7,2.58,158,47.1]
["HSS","HSS7x7x0.500","HSS7x7x1/2","7x7x0.500","7x7","0.500",null,null,null,null,null,null,"Square",42.05,11.6,7,5.6,7,5.6,0.5,0.46500000000000002,12.1,12.1,80.5,27.9,23,2.63,80.5,27.9,23,2.63,133,39.299999999999997]
["HSS","HSS7x7x0.375","HSS7x7x3/8","7x7x0.375","7x7","0.375",null,null,null,null,null,null,"Square",32.58,8.9700000000000006,7,5.95,7,5.95,0.375,0.34899999999999998,17.100000000000001,17.100000000000001,65,22.1,18.600000000000001,2.69,65,22.1,18.600000000000001,2.69,105,30.7]
["HSS","HSS7x7x0.313","HSS7x7x5/16","7x7x0.313","7x7","0.313",null,null,null,null,null,null,"Square",27.59,7.59,7,6.13,7,6.13,0.3125,0.29099999999999998,21.1,21.1,56.1,18.899999999999999,16,2.72,56.1,18.899999999999999,16,2.72,89.7,26.1]
["HSS","HSS7x7x0.250","HSS7x7x1/4","7x7x0.250","7x7","0.250",null,null,null,null,null,null,"Square",22.42,6.17,7,6.3,7,6.3,0.25,0.23300000000000001,27,27,46.5,15.5,13.3,2.75,46.5,15.5,13.3,2.75,73.5,21.3]
["HSS","HSS7x7x0.188","HSS7x7x3/16","7x7x0.188","7x7","0.188",null,null,null,null,null,null,"Square",17.079999999999998,4.67,7,6.48,7,6.48,0.1875,0.17399999999999999,37.200000000000003,37.200000000000003,36,11.9,10.3,2.77,36,11.9,10.3,2.77,56.1,16.2]
["HSS","HSS7x7x0.125","HSS7x7x1/8","7x7x0.125","7x7","0.125",null,null,null,null,null,null,"Square",11.56,3.16,7,6.65,7,6.65,0.125,0.11600000000000001,57.3,57.3,24.8,8.1300000000000008,7.09,2.8,24.8,8.1300000000000008,7.09,2.8,38.200000000000003,11]
["HSS","HSS6x6x0.625","HSS6x6x5/8","6x6x0.625","6x6","0.625",null,null,null,null,null,null,"Square",42.3,11.7,6,4.26,6,4.26,0.625,0.58099999999999996,7.33,7.33,55.2,23.2,18.399999999999999,2.17,55.2,23.2,18.399999999999999,2.17,94.9,33.4]
["HSS","HSS6x6x0.500","HSS6x6x1/2","6x6x0.500","6x6","0.500",null,null,null,null,null,null,"Square",35.24,9.74,6,4.6100000000000003,6,4.6100000000000003,0.5,0.46500000000000002,9.9,9.9,48.3,19.8,16.100000000000001,2.23,48.3,19.8,16.100000000000001,2.23,81.099999999999994,28.1]
["HSS","HSS6x6x0.375","HSS6x6x3/8","6x6x0.375","6x6","0.375",null,null,null,null,null,null,"Square",27.48,7.58,6,4.95,6,4.95,0.375,0.34899999999999998,14.2,14.2,39.5,15.8,13.2,2.2799999999999998,39.5,15.8,13.2,2.2799999999999998,64.599999999999994,22.1]
["HSS","HSS6x6x0.313","HSS6x6x5/16","6x6x0.313","6x6","0.313",null,null,null,null,null,null,"Square",23.34,6.43,6,5.13,6,5.13,0.3125,0.29099999999999998,17.600000000000001,17.600000000000001,34.299999999999997,13.6,11.4,2.31,34.299999999999997,13.6,11.4,2.31,55.4,18.899999999999999]
["HSS","HSS6x6x0.250","HSS6x6x1/4","6x6x0.250","6x6","0.250",null,null,null,null,null,null,"Square",19.02,5.24,6,5.3,6,5.3,0.25,0.23300000000000001,22.8,22.8,28.6,11.2,9.5399999999999991,2.34,28.6,11.2,9.5399999999999991,2.34,45.6,15.4]
["HSS","HSS6x6x0.188","HSS6x6x3/16","6x6x0.188","6x6","0.188",null,null,null,null,null,null,"Square",14.53,3.98,6,5.48,6,5.48,0.1875,0.17399999999999999,31.5,31.5,22.3,8.6300000000000008,7.42,2.37,22.3,8.6300000000000008,7.42,2.37,35,11.8]
["HSS","HSS6x6x0.125","HSS6x6x1/8","6x6x0.125","6x6","0.125",null,null,null,null,null,null,"Square",9.86,2.7,6,5.65,6,5.65,0.125,0.11600000000000001,48.7,48.7,15.5,5.92,5.15,2.39,15.5,5.92,5.15,2.39,23.9,8.0299999999999994]
["HSS","HSS5.5x5.5x0.375","HSS5.5x5.5x3/8","5.5x5.5x0.375","5.5x5.5","0.375",null,null,null,null,null,null,"Square",24.93,6.88,5.5,4.45,5.5,4.45,0.375,0.34899999999999998,12.8,12.8,29.7,13.1,10.8,2.08,29.7,13.1,10.8,2.08,49,18.399999999999999]
["HSS","HSS5.5x5.5x0.313","HSS5.5x5.5x5/16","5.5x5.5x0.313","5.5x5.5","0.313",null,null,null,null,null,null,"Square",21.21,5.85,5.5,4.63,5.5,4.63,0.3125,0.29099999999999998,15.9,15.9,25.9,11.3,9.43,2.11,25.9,11.3,9.43,2.11,42.2,15.7]
["HSS","HSS5.5x5.5x0.250","HSS5.5x5.5x1/4","5.5x5.5x0.250","5.5x5.5","0.250",null,null,null,null,null,null,"Square",17.32,4.7699999999999996,5.5,4.8,5.5,4.8,0.25,0.23300000000000001,20.6,20.6,21.7,9.32,7.9,2.13,21.7,9.32,7.9,2.13,34.799999999999997,12.9]
["HSS","HSS5.5x5.5x0.188","HSS5.5x5.5x3/16","5.5x5.5x0.188","5.5x5.5","0.188",null,null,null,null,null,null,"Square",13.25,3.63,5.5,4.9800000000000004,5.5,4.9800000000000004,0.1875,0.17399999999999999,28.6,28.6,17,7.19,6.17,2.16,17,7.19,6.17,2.16,26.7,9.85]
["HSS","HSS5.5x5.5x0.125","HSS5.5x5.5x1/8","5.5x5.5x0.125","5.5x5.5","0.125",null,null,null,null,null,null,"Square",9.01,2.46,5.5,5.15,5.5,5.15,0.125,0.11600000000000001,44.4,44.4,11.8,4.95,4.3,2.19,11.8,4.95,4.3,2.19,18.3,6.72]
["HSS","HSS5x5x0.500","HSS5x5x1/2","5x5x0.500","5x5","0.500",null,null,null,null,null,null,"Square",28.43,7.88,5,3.6,5,3.6,0.5,0.46500000000000002,7.75,7.75,26,13.1,10.4,1.82,26,13.1,10.4,1.82,44.6,18.7]
["HSS","HSS5x5x0.375","HSS5x5x3/8","5x5x0.375","5x5","0.375",null,null,null,null,null,null,"Square",22.37,6.18,5,3.95,5,3.95,0.375,0.34899999999999998,11.3,11.3,21.7,10.6,8.68,1.87,21.7,10.6,8.68,1.87,36.1,14.9]
["HSS","HSS5x5x0.313","HSS5x5x5/16","5x5x0.313","5x5","0.313",null,null,null,null,null,null,"Square",19.079999999999998,5.26,5,4.13,5,4.13,0.3125,0.29099999999999998,14.2,14.2,19,9.16,7.62,1.9,19,9.16,7.62,1.9,31.2,12.8]
["HSS","HSS5x5x0.250","HSS5x5x1/4","5x5x0.250","5x5","0.250",null,null,null,null,null,null,"Square",15.62,4.3,5,4.3,5,4.3,0.25,0.23300000000000001,18.5,18.5,16,7.61,6.41,1.93,16,7.61,6.41,1.93,25.8,10.5]
["HSS","HSS5x5x0.188","HSS5x5x3/16","5x5x0.188","5x5","0.188",null,null,null,null,null,null,"Square",11.97,3.28,5,4.4800000000000004,5,4.4800000000000004,0.1875,0.17399999999999999,25.7,25.7,12.6,5.89,5.03,1.96,12.6,5.89,5.03,1.96,19.899999999999999,8.08]
["HSS","HSS5x5x0.125","HSS5x5x1/8","5x5x0.125","5x5","0.125",null,null,null,null,null,null,"Square",8.16,2.23,5,4.6500000000000004,5,4.6500000000000004,0.125,0.11600000000000001,40.1,40.1,8.8000000000000007,4.07,3.52,1.99,8.8000000000000007,4.07,3.52,1.99,13.7,5.53]
["HSS","HSS4.5x4.5x0.500","HSS4.5x4.5x1/2","4.5x4.5x0.500","4.5x4.5","0.500",null,null,null,null,null,null,"Square",25.03,6.95,4.5,3.1,4.5,3.1,0.5,0.46500000000000002,6.68,6.68,18.100000000000001,10.199999999999999,8.0299999999999994,1.61,18.100000000000001,10.199999999999999,8.0299999999999994,1.61,31.3,14.8]
["HSS","HSS4.5x4.5x0.375","HSS4.5x4.5x3/8","4.5x4.5x0.375","4.5x4.5","0.375",null,null,null,null,null,null,"Square",19.82,5.48,4.5,3.45,4.5,3.45,0.375,0.34899999999999998,9.89,9.89,15.3,8.36,6.79,1.67,15.3,8.36,6.79,1.67,25.7,11.9]
["HSS","HSS4.5x4.5x0.313","HSS4.5x4.5x5/16","4.5x4.5x0.313","4.5x4.5","0.313",null,null,null,null,null,null,"Square",16.96,4.68,4.5,3.63,4.5,3.63,0.3125,0.29099999999999998,12.5,12.5,13.5,7.27,6,1.7,13.5,7.27,6,1.7,22.3,10.199999999999999]
["HSS","HSS4.5x4.5x0.250","HSS4.5x4.5x1/4","4.5x4.5x0.250","4.5x4.5","0.250",null,null,null,null,null,null,"Square",13.91,3.84,4.5,3.8,4.5,3.8,0.25,0.23300000000000001,16.3,16.3,11.4,6.06,5.08,1.73,11.4,6.06,5.08,1.73,18.5,8.44]
["HSS","HSS4.5x4.5x0.188","HSS4.5x4.5x3/16","4.5x4.5x0.188","4.5x4.5","0.188",null,null,null,null,null,null,"Square",10.7,2.93,4.5,3.98,4.5,3.98,0.1875,0.17399999999999999,22.9,22.9,9.02,4.71,4.01,1.75,9.02,4.71,4.01,1.75,14.4,6.49]
["HSS","HSS4.5x4.5x0.125","HSS4.5x4.5x1/8","4.5x4.5x0.125","4.5x4.5","0.125",null,null,null,null,null,null,"Square",7.31,2,4.5,4.1500000000000004,4.5,4.1500000000000004,0.125,0.11600000000000001,35.799999999999997,35.799999999999997,6.35,3.27,2.82,1.78,6.35,3.27,2.82,1.78,9.92,4.45]
["HSS","HSS4x4x0.500","HSS4x4x1/2","4x4x0.500","4x4","0.500",null,null,null,null,null,null,"Square",21.63,6.02,4,2.6,4,2.6,0.5,0.46500000000000002,5.6,5.6,11.9,7.7,5.97,1.41,11.9,7.7,5.97,1.41,21,11.2]
["HSS","HSS4x4x0.375","HSS4x4x3/8","4x4x0.375","4x4","0.375",null,null,null,null,null,null,"Square",17.27,4.78,4,2.95,4,2.95,0.375,0.34899999999999998,8.4600000000000009,8.4600000000000009,10.3,6.39,5.13,1.47,10.3,6.39,5.13,1.47,17.5,9.14]
["HSS","HSS4x4x0.313","HSS4x4x5/16","4x4x0.313","4x4","0.313",null,null,null,null,null,null,"Square",14.83,4.0999999999999996,4,3.13,4,3.13,0.3125,0.29099999999999998,10.7,10.7,9.14,5.59,4.57,1.49,9.14,5.59,4.57,1.49,15.3,7.91]
["HSS","HSS4x4x0.250","HSS4x4x1/4","4x4x0.250","4x4","0.250",null,null,null,null,null,null,"Square",12.21,3.37,4,3.3,4,3.3,0.25,0.23300000000000001,14.2,14.2,7.8,4.6900000000000004,3.9,1.52,7.8,4.6900000000000004,3.9,1.52,12.8,6.56]
["HSS","HSS4x4x0.188","HSS4x4x3/16","4x4x0.188","4x4","0.188",null,null,null,null,null,null,"Square",9.42,2.58,4,3.48,4,3.48,0.1875,0.17399999999999999,20,20,6.21,3.67,3.1,1.55,6.21,3.67,3.1,1.55,10,5.07]
["HSS","HSS4x4x0.125","HSS4x4x1/8","4x4x0.125","4x4","0.125",null,null,null,null,null,null,"Square",6.46,1.77,4,3.65,4,3.65,0.125,0.11600000000000001,31.5,31.5,4.4000000000000004,2.56,2.2000000000000002,1.58,4.4000000000000004,2.56,2.2000000000000002,1.58,6.91,3.49]
["HSS","HSS3.5x3.5x0.375","HSS3.5x3.5x3/8","3.5x3.5x0.375","3.5x3.5","0.375",null,null,null,null,null,null,"Square",14.72,4.09,3.5,2.4500000000000002,3.5,2.4500000000000002,0.375,0.34899999999999998,7.03,7.03,6.49,4.6900000000000004,3.71,1.26,6.49,4.6900000000000004,3.71,1.26,11.2,6.77]
["HSS","HSS3.5x3.5x0.313","HSS3.5x3.5x5/16","3.5x3.5x0.313","3.5x3.5","0.313",null,null,null,null,null,null,"Square",12.7,3.52,3.5,2.63,3.5,2.63,0.3125,0.29099999999999998,9.0299999999999994,9.0299999999999994,5.84,4.1399999999999997,3.34,1.29,5.84,4.1399999999999997,3.34,1.29,9.89,5.9]
["HSS","HSS3.5x3.5x0.250","HSS3.5x3.5x1/4","3.5x3.5x0.250","3.5x3.5","0.250",null,null,null,null,null,null,"Square",10.51,2.91,3.5,2.8,3.5,2.8,0.25,0.23300000000000001,12,12,5.04,3.5,2.88,1.32,5.04,3.5,2.88,1.32,8.35,4.92]
["HSS","HSS3.5x3.5x188","HSS3.5x3.5x3/16","3.5x3.5x188","3.5x3.5",0.188,null,null,null,null,null,null,"Square",8.15,2.2400000000000002,3.5,2.98,3.5,2.98,0.1875,0.17399999999999999,17.100000000000001,17.100000000000001,4.05,2.76,2.31,1.35,4.05,2.76,2.31,1.35,6.56,3.83]
["HSS","HSS3.5x3.5x0.125","HSS3.5x3.5x1/8","3.5x3.5x0.125","3.5x3.5","0.125",null,null,null,null,null,null,"Square",5.61,1.54,3.5,3.15,3.5,3.15,0.125,0.11600000000000001,27.2,27.2,2.9,1.93,1.66,1.37,2.9,1.93,1.66,1.37,4.58,2.65]
["HSS","HSS3x3x0.375","HSS3x3x3/8","3x3x0.375","3x3","0.375",null,null,null,null,null,null,"Square",12.17,3.39,3,1.95,3,1.95,0.375,0.34899999999999998,5.6,5.6,3.78,3.25,2.52,1.06,3.78,3.25,2.52,1.06,6.64,4.74]
["HSS","HSS3x3x0.313","HSS3x3x5/16","3x3x0.313","3x3","0.313",null,null,null,null,null,null,"Square",10.58,2.94,3,2.13,3,2.13,0.3125,0.29099999999999998,7.31,7.31,3.45,2.9,2.2999999999999998,1.08,3.45,2.9,2.2999999999999998,1.08,5.94,4.18]
["HSS","HSS3x3x0.250","HSS3x3x1/4","3x3x0.250","3x3","0.250",null,null,null,null,null,null,"Square",8.81,2.44,3,2.2999999999999998,3,2.2999999999999998,0.25,0.23300000000000001,9.8800000000000008,9.8800000000000008,3.02,2.48,2.0099999999999998,1.1100000000000001,3.02,2.48,2.0099999999999998,1.1100000000000001,5.08,3.52]
["HSS","HSS3x3x0.188","HSS3x3x3/16","3x3x0.188","3x3","0.188",null,null,null,null,null,null,"Square",6.87,1.89,3,2.48,3,2.48,0.1875,0.17399999999999999,14.2,14.2,2.46,1.97,1.64,1.1399999999999999,2.46,1.97,1.64,1.1399999999999999,4.03,2.76]
["HSS","HSS3x3x0.125","HSS3x3x1/8","3x3x0.125","3x3","0.125",null,null,null,null,null,null,"Square",4.75,1.3,3,2.65,3,2.65,0.125,0.11600000000000001,22.9,22.9,1.78,1.4,1.19,1.17,1.78,1.4,1.19,1.17,2.84,1.92]
["HSS","HSS2.5x2.5x0.313","HSS2.5x2.5x5/16","2.5x2.5x0.313","2.5x2.5","0.313",null,null,null,null,null,null,"Square",8.4499999999999993,2.35,2.5,1.63,2.5,1.63,0.3125,0.29099999999999998,5.59,5.59,1.82,1.88,1.46,0.88,1.82,1.88,1.46,0.88,3.2,2.74]
["HSS","HSS2.5x2.5x0.250","HSS2.5x2.5x1/4","2.5x2.5x0.250","2.5x2.5","0.250",null,null,null,null,null,null,"Square",7.11,1.97,2.5,1.8,2.5,1.8,0.25,0.23300000000000001,7.73,7.73,1.63,1.63,1.3,0.90800000000000003,1.63,1.63,1.3,0.90800000000000003,2.79,2.35]
["HSS","HSS2.5x2.5x0.188","HSS2.5x2.5x3/16","2.5x2.5x0.188","2.5x2.5","0.188",null,null,null,null,null,null,"Square",5.59,1.54,2.5,1.98,2.5,1.98,0.1875,0.17399999999999999,11.4,11.4,1.35,1.32,1.08,0.93700000000000006,1.35,1.32,1.08,0.93700000000000006,2.25,1.86]
["HSS","HSS2.5x2.5x0.125","HSS2.5x2.5x1/8","2.5x2.5x0.125","2.5x2.5","0.125",null,null,null,null,null,null,"Square",3.9,1.07,2.5,2.15,2.5,2.15,0.125,0.11600000000000001,18.600000000000001,18.600000000000001,0.998,0.94699999999999995,0.79900000000000004,0.96499999999999997,0.998,0.94699999999999995,0.79900000000000004,0.96499999999999997,1.61,1.31]
["HSS","HSS2.25x2.25x0.250","HSS2.25x2.25x1/4","2.25x2.25x0.250","2.25x2.25","0.250",null,null,null,null,null,null,"Square",6.26,1.74,2.25,1.55,2.25,1.55,0.25,0.23300000000000001,6.66,6.66,1.1299999999999999,1.28,1.01,0.80600000000000005,1.1299999999999999,1.28,1.01,0.80600000000000005,1.96,1.85]
["HSS","HSS2.25x2.25x0.188","HSS2.25x2.25x3/16","2.25x2.25x0.188","2.25x2.25","0.188",null,null,null,null,null,null,"Square",4.96,1.37,2.25,1.73,2.25,1.73,0.1875,0.17399999999999999,9.93,9.93,0.95299999999999996,1.04,0.84699999999999998,0.83499999999999996,0.95299999999999996,1.04,0.84699999999999998,0.83499999999999996,1.6,1.48]
["HSS","HSS2.25x2.25x0.125","HSS2.25x2.25x1/8","2.25x2.25x0.125","2.25x2.25","0.125",null,null,null,null,null,null,"Square",3.48,0.95599999999999996,2.25,1.9,2.25,1.9,0.125,0.11600000000000001,16.399999999999999,16.399999999999999,0.71199999999999997,0.755,0.63300000000000001,0.86299999999999999,0.71199999999999997,0.755,0.63300000000000001,0.86299999999999999,1.1499999999999999,1.05]
["HSS","HSS2x2x0.250","HSS2x2x1/4","2x2x0.250","2x2","0.250",null,null,null,null,null,null,"Square",5.41,1.51,2,1.3,2,1.3,0.25,0.23300000000000001,5.58,5.58,0.747,0.96399999999999997,0.747,0.70399999999999996,0.747,0.96399999999999997,0.747,0.70399999999999996,1.31,1.41]
["HSS","HSS2x2x0.188","HSS2x2x3/16","2x2x0.188","2x2","0.188",null,null,null,null,null,null,"Square",4.32,1.19,2,1.48,2,1.48,0.1875,0.17399999999999999,8.49,8.49,0.64100000000000001,0.79700000000000004,0.64100000000000001,0.73299999999999998,0.64100000000000001,0.79700000000000004,0.64100000000000001,0.73299999999999998,1.0900000000000001,1.1399999999999999]
["HSS","HSS2x2x0.125","HSS2x2x1/8","2x2x0.125","2x2","0.125",null,null,null,null,null,null,"Square",3.05,0.84,2,1.65,2,1.65,0.125,0.11600000000000001,14.2,14.2,0.48599999999999999,0.58399999999999996,0.48599999999999999,0.76100000000000001,0.48599999999999999,0.58399999999999996,0.48599999999999999,0.76100000000000001,0.79600000000000004,0.81699999999999995]
["HSS","HSS1.5x1.5x0.250","HSS1.5x1.5x1/4","1.5x1.5x0.250","1.5x1.5","0.250",null,null,null,null,null,null,"Square",3.71,1.04,1.5,0.80100000000000005,1.5,"0.801",0.25,0.23300000000000001,3.44,3.44,0.26,0.46899999999999997,0.34599999999999997,0.5,0.26,0.46899999999999997,0.34599999999999997,0.5,0.47,0.69899999999999995]
["HSS","HSS1.5x1.5x0.188","HSS1.5x1.5x3/16","1.5x1.5x0.188","1.5x1.5","0.188",null,null,null,null,null,null,"Square",3.04,0.84499999999999997,1.5,0.97799999999999998,1.5,"0.978",0.188,0.17399999999999999,5.62,5.62,0.23599999999999999,0.40600000000000003,0.315,0.52800000000000002,0.23599999999999999,0.40600000000000003,0.315,0.52800000000000002,0.41399999999999998,0.59199999999999997]
["HSS","HSS1.5x1.5x0.125","HSS1.5x1.5x1/8","1.5x1.5x0.125","1.5x1.5","0.125",null,null,null,null,null,null,"Square",2.2000000000000002,0.60799999999999998,1.5,1.1499999999999999,1.5,"1.15",0.125,0.11600000000000001,9.93,9.93,0.188,0.309,0.251,0.55700000000000005,0.188,0.309,0.251,0.55700000000000005,0.316,0.438]

{"sheet":"HSS1085_Database","index":8,"n_rows":483,"n_cols":33,"rows_kept":483,"cut":false,"hidden":false,"merged":[]}
["Type","EDI_Std_Nomenclature","AISC_Manual_Label","Column1","Column2","Column3","Column4","Column5","Column6","Column7","Column8","Column9","Column10","W","A","Depth","Width","Added to database",null,"tnom","tdes","b/tdes","h/tdes","Ix","Zx","Sx","rx","Iy","Zy","Sy","ry","J","C"]
[null,null,null,"hss1085_hss","Size","Thickness","Unique ","Member ","Thickness","Different","t start row","t end row","Sq/rect","weight","area","depth","width","h","b","tnom","tdes","b_t","h_t","Ix","Zx","Sx","rx","Iy","Zy","Sy","ry","J","C"]
[null,null,null,null,null,null,"sizes",null,null,"thicknesses",null,null,null,"lbs/ft^2","in^2","in","in","in","in","in","in",null," ","in^4","in^4","in^3","in","in^4","in^4","in^3","in","in^4","in^6"]
["HSS","HSS34x10x1","HSS34x10x1","34x10x1","34x10",1,"34x10",null,null,4,4,{"$f":"+K4+J4-1","v":7},"Rectangular",277.07,81.400000000000006,34,10,{"$f":"W4*U4","v":31},{"$f":"V4*U4","v":7},1,1,7,31,10200,799,599,11.2,1410,326,282,4.16,4280,590]
["HSS","HSS34x10x0.875","HSS34x10x7/8","34x10x0.875","34x10",0.875,"30x10",null,null,5,{"$f":"+L4+1","v":8},{"$f":"+K5+J5-1","v":12},"Rectangular",244.88,72,34,10,{"$f":"W5*U5","v":31.412499999999998},{"$f":"V5*U5","v":7.3762499999999998},0.875,0.875,8.43,35.9,9130,712,537,11.3,1280,292,256,4.22,3850,526]
["HSS","HSS34x10x0.750","HSS34x10x3/4","34x10x0.750","34x10",0.75,"24x20",null,null,5,{"$f":"+L5+1","v":13},{"$f":"+K6+J6-1","v":17},"Rectangular",212,62.3,34,10,31.724999999999998,7.7250000000000005,0.75,0.75,10.3,42.3,8030,621,472,11.4,1140,256,228,4.2699999999999996,3390,460]
["HSS","HSS34x10x0.625","HSS34x10x5/8","34x10x0.625","34x10",0.625,"24x18",null,null,5,18,22,"Rectangular",178.41,52.4,34,10,32.125,8.125,0.625,0.625,13,51.4,6850,527,403,11.4,981,218,196,4.33,2900,390]
["HSS","HSS30x10x1","HSS30x10x1","30x10x1","30x10",1,"24x16",null,null,5,23,27,"Rectangular",249.85,73.400000000000006,30,10,27,7,1,1,7,27,7300,644,487,9.9700000000000006,1250,290,250,4.12,3660,518]
["HSS","HSS30x10x0.875","HSS30x10x7/8","30x10x0.875","30x10",0.875,"24x14",null,null,6,28,33,"Rectangular",221.06,65,30,10,27.387499999999999,7.3762499999999998,0.875,0.875,8.43,31.3,6570,575,438,10.1,1130,260,226,4.18,3290,463]
["HSS","HSS30x10x0.750","HSS30x10x3/4","30x10x0.750","30x10",0.75,"24x12",null,null,8,34,41,"Rectangular",191.58,56.3,30,10,27.75,7.7250000000000005,0.75,0.75,10.3,37,5780,502,386,10.1,1010,228,202,4.2300000000000004,2900,404]
["HSS","HSS30x10x0.625","HSS30x10x5/8","30x10x0.625","30x10",0.625,"24x8",null,null,4,42,45,"Rectangular",161.4,47.4,30,10,28.125,8.125,0.625,0.625,13,45,4950,427,330,10.199999999999999,871,195,174,4.29,2480,343]
["HSS","HSS30x10x0.500","HSS30x10x1/2","30x10x0.500","30x10",0.5,"22x20",null,null,5,46,50,"Rectangular",130.52000000000001,38.4,30,10,28.5,8.5,0.5,0.5,17,57,4070,348,271,10.3,723,160,145,4.34,2040,280]
["HSS","HSS24x20x0.750","HSS24x20x3/4","24x20x0.750","24x20",0.75,"22x18",null,null,5,51,55,"Rectangular",212,62.3,24,20,21.75,17.774999999999999,0.75,0.75,23.7,29,5280,521,440,9.1999999999999993,3990,461,399,8,7200,670]
["HSS","HSS24x20x0.625","HSS24x20x5/8","24x20x0.625","24x20",0.625,"22x16",null,null,6,56,61,"Rectangular",178.41,52.4,24,20,22.125,18.125,0.625,0.625,29,35.4,4500,442,375,9.26,3400,391,340,8.06,6090,565]
["HSS","HSS24x20x0.500","HSS24x20x1/2","24x20x0.500","24x20",0.5,"22x14",null,null,6,62,67,"Rectangular",144.13,42.4,24,20,22.5,18.5,0.5,0.5,37,45,3680,360,307,9.33,2790,318,279,8.1199999999999992,4950,458]
["HSS","HSS24x20x0.375","HSS24x20x3/8","24x20x0.375","24x20",0.375,"22x10",null,null,5,68,72,"Rectangular",109.15,32.1,24,20,22.875,18.862499999999997,0.375,0.375,50.3,61,2830,274,236,9.39,2140,243,214,8.17,3770,348]
["HSS","HSS24x20x0.312","HSS24x20x5/16","24x20x0.312","24x20",0.312,"20x16",null,null,6,73,78,"Rectangular",91.39,26.9,24,20,23.068100000000001,19.061699999999998,0.3125,0.313,60.9,73.7,2390,231,199,9.42,1810,204,181,8.1999999999999993,3170,292]
["HSS","HSS24x18x0.750","HSS24x18x3/4","24x18x0.750","24x18",0.75,"20x12",null,null,7,79,85,"Rectangular",201.79,59.3,24,18,21.75,15.75,0.75,0.75,21,29,4870,487,406,9.06,3130,400,348,7.26,6070,600]
["HSS","HSS24x18x0.625","HSS24x18x5/8","24x18x0.625","24x18",0.625,"20x8",null,null,7,86,92,"Rectangular",169.91,49.9,24,18,22.125,16.125,0.625,0.625,25.8,35.4,4160,413,347,9.1300000000000008,2680,339,298,7.32,5140,507]
["HSS","HSS24x18x0.500","HSS24x18x1/2","24x18x0.500","24x18",0.5,"20x6",null,null,5,93,97,"Rectangular",137.32,40.4,24,18,22.5,16.5,0.5,0.5,33,45,3410,336,284,9.19,2200,277,244,7.38,4180,411]
["HSS","HSS24x18x0.375","HSS24x18x3/8","24x18x0.375","24x18",0.375,"20x4",null,null,4,98,101,"Rectangular",104.04,30.6,24,18,22.875,16.875,0.375,0.375,45,61,2620,257,218,9.25,1690,211,188,7.43,3190,312]
["HSS","HSS24x18x0.312","HSS24x18x5/16","24x18x0.312","24x18",0.312,"18x10",null,null,5,102,106,"Rectangular",87.14,25.6,24,18,23.068100000000001,17.058499999999999,0.3125,0.313,54.5,73.7,2210,216,184,9.2799999999999994,1430,178,159,7.46,2680,262]
["HSS","HSS24x16x0.750","HSS24x16x3/4","24x16x0.750","24x16",0.75,"18x8",null,null,5,107,111,"Rectangular",191.58,56.3,24,16,21.75,13.725000000000001,0.75,0.75,18.3,29,4460,452,372,8.91,2390,342,299,6.51,4990,530]
["HSS","HSS24x16x0.625","HSS24x16x5/8","24x16x0.625","24x16",0.625,"18x6",null,null,6,112,117,"Rectangular",161.4,47.4,24,16,22.125,14.125,0.625,0.625,22.6,35.4,3820,384,318,8.9700000000000006,2050,291,256,6.57,4240,448]
["HSS","HSS24x16x0.500","HSS24x16x1/2","24x16x0.500","24x16",0.5,"16x12",null,null,7,118,124,"Rectangular",130.52000000000001,38.4,24,16,22.5,14.5,0.5,0.5,29,45,3130,313,261,9.0399999999999991,1680,237,210,6.62,3450,364]
["HSS","HSS24x16x0.375","HSS24x16x3/8","24x16x0.375","24x16",0.375,"16x10",null,null,5,125,129,"Rectangular",98.94,29.1,24,16,22.875,14.887500000000001,0.375,0.375,39.700000000000003,61,2410,239,201,9.1,1300,181,163,6.68,2630,277]
["HSS","HSS24x16x0.312","HSS24x16x5/16","24x16x0.312","24x16",0.312,"16x8",null,null,7,130,136,"Rectangular",82.88,24.4,24,16,23.068100000000001,15.055300000000001,0.3125,0.313,48.1,73.7,2040,201,170,9.1300000000000008,1100,153,138,6.71,2220,232]
["HSS","HSS24x14x0.750","HSS24x14x3/4","24x14x0.750","24x14",0.75,"16x6",null,null,6,137,142,"Rectangular",181.37,53.3,24,14,21.75,11.774999999999999,0.75,0.75,15.7,29,4060,417,338,8.73,1760,287,251,5.74,3980,460]
["HSS","HSS24x14x0.625","HSS24x14x5/8","24x14x0.625","24x14",0.625,"16x4",null,null,6,143,148,"Rectangular",152.88999999999999,44.9,24,14,22.125,12.125,0.625,0.625,19.399999999999999,35.4,3480,354,290,8.8000000000000007,1510,245,216,5.8,3380,390]
["HSS","HSS24x14x0.500","HSS24x14x1/2","24x14x0.500","24x14",0.5,"14x12",null,null,5,149,153,"Rectangular",123.71,36.4,24,14,22.5,12.5,0.5,0.5,25,45,2860,289,238,8.86,1250,200,179,5.86,2760,317]
["HSS","HSS24x14x0.375","HSS24x14x3/8","24x14x0.375","24x14",0.375,"14x10",null,null,7,154,160,"Rectangular",93.83,27.6,24,14,22.875,12.862499999999999,0.375,0.375,34.299999999999997,61,2200,221,183,8.93,964,153,138,5.91,2110,241]
["HSS","HSS24x14x0.312","HSS24x14x5/16","24x14x0.312","24x14",0.312,"14x8",null,null,6,161,166,"Rectangular",78.63,23.1,24,14,23.068100000000001,13.052100000000001,0.3125,0.313,41.7,73.7,1860,186,155,8.9600000000000009,816,129,117,5.94,1780,203]
["HSS","HSS24x14x0.250","HSS24x14x1/4","24x14x0.250","24x14",0.25,"14x6",null,null,6,167,172,"Rectangular",63.25,18.600000000000001,24,14,23.25,13.25,0.25,0.25,53,93,1500,150,125,9,662,104,94.6,5.97,1430,163]
["HSS","HSS24x12x1","HSS24x12x1","24x12x1","24x12",1,"14x4",null,null,6,173,178,"Rectangular",222.63,65.400000000000006,24,12,21,9,1,1,9,21,4590,488,383,8.3800000000000008,1540,299,257,4.8499999999999996,3850,502]
["HSS","HSS24x12x0.875","HSS24x12x7/8","24x12x0.875","24x12",0.875,"12x10",null,null,6,179,184,"Rectangular",197.24,58,24,12,21.349999999999998,9.3624999999999989,0.875,0.875,10.7,24.4,4140,436,345,8.4499999999999993,1390,268,232,4.9000000000000004,3460,448]
["HSS","HSS24x12x0.750","HSS24x12x3/4","24x12x0.750","24x12",0.75,"12x8",null,null,6,185,190,"Rectangular",171.16,50.3,24,12,21.75,9.75,0.75,0.75,13,29,3650,382,304,8.52,1240,235,207,4.96,3030,391]
["HSS","HSS24x12x0.625","HSS24x12x5/8","24x12x0.625","24x12",0.625,"12x6",null,null,6,191,196,"Rectangular",144.38999999999999,42.4,24,12,22.125,10.125,0.625,0.625,16.2,35.4,3130,325,261,8.59,1070,201,178,5.01,2590,331]
["HSS","HSS24x12x0.500","HSS24x12x1/2","24x12x0.500","24x12",0.5,"12x4",null,null,6,197,202,"Rectangular",116.91,34.4,24,12,22.5,10.5,0.5,0.5,21,45,2580,266,215,8.67,883,164,147,5.07,2120,270]
["HSS","HSS24x12x0.375","HSS24x12x3/8","24x12x0.375","24x12",0.375,"12x3",null,null,3,203,205,"Rectangular",88.73,26.1,24,12,22.875,10.875,0.375,0.375,29,61,1990,203,166,8.74,685,126,114,5.12,1620,206]
["HSS","HSS24x12x0.312","HSS24x12x5/16","24x12x0.312","24x12",0.312,"12x2",null,null,3,206,208,"Rectangular",74.38,21.9,24,12,23.068100000000001,11.0489,0.3125,0.313,35.299999999999997,73.7,1680,171,140,8.77,581,107,96.8,5.15,1370,173]
["HSS","HSS24x12x0.250","HSS24x12x1/4","24x12x0.250","24x12",0.25,"10x8",null,null,6,209,214,"Rectangular",59.85,17.600000000000001,24,12,23.25,11.25,0.25,0.25,45,93,1360,138,114,8.81,472,86.1,78.7,5.18,1110,139]
["HSS","HSS24x8x0.500","HSS24x8x1/2","24x8x0.500","24x8",0.5,"10x6",null,null,6,215,220,"Rectangular",103.3,30.4,24,8,22.5,6.5,0.5,0.5,13,45,2030,219,169,8.17,357,99.7,89.3,3.43,1020,176]
["HSS","HSS24x8x0.375","HSS24x8x3/8","24x8x0.375","24x8",0.375,"10x5",null,null,3,221,223,"Rectangular",78.52,23.1,24,8,22.875,6.8625000000000007,0.375,0.375,18.3,61,1570,168,131,8.25,280,77.099999999999994,70,3.48,789,135]
["HSS","HSS24x8x0.312","HSS24x8x5/16","24x8x0.312","24x8",0.312,"10x4",null,null,6,224,229,"Rectangular",65.87,19.399999999999999,24,8,23.068100000000001,7.0738000000000003,0.3125,0.313,22.6,73.7,1330,142,111,8.2899999999999991,239,65.3,59.8,3.51,669,114]
["HSS","HSS24x8x0.250","HSS24x8x1/4","24x8x0.250","24x8",0.25,"10x3.5",null,null,4,230,233,"Rectangular",53.05,15.6,24,8,23.25,7.25,0.25,0.25,29,93,1080,115,90.2,8.33,195,52.9,48.8,3.54,543,92]
["HSS","HSS22x20x0.750","HSS22x20x3/4","22x20x0.750","22x20",0.75,"10x3",null,null,4,234,237,"Rectangular",201.79,59.3,22,20,19.725000000000001,17.774999999999999,0.75,0.75,23.7,26.3,4290,461,390,8.51,3710,432,371,7.91,6320,612]
["HSS","HSS22x20x0.625","HSS22x20x5/8","22x20x0.625","22x20",0.625,"10x2",null,null,4,238,241,"Rectangular",169.91,49.9,22,20,20.125,18.125,0.625,0.625,29,32.200000000000003,3670,391,333,8.57,3170,366,317,7.97,5350,517]
["HSS","HSS22x20x0.500","HSS22x20x1/2","22x20x0.500","22x20",0.5,"9x7",null,null,6,242,247,"Rectangular",137.32,40.4,22,20,20.5,18.5,0.5,0.5,37,41,3010,318,273,8.6300000000000008,2600,298,260,8.0299999999999994,4350,419]
["HSS","HSS22x20x0.375","HSS22x20x3/8","22x20x0.375","22x20",0.375,"9x5",null,null,6,248,253,"Rectangular",104.04,30.6,22,20,20.887500000000003,18.862499999999997,0.375,0.375,50.3,55.7,2310,243,210,8.69,2000,228,200,8.09,3310,318]
["HSS","HSS22x20x0.312","HSS22x20x5/16","22x20x0.312","22x20",0.312,"9x3",null,null,5,254,258,"Rectangular",87.14,25.6,22,20,21.064899999999998,19.061699999999998,0.3125,0.313,60.9,67.3,1950,204,177,8.7200000000000006,1690,192,169,8.11,2780,267]
["HSS","HSS22x18x0.750","HSS22x18x3/4","22x18x0.750","22x18",0.75,"8x6",null,null,6,259,264,"Rectangular",191.58,56.3,22,18,19.725000000000001,15.75,0.75,0.75,21,26.3,3960,429,360,8.3800000000000008,2900,374,322,7.18,5340,548]
["HSS","HSS22x18x0.625","HSS22x18x5/8","22x18x0.625","22x18",0.625,"8x4",null,null,6,265,270,"Rectangular",161.4,47.4,22,18,20.125,16.125,0.625,0.625,25.8,32.200000000000003,3380,364,307,8.44,2490,318,277,7.24,4530,463]
["HSS","HSS22x18x0.500","HSS22x18x1/2","22x18x0.500","22x18",0.5,"8x3",null,null,5,271,275,"Rectangular",130.52000000000001,38.4,22,18,20.5,16.5,0.5,0.5,33,41,2780,297,252,8.51,2040,259,227,7.3,3680,376]
["HSS","HSS22x18x0.375","HSS22x18x3/8","22x18x0.375","22x18",0.375,"8x2",null,null,5,276,280,"Rectangular",98.94,29.1,22,18,20.887500000000003,16.875,0.375,0.375,45,55.7,2130,227,194,8.57,1570,198,174,7.36,2810,286]
["HSS","HSS22x18x0.312","HSS22x18x5/16","22x18x0.312","22x18",0.312,"7x5",null,null,5,281,285,"Rectangular",82.88,24.4,22,18,21.064899999999998,17.058499999999999,0.3125,0.313,54.5,67.3,1800,191,164,8.6,1330,167,148,7.39,2360,240]
["HSS","HSS22x16x0.750","HSS22x16x3/4","22x16x0.750","22x16",0.75,"7x4",null,null,5,286,290,"Rectangular",181.37,53.3,22,16,19.725000000000001,13.725000000000001,0.75,0.75,18.3,26.3,3620,397,329,8.24,2210,319,276,6.44,4400,484]
["HSS","HSS22x16x0.625","HSS22x16x5/8","22x16x0.625","22x16",0.625,"7x3",null,null,5,291,295,"Rectangular",152.88999999999999,44.9,22,16,20.125,14.125,0.625,0.625,22.6,32.200000000000003,3100,337,282,8.3000000000000007,1900,271,238,6.5,3740,410]
["HSS","HSS22x16x0.500","HSS22x16x1/2","22x16x0.500","22x16",0.5,"7x2",null,null,2,296,297,"Rectangular",123.71,36.4,22,16,20.5,14.5,0.5,0.5,29,41,2540,275,231,8.3699999999999992,1560,222,195,6.56,3050,333]
["HSS","HSS22x16x0.375","HSS22x16x3/8","22x16x0.375","22x16",0.375,"6x5",null,null,5,298,302,"Rectangular",93.83,27.6,22,16,20.887500000000003,14.887500000000001,0.375,0.375,39.700000000000003,55.7,1960,210,178,8.43,1210,170,151,6.61,2330,253]
["HSS","HSS22x16x0.312","HSS22x16x5/16","22x16x0.312","22x16",0.312,"6x4",null,null,5,303,307,"Rectangular",78.63,23.1,22,16,21.064899999999998,15.055300000000001,0.3125,0.313,48.1,67.3,1660,177,151,8.4600000000000009,1020,143,128,6.64,1960,213]
["HSS","HSS22x16x0.250","HSS22x16x1/4","22x16x0.250","22x16",0.25,"6x3",null,null,5,308,312,"Rectangular",63.25,18.600000000000001,22,16,21.25,15.25,0.25,0.25,61,85,1340,143,122,8.49,827,115,103,6.67,1580,171]
["HSS","HSS22x14x0.750","HSS22x14x3/4","22x14x0.750","22x14",0.75,"6x2",null,null,4,313,316,"Rectangular",171.16,50.3,22,14,19.725000000000001,11.774999999999999,0.75,0.75,15.7,26.3,3280,365,298,8.07,1630,267,233,5.69,3520,421]
["HSS","HSS22x14x0.625","HSS22x14x5/8","22x14x0.625","22x14",0.625,"5x4",null,null,5,317,321,"Rectangular",144.38999999999999,42.4,22,14,20.125,12.125,0.625,0.625,19.399999999999999,32.200000000000003,2810,311,256,8.14,1400,228,200,5.74,2990,356]
["HSS","HSS22x14x0.500","HSS22x14x1/2","22x14x0.500","22x14",0.5,"5x3",null,null,5,322,326,"Rectangular",116.91,34.4,22,14,20.5,12.5,0.5,0.5,25,41,2310,254,210,8.2100000000000009,1160,186,166,5.8,2440,290]
["HSS","HSS22x14x0.375","HSS22x14x3/8","22x14x0.375","22x14",0.375,"5x2.5",null,null,2,327,328,"Rectangular",88.73,26.1,22,14,20.887500000000003,12.862499999999999,0.375,0.375,34.299999999999997,55.7,1780,194,162,8.27,894,143,128,5.86,1870,221]
["HSS","HSS22x14x0.312","HSS22x14x5/16","22x14x0.312","22x14",0.312,"5x2",null,null,4,329,332,"Rectangular",74.38,21.9,22,14,21.064899999999998,13.052100000000001,0.3125,0.313,41.7,67.3,1510,164,137,8.3000000000000007,758,120,108,5.88,1580,186]
["HSS","HSS22x14x0.250","HSS22x14x1/4","22x14x0.250","22x14",0.25,"4x3",null,null,4,333,336,"Rectangular",59.85,17.600000000000001,22,14,21.25,13.25,0.25,0.25,53,85,1220,132,111,8.34,615,97.3,87.9,5.91,1270,149]
["HSS","HSS22x10x0.625","HSS22x10x5/8","22x10x0.625","22x10",0.625,"4x2.5",null,null,2,337,338,"Rectangular",127.37,37.4,22,10,20.125,8.125,0.625,0.625,13,32.200000000000003,2240,257,204,7.74,651,148,130,4.17,1660,250]
["HSS","HSS22x10x0.500","HSS22x10x1/2","22x10x0.500","22x10",0.5,"4x2",null,null,4,339,342,"Rectangular",103.3,30.4,22,10,{"$f":"W69*U69","v":20.5},{"$f":"V69*U69","v":8.5},0.5,0.5,17,41,1850,211,168,7.81,542,122,108,4.2300000000000004,1370,204]
["HSS","HSS22x10x0.375","HSS22x10x3/8","22x10x0.375","22x10",0.375,"4x1.5",null,null,2,{"$f":"+L69+1","v":343},{"$f":"+K70+J70-1","v":344},"Rectangular",78.52,23.1,22,10,20.887500000000003,8.8874999999999993,0.375,0.375,23.7,55.7,1430,162,130,7.88,423,93.7,84.6,4.28,1050,156]
["HSS","HSS22x10x0.312","HSS22x10x5/16","22x10x0.312","22x10",0.312,"3.5x2.5",null,null,4,345,348,"Rectangular",65.87,19.399999999999999,22,10,21.064899999999998,9.0457000000000001,0.3125,0.313,28.9,67.3,1220,137,110,7.92,360,79.2,72,4.3099999999999996,890,131]
["HSS","HSS22x10x0.250","HSS22x10x1/4","22x10x0.250","22x10",0.25,"3.5x2",null,null,2,349,350,"Rectangular",53.05,15.6,22,10,21.25,9.25,0.25,0.25,37,85,986,110,89.6,7.95,293,64.099999999999994,58.6,4.34,720,106]
["HSS","HSS20x16x0.750","HSS20x16x3/4","20x16x0.750","20x16",0.75,"3.5x1.5",null,null,2,351,352,"Rectangular",171.16,50.3,20,16,17.774999999999999,13.725000000000001,0.75,0.75,18.3,23.7,2880,345,288,7.56,2040,296,255,6.36,3830,439]
["HSS","HSS20x16x0.625","HSS20x16x5/8","20x16x0.625","20x16",0.625,"3x2.5",null,null,3,353,355,"Rectangular",144.38999999999999,42.4,20,16,18.125,14.125,0.625,0.625,22.6,29,2470,294,247,7.62,1750,252,219,6.42,3250,371]
["HSS","HSS20x16x0.500","HSS20x16x1/2","20x16x0.500","20x16",0.5,"3x2",null,null,3,356,358,"Rectangular",116.91,34.4,20,16,18.5,14.5,0.5,0.5,29,37,2030,240,203,7.69,1440,206,180,6.48,2650,302]
["HSS","HSS20x16x0.375","HSS20x16x3/8","20x16x0.375","20x16",0.375,"3x1.5",null,null,2,359,360,"Rectangular",88.73,26.1,20,16,18.862499999999997,14.887500000000001,0.375,0.375,39.700000000000003,50.3,1570,184,157,7.75,1110,158,139,6.54,2020,230]
["HSS","HSS20x16x0.312","HSS20x16x5/16","20x16x0.312","20x16",0.312,"3x1",null,null,1,361,361,"Rectangular",74.38,21.9,20,16,19.061699999999998,15.055300000000001,0.3125,0.313,48.1,60.9,1330,155,133,7.78,944,133,118,6.57,1710,193]
["HSS","HSS20x16x0.250","HSS20x16x1/4","20x16x0.250","20x16",0.25,"2.5x2",null,null,2,362,363,"Rectangular",59.85,17.600000000000001,20,16,19.25,15.25,0.25,0.25,61,77,1070,125,107,7.81,765,108,95.6,6.6,1370,155]
["HSS","HSS20x12x1","HSS20x12x1","20x12x1","20x12",1,"2.5x1.5",null,null,2,364,365,"Rectangular",195.4,57.4,20,12,17,9,1,1,9,17,2890,365,289,7.1,1290,255,215,4.75,2990,414]
["HSS","HSS20x12x0.875","HSS20x12x7/8","20x12x0.875","20x12",0.875,"2.5x1",null,null,1,366,366,"Rectangular",173.43,51,20,12,17.412499999999998,9.3624999999999989,0.875,0.875,10.7,19.899999999999999,2620,327,262,7.17,1180,229,197,4.8,2680,370]
["HSS","HSS20x12x0.750","HSS20x12x3/4","20x12x0.750","20x12",0.75,"2x1.5",null,null,1,367,367,"Rectangular",150.75,44.3,20,12,17.774999999999999,9.75,0.75,0.75,13,23.7,2320,287,232,7.24,1050,202,175,4.8600000000000003,2360,323]
["HSS","HSS20x12x0.625","HSS20x12x5/8","20x12x0.625","20x12",0.625,"2x1",null,null,1,368,368,"Rectangular",127.37,37.4,20,12,18.125,10.125,0.625,0.625,16.2,29,2000,245,200,7.3,904,172,151,4.92,2010,275]
["HSS","HSS20x12x0.500","HSS20x12x1/2","20x12x0.500","20x12",0.5," ",null,null,null,null,null,"Rectangular",103.3,30.4,20,12,18.5,10.5,0.5,0.5,21,37,1650,201,165,7.37,750,141,125,4.97,1650,224]
["HSS","HSS20x12x0.375","HSS20x12x3/8","20x12x0.375","20x12",0.375,null,null,null,null,null,null,"Rectangular",78.52,23.1,20,12,18.862499999999997,10.875,0.375,0.375,29,50.3,1280,154,128,7.44,583,109,97.2,5.03,1270,171]
["HSS","HSS20x12x0.312","HSS20x12x5/16","20x12x0.312","20x12",0.312,null,null,null,null,null,null,"Rectangular",65.87,19.399999999999999,20,12,19.061699999999998,11.0489,0.3125,0.313,35.299999999999997,60.9,1080,130,108,7.47,495,91.9,82.5,5.0599999999999996,1070,144]
["HSS","HSS20x8x1","HSS20x8x1","20x8x1","20x8",1,null,null,null,null,null,null,"Rectangular",168.18,49.4,20,8,17,5,1,1,5,17,2170,289,217,6.63,493,148,123,3.16,1390,262]
["HSS","HSS20x8x0.875","HSS20x8x7/8","20x8x0.875","20x8",0.875,null,null,null,null,null,null,"Rectangular",149.61000000000001,44,20,8,17.412499999999998,5.3724999999999996,0.875,0.875,6.14,19.899999999999999,1980,260,198,6.71,454,134,114,3.21,1270,236]
["HSS","HSS20x8x0.750","HSS20x8x3/4","20x8x0.750","20x8",0.75,null,null,null,null,null,null,"Rectangular",130.33000000000001,38.299999999999997,20,8,17.774999999999999,5.7524999999999995,0.75,0.75,7.67,23.7,1760,230,176,6.78,409,119,102,3.27,1130,208]
["HSS","HSS20x8x0.625","HSS20x8x5/8","20x8x0.625","20x8",0.625,null,null,null,null,null,null,"Rectangular",110.36,32.4,20,8,18.125,6.125,0.625,0.625,9.8000000000000007,29,1530,197,153,6.86,358,103,89.5,3.32,973,178]
["HSS","HSS20x8x0.500","HSS20x8x1/2","20x8x0.500","20x8",0.5,null,null,null,null,null,null,"Rectangular",89.68,26.4,20,8,18.5,6.5,0.5,0.5,13,37,1270,162,127,6.94,300,84.7,75,3.38,806,146]
["HSS","HSS20x8x0.375","HSS20x8x3/8","20x8x0.375","20x8",0.375,null,null,null,null,null,null,"Rectangular",68.31,20.100000000000001,20,8,18.862499999999997,6.8625000000000007,0.375,0.375,18.3,50.3,988,125,98.8,7.02,236,65.599999999999994,59,3.43,625,112]
["HSS","HSS20x8x0.312","HSS20x8x5/16","20x8x0.312","20x8",0.312,null,null,null,null,null,null,"Rectangular",57.36,16.899999999999999,20,8,19.061699999999998,7.0738000000000003,0.3125,0.313,22.6,60.9,840,106,84,7.05,202,55.6,50.5,3.46,530,94.6]
["HSS","HSS20x6x0.625","HSS20x6x5/8","20x6x0.625","20x6",0.625,null,null,null,null,null,null,"Rectangular",101.85,29.9,20,6,18.125,4.125,0.625,0.625,6.6,29,1290,173,129,6.57,184,71.3,61.3,2.48,558,129]
["HSS","HSS20x6x0.500","HSS20x6x1/2","20x6x0.500","20x6",0.5,null,null,null,null,null,null,"Rectangular",82.88,24.4,20,6,18.5,4.5,0.5,0.5,9,37,1080,142,108,6.66,157,59.4,52.3,2.54,468,107]
["HSS","HSS20x6x0.375","HSS20x6x3/8","20x6x0.375","20x6",0.375,null,null,null,null,null,null,"Rectangular",63.21,18.600000000000001,20,6,18.862499999999997,4.875,0.375,0.375,13,50.3,843,110,84.3,6.74,125,46.3,41.7,2.59,367,82.6]
["HSS","HSS20x6x0.312","HSS20x6x5/16","20x6x0.312","20x6",0.312,null,null,null,null,null,null,"Rectangular",53.11,15.6,20,6,19.061699999999998,5.0705999999999998,0.3125,0.313,16.2,60.9,718,93.2,71.8,6.78,107,39.4,35.700000000000003,2.62,313,70]
["HSS","HSS20x6x0.250","HSS20x6x1/4","20x6x0.250","20x6",0.25,null,null,null,null,null,null,"Rectangular",42.84,12.6,20,6,19.25,5.25,0.25,0.25,21,77,586,75.599999999999994,58.6,6.82,88.2,32.1,29.4,2.65,256,56.7]
["HSS","HSS20x4x0.500","HSS20x4x1/2","20x4x0.500","20x4",0.5,null,null,null,null,null,null,"Rectangular",76.069999999999993,22.4,20,4,18.5,2.5,0.5,0.5,5,37,889,123,88.9,6.31,61.6,36,30.8,1.66,205,67.8]
["HSS","HSS20x4x0.375","HSS20x4x3/8","20x4x0.375","20x4",0.375,null,null,null,null,null,null,"Rectangular",58.1,17.100000000000001,20,4,18.862499999999997,2.8762499999999998,0.375,0.375,7.67,50.3,699,95.3,69.900000000000006,6.4,50.3,28.5,25.2,1.72,165,53.2]
["HSS","HSS20x4x0.312","HSS20x4x5/16","20x4x0.312","20x4",0.312,null,null,null,null,null,null,"Rectangular",48.86,14.4,20,4,19.061699999999998,3.06114,0.3125,0.313,9.7799999999999994,60.9,597,80.900000000000006,59.7,6.44,43.7,24.4,21.9,1.74,143,45.3]
["HSS","HSS20x4x0.250","HSS20x4x1/4","20x4x0.250","20x4",0.25,null,null,null,null,null,null,"Rectangular",39.43,11.6,20,4,19.25,3.25,0.25,0.25,13,77,488,65.7,48.8,6.49,36.4,20,18.2,1.77,118,37]
["HSS","HSS18x10x0.625","HSS18x10x5/8","18x10x0.625","18x10",0.625,null,null,null,null,null,null,"Rectangular",110.36,32.4,18,10,16.125,8.125,0.625,0.625,13,25.8,1350,187,150,6.46,541,124,108,4.08,1270,203]
["HSS","HSS18x10x0.500","HSS18x10x1/2","18x10x0.500","18x10",0.5,null,null,null,null,null,null,"Rectangular",89.68,26.4,18,10,16.5,8.5,0.5,0.5,17,33,1120,154,125,6.53,452,103,90.4,4.1399999999999997,1040,166]
["HSS","HSS18x10x0.375","HSS18x10x3/8","18x10x0.375","18x10",0.375,null,null,null,null,null,null,"Rectangular",68.31,20.100000000000001,18,10,16.875,8.8874999999999993,0.375,0.375,23.7,45,874,119,97.2,6.6,354,79.2,70.8,4.2,804,127]
["HSS","HSS18x10x0.312","HSS18x10x5/16","18x10x0.312","18x10",0.312,null,null,null,null,null,null,"Rectangular",57.36,16.899999999999999,18,10,17.058499999999999,9.0457000000000001,0.3125,0.313,28.9,54.5,743,100,82.6,6.63,301,67.099999999999994,60.2,4.22,680,107]
["HSS","HSS18x10x0.250","HSS18x10x1/4","18x10x0.250","18x10",0.25,null,null,null,null,null,null,"Rectangular",46.24,13.6,18,10,17.25,9.25,0.25,0.25,37,69,604,81.2,67.099999999999994,6.67,246,54.4,49.2,4.25,550,86.5]
["HSS","HSS18x8x0.625","HSS18x8x5/8","18x8x0.625","18x8",0.625,null,null,null,null,null,null,"Rectangular",101.85,29.9,18,8,16.125,6.125,0.625,0.625,9.8000000000000007,25.8,1170,166,129,6.24,324,93.3,81,3.29,847,159]
["HSS","HSS18x8x0.500","HSS18x8x1/2","18x8x0.500","18x8",0.5,null,null,null,null,null,null,"Rectangular",82.88,24.4,18,8,16.5,6.5,0.5,0.5,13,33,971,137,108,6.31,272,77.2,68,3.34,702,131]
["HSS","HSS18x8x0.375","HSS18x8x3/8","18x8x0.375","18x8",0.375,null,null,null,null,null,null,"Rectangular",63.21,18.600000000000001,18,8,16.875,6.8625000000000007,0.375,0.375,18.3,45,758,105,84.2,6.39,215,59.9,53.8,3.4,545,101]
["HSS","HSS18x8x0.312","HSS18x8x5/16","18x8x0.312","18x8",0.312,null,null,null,null,null,null,"Rectangular",53.11,15.6,18,8,17.058499999999999,7.0738000000000003,0.3125,0.313,22.6,54.5,645,89.3,71.7,6.42,184,50.8,46,3.43,462,85]
["HSS","HSS18x8x0.250","HSS18x8x1/4","18x8x0.250","18x8",0.25,null,null,null,null,null,null,"Rectangular",42.84,12.6,18,8,17.25,7.25,0.25,0.25,29,69,525,72.3,58.4,6.46,150,41.3,37.5,3.45,375,68.7]
["HSS","HSS18x6x0.750","HSS18x6x3/4","18x6x0.750","18x6",0.75,null,null,null,null,null,null,"Rectangular",109.91,32.299999999999997,18,6,15.75,3.75,0.75,0.75,5,21,1120,167,124,5.88,187,74.3,62.3,2.41,558,134]
["HSS","HSS18x6x0.625","HSS18x6x5/8","18x6x0.625","18x6",0.625,null,null,null,null,null,null,"Rectangular",93.34,27.4,18,6,16.125,4.125,0.625,0.625,6.6,25.8,977,144,109,5.97,166,64.599999999999994,55.3,2.46,489,116]
["HSS","HSS18x6x0.500","HSS18x6x1/2","18x6x0.500","18x6",0.5,null,null,null,null,null,null,"Rectangular",76.069999999999993,22.4,18,6,16.5,4.5,0.5,0.5,9,33,818,119,90.9,6.05,142,53.9,47.3,2.52,410,95.8]
["HSS","HSS18x6x0.375","HSS18x6x3/8","18x6x0.375","18x6",0.375,null,null,null,null,null,null,"Rectangular",58.1,17.100000000000001,18,6,16.875,4.875,0.375,0.375,13,45,641,92.2,71.3,6.13,113,42.1,37.700000000000003,2.57,322,74.2]
["HSS","HSS18x6x0.312","HSS18x6x5/16","18x6x0.312","18x6",0.312,null,null,null,null,null,null,"Rectangular",48.86,14.4,18,6,17.058499999999999,5.0705999999999998,0.3125,0.313,16.2,54.5,547,78.2,60.8,6.17,97.1,35.799999999999997,32.4,2.6,275,62.8]
["HSS","HSS18x6x0.250","HSS18x6x1/4","18x6x0.250","18x6",0.25,null,null,null,null,null,null,"Rectangular",39.43,11.6,18,6,17.25,5.25,0.25,0.25,21,69,447,63.5,49.6,6.21,80,29.2,26.7,2.63,224,51]
["HSS","HSS16x12x1","HSS16x12x1","16x12x1","16x12",1,null,null,null,null,null,null,"Rectangular",168.18,49.4,16,12,13,9,1,1,9,13,1650,258,207,5.78,1050,211,175,4.6100000000000003,2150,326]
["HSS","HSS16x12x0.875","HSS16x12x7/8","16x12x0.875","16x12",0.875,null,null,null,null,null,null,"Rectangular",149.61000000000001,44,16,12,13.387500000000001,9.3624999999999989,0.875,0.875,10.7,15.3,1500,232,188,5.85,959,190,160,4.67,1940,292]
["HSS","HSS16x12x0.750","HSS16x12x3/4","16x12x0.750","16x12",0.75,null,null,null,null,null,null,"Rectangular",130.33000000000001,38.299999999999997,16,12,13.725000000000001,9.75,0.75,0.75,13,18.3,1340,205,167,5.91,856,168,143,4.7300000000000004,1710,256]
["HSS","HSS16x12x0.625","HSS16x12x5/8","16x12x0.625","16x12",0.625,null,null,null,null,null,null,"Rectangular",110.36,32.4,16,12,14.125,10.125,0.625,0.625,16.2,22.6,1160,175,145,5.98,742,144,124,4.78,1460,218]
["HSS","HSS16x12x0.500","HSS16x12x1/2","16x12x0.500","16x12",0.5,null,null,null,null,null,null,"Rectangular",89.68,26.4,16,12,14.5,10.5,0.5,0.5,21,29,962,144,120,6.04,618,118,103,4.84,1200,178]
["HSS","HSS16x12x0.375","HSS16x12x3/8","16x12x0.375","16x12",0.375,null,null,null,null,null,null,"Rectangular",68.31,20.100000000000001,16,12,14.887500000000001,10.875,0.375,0.375,29,39.700000000000003,748,111,93.5,6.11,482,91.3,80.3,4.9000000000000004,922,136]
["HSS","HSS16x12x0.312","HSS16x12x5/16","16x12x0.312","16x12",0.312,null,null,null,null,null,null,"Rectangular",57.36,16.899999999999999,16,12,15.055300000000001,11.0489,0.3125,0.313,35.299999999999997,48.1,636,93.9,79.5,6.14,410,77.3,68.3,4.93,779,115]
["HSS","HSS16x10x0.625","HSS16x10x5/8","16x10x0.625","16x10",0.625,null,null,null,null,null,null,"Rectangular",101.85,29.9,16,10,14.125,8.125,0.625,0.625,13,22.6,1010,156,126,5.81,486,113,97.2,4.03,1070,179]
["HSS","HSS16x10x0.500","HSS16x10x1/2","16x10x0.500","16x10",0.5,null,null,null,null,null,null,"Rectangular",82.88,24.4,16,10,14.5,8.5,0.5,0.5,17,29,842,129,105,5.88,407,93.1,81.400000000000006,4.09,884,147]
["HSS","HSS16x10x0.375","HSS16x10x3/8","16x10x0.375","16x10",0.375,null,null,null,null,null,null,"Rectangular",63.21,18.600000000000001,16,10,14.887500000000001,8.8874999999999993,0.375,0.375,23.7,39.700000000000003,657,99.3,82.1,5.95,319,72,63.8,4.1399999999999997,682,113]
["HSS","HSS16x10x0.312","HSS16x10x5/16","16x10x0.312","16x10",0.312,null,null,null,null,null,null,"Rectangular",53.11,15.6,16,10,15.055300000000001,9.0457000000000001,0.3125,0.313,28.9,48.1,559,84.1,69.900000000000006,5.98,272,61,54.4,4.17,577,95]
["HSS","HSS16x10x0.250","HSS16x10x1/4","16x10x0.250","16x10",0.25,null,null,null,null,null,null,"Rectangular",42.84,12.6,16,10,15.25,9.25,0.25,0.25,37,61,455,68.099999999999994,56.9,6.01,222,49.5,44.4,4.2,468,76.7]
["HSS","HSS16x8x0.875","HSS16x8x7/8","16x8x0.875","16x8",0.875,null,null,null,null,null,null,"Rectangular",125.79,37,16,8,13.387500000000001,5.3724999999999996,0.875,0.875,6.14,15.3,1100,179,138,5.46,364,109,91,3.14,936,186]
["HSS","HSS16x8x0.750","HSS16x8x3/4","16x8x0.750","16x8",0.75,null,null,null,null,null,null,"Rectangular",109.91,32.299999999999997,16,8,13.725000000000001,5.7524999999999995,0.75,0.75,7.67,18.3,990,159,124,5.54,330,97.3,82.5,3.19,835,164]
["HSS","HSS16x8x0.625","HSS16x8x5/8","16x8x0.625","16x8",0.625,null,null,null,null,null,null,"Rectangular",93.34,27.4,16,8,14.125,6.125,0.625,0.625,9.8000000000000007,22.6,863,137,108,5.61,290,84.1,72.5,3.25,723,141]
["HSS","HSS16x8x0.500","HSS16x8x1/2","16x8x0.500","16x8",0.5,null,null,null,null,null,null,"Rectangular",76.069999999999993,22.4,16,8,{"$f":"W133*U133","v":14.5},{"$f":"V133*U133","v":6.5},0.5,0.5,13,29,722,113,90.2,5.68,244,69.7,61,3.3,599,116]
["HSS","HSS16x8x0.375","HSS16x8x3/8","16x8x0.375","16x8",0.375,null,null,null,null,null,null,"Rectangular",58.1,17.100000000000001,16,8,14.887500000000001,6.8625000000000007,0.375,0.375,18.3,39.700000000000003,565,87.6,70.599999999999994,5.75,193,54.2,48.3,3.36,465,89.2]
["HSS","HSS16x8x0.312","HSS16x8x5/16","16x8x0.312","16x8",0.312,null,null,null,null,null,null,"Rectangular",48.86,14.4,16,8,15.055300000000001,7.0738000000000003,0.3125,0.313,22.6,48.1,482,74.3,60.2,5.79,165,46,41.3,3.39,395,75.400000000000006]
["HSS","HSS16x8x0.250","HSS16x8x1/4","16x8x0.250","16x8",0.25,null,null,null,null,null,null,"Rectangular",39.43,11.6,16,8,15.25,7.25,0.25,0.25,29,61,393,60.3,49.1,5.82,135,37.4,33.799999999999997,3.42,321,61]
["HSS","HSS16x6x0.625","HSS16x6x5/8","16x6x0.625","16x6",0.625,null,null,null,null,null,null,"Rectangular",84.84,24.9,16,6,14.125,4.125,0.625,0.625,6.6,22.6,715,118,89.4,5.36,148,57.9,49.3,2.44,420,102]
["HSS","HSS16x6x0.500","HSS16x6x1/2","16x6x0.500","16x6",0.5,null,null,null,null,null,null,"Rectangular",69.27,20.399999999999999,16,6,14.5,4.5,0.5,0.5,9,29,602,97.7,75.2,5.44,126,48.4,42,2.4900000000000002,353,84.8]
["HSS","HSS16x6x0.375","HSS16x6x3/8","16x6x0.375","16x6",0.375,null,null,null,null,null,null,"Rectangular",53,15.6,16,6,14.887500000000001,4.875,0.375,0.375,13,39.700000000000003,474,75.900000000000006,59.2,5.51,101,37.9,33.700000000000003,2.5499999999999998,277,65.7]
["HSS","HSS16x6x0.312","HSS16x6x5/16","16x6x0.312","16x6",0.312,null,null,null,null,null,null,"Rectangular",44.6,13.1,16,6,15.055300000000001,5.0705999999999998,0.3125,0.313,16.2,48.1,405,64.400000000000006,50.6,5.55,87,32.299999999999997,29,2.57,237,55.7]
["HSS","HSS16x6x0.250","HSS16x6x1/4","16x6x0.250","16x6",0.25,null,null,null,null,null,null,"Rectangular",36.03,10.6,16,6,15.25,5.25,0.25,0.25,21,61,331,52.4,41.4,5.59,71.7,26.3,23.9,2.6,193,45.2]
["HSS","HSS16x6x0.188","HSS16x6x3/16","16x6x0.188","16x6",0.188,null,null,null,null,null,null,"Rectangular",27.29,8.0399999999999991,16,6,15.434799999999999,5.4331999999999994,0.1875,0.188,28.9,82.1,255,40.1,31.8,5.63,55.6,20.2,18.5,2.63,148,34.5]
["HSS","HSS16x4x0.625","HSS16x4x5/8","16x4x0.625","16x4",0.625,null,null,null,null,null,null,"Rectangular",76.33,22.4,16,4,14.125,2.125,0.625,0.625,3.4,22.6,568,98.5,70.900000000000006,5.03,56.4,34.200000000000003,28.2,1.59,182,63.9]
["HSS","HSS16x4x0.500","HSS16x4x1/2","16x4x0.500","16x4",0.5,null,null,null,null,null,null,"Rectangular",62.46,18.399999999999999,16,4,14.5,2.5,0.5,0.5,5,29,481,82.2,60.2,5.12,49.3,29,24.7,1.64,157,53.8]
["HSS","HSS16x4x0.375","HSS16x4x3/8","16x4x0.375","16x4",0.375,null,null,null,null,null,null,"Rectangular",47.9,14.1,16,4,14.887500000000001,2.8762499999999998,0.375,0.375,7.67,39.700000000000003,382,64.2,47.8,5.21,40.4,23,20.2,1.69,127,42.3]
["HSS","HSS16x4x0.312","HSS16x4x5/16","16x4x0.312","16x4",0.312,null,null,null,null,null,null,"Rectangular",40.35,11.9,16,4,15.055300000000001,3.06114,0.3125,0.313,9.7799999999999994,48.1,328,54.6,41,5.25,35.200000000000003,19.8,17.600000000000001,1.72,110,36.1]
["HSS","HSS16x4x0.250","HSS16x4x1/4","16x4x0.250","16x4",0.25,null,null,null,null,null,null,"Rectangular",32.630000000000003,9.59,16,4,15.25,3.25,0.25,0.25,13,61,269,44.5,33.6,5.3,29.3,16.2,14.7,1.75,90.6,29.5]
["HSS","HSS16x4x0.188","HSS16x4x3/16","16x4x0.188","16x4",0.188,null,null,null,null,null,null,"Rectangular",24.73,7.29,16,4,15.434799999999999,3.4404000000000003,0.1875,0.188,18.3,82.1,208,34.1,26,5.34,23,12.5,11.5,1.78,70.3,22.6]
["HSS","HSS14x12x0.625","HSS14x12x5/8","14x12x0.625","14x12",0.625,null,null,null,null,null,null,"Rectangular",101.85,29.9,14,12,12.125,10.125,0.625,0.625,16.2,19.399999999999999,840,144,120,5.3,661,130,110,4.7,1200,189]
["HSS","HSS14x12x0.500","HSS14x12x1/2","14x12x0.500","14x12",0.5,null,null,null,null,null,null,"Rectangular",82.88,24.4,14,12,12.5,10.5,0.5,0.5,21,25,699,119,99.9,5.36,552,107,92,4.76,983,155]
["HSS","HSS14x12x0.375","HSS14x12x3/8","14x12x0.375","14x12",0.375,null,null,null,null,null,null,"Rectangular",63.21,18.600000000000001,14,12,12.862499999999999,10.875,0.375,0.375,29,34.299999999999997,546,91.7,78,5.42,431,82.6,71.8,4.82,757,119]
["HSS","HSS14x12x0.312","HSS14x12x5/16","14x12x0.312","14x12",0.312,null,null,null,null,null,null,"Rectangular",53.11,15.6,14,12,13.052100000000001,11.0489,0.3125,0.313,35.299999999999997,41.7,465,77.599999999999994,66.400000000000006,5.45,367,70,61.2,4.8499999999999996,640,100]
["HSS","HSS14x12x0.250","HSS14x12x1/4","14x12x0.250","14x12",0.25,null,null,null,null,null,null,"Rectangular",42.84,12.6,14,12,13.25,11.25,0.25,0.25,45,53,378,62.9,54.1,5.48,299,56.7,49.8,4.88,518,80.7]
["HSS","HSS14x10x0.875","HSS14x10x7/8","14x10x0.875","14x10",0.875,null,null,null,null,null,null,"Rectangular",125.79,37,14,10,11.375,7.3762499999999998,0.875,0.875,8.43,13,931,167,133,5.0199999999999996,548,132,110,3.85,1160,207]
["HSS","HSS14x10x0.750","HSS14x10x3/4","14x10x0.750","14x10",0.75,null,null,null,null,null,null,"Rectangular",109.91,32.299999999999997,14,10,11.774999999999999,7.7250000000000005,0.75,0.75,10.3,15.7,835,148,119,5.09,493,117,98.6,3.91,1030,182]
["HSS","HSS14x10x0.625","HSS14x10x5/8","14x10x0.625","14x10",0.625,null,null,null,null,null,null,"Rectangular",93.34,27.4,14,10,12.125,8.125,0.625,0.625,13,19.399999999999999,728,127,104,5.15,431,101,86.2,3.96,885,156]
["HSS","HSS14x10x0.500","HSS14x10x1/2","14x10x0.500","14x10",0.5,null,null,null,null,null,null,"Rectangular",76.069999999999993,22.4,14,10,12.5,8.5,0.5,0.5,17,25,608,105,86.9,5.22,361,83.6,72.2,4.0199999999999996,730,128]
["HSS","HSS14x10x0.375","HSS14x10x3/8","14x10x0.375","14x10",0.375,null,null,null,null,null,null,"Rectangular",58.1,17.100000000000001,14,10,12.862499999999999,8.8874999999999993,0.375,0.375,23.7,34.299999999999997,476,81.5,68,5.28,284,64.8,56.8,4.08,564,98.2]
["HSS","HSS14x10x0.312","HSS14x10x5/16","14x10x0.312","14x10",0.312,null,null,null,null,null,null,"Rectangular",48.86,14.4,14,10,13.052100000000001,9.0457000000000001,0.3125,0.313,28.9,41.7,406,69.099999999999994,58,5.31,242,55,48.4,4.1100000000000003,478,82.9]
["HSS","HSS14x10x0.250","HSS14x10x1/4","14x10x0.250","14x10",0.25,null,null,null,null,null,null,"Rectangular",39.43,11.6,14,10,13.25,9.25,0.25,0.25,37,53,331,56,47.3,5.35,198,44.6,39.6,4.1399999999999997,387,67]
["HSS","HSS14x8x0.625","HSS14x8x5/8","14x8x0.625","14x8",0.625,null,null,null,null,null,null,"Rectangular",84.84,24.9,14,8,12.125,6.125,0.625,0.625,9.8000000000000007,19.399999999999999,616,111,88,4.97,256,74.900000000000006,64,3.2,601,122]
["HSS","HSS14x8x0.500","HSS14x8x1/2","14x8x0.500","14x8",0.5,null,null,null,null,null,null,"Rectangular",69.27,20.399999999999999,14,8,12.5,6.5,0.5,0.5,13,25,517,91.8,73.900000000000006,5.04,216,62.2,54,3.26,499,101]
["HSS","HSS14x8x0.375","HSS14x8x3/8","14x8x0.375","14x8",0.375,null,null,null,null,null,null,"Rectangular",53,15.6,14,8,12.862499999999999,6.8625000000000007,0.375,0.375,18.3,34.299999999999997,407,71.3,58.1,5.1100000000000003,171,48.5,42.8,3.31,388,77.7]
["HSS","HSS14x8x0.312","HSS14x8x5/16","14x8x0.312","14x8",0.312,null,null,null,null,null,null,"Rectangular",44.6,13.1,14,8,13.052100000000001,7.0738000000000003,0.3125,0.313,22.6,41.7,347,60.5,49.6,5.14,147,41.2,36.799999999999997,3.34,329,65.7]
["HSS","HSS14x8x0.250","HSS14x8x1/4","14x8x0.250","14x8",0.25,null,null,null,null,null,null,"Rectangular",36.03,10.6,14,8,13.25,7.25,0.25,0.25,29,53,284,49.2,40.5,5.18,120,33.5,30,3.37,267,53.2]
["HSS","HSS14x8x0.188","HSS14x8x3/16","14x8x0.188","14x8",0.188,null,null,null,null,null,null,"Rectangular",27.29,8.0399999999999991,14,8,13.442,7.4447999999999999,0.1875,0.188,39.6,71.5,218,37.6,31.2,5.21,92.8,25.7,23.2,3.4,204,40.5]
["HSS","HSS14x6x0.625","HSS14x6x5/8","14x6x0.625","14x6",0.625,null,null,null,null,null,null,"Rectangular",76.33,22.4,14,6,12.125,4.125,0.625,0.625,6.6,19.399999999999999,504,94,72,4.74,130,51.2,43.3,2.41,352,88.9]
["HSS","HSS14x6x0.500","HSS14x6x1/2","14x6x0.500","14x6",0.5,null,null,null,null,null,null,"Rectangular",62.46,18.399999999999999,14,6,12.5,4.5,0.5,0.5,9,25,426,78.3,60.8,4.82,111,42.9,37,2.46,296,73.8]
["HSS","HSS14x6x0.375","HSS14x6x3/8","14x6x0.375","14x6",0.375,null,null,null,null,null,null,"Rectangular",47.9,14.1,14,6,12.862499999999999,4.875,0.375,0.375,13,34.299999999999997,337,61.1,48.1,4.8899999999999997,89.1,33.6,29.7,2.52,233,57.3]
["HSS","HSS14x6x0.312","HSS14x6x5/16","14x6x0.312","14x6",0.312,null,null,null,null,null,null,"Rectangular",40.35,11.9,14,6,13.052100000000001,5.0705999999999998,0.3125,0.313,16.2,41.7,289,51.9,41.2,4.93,76.900000000000006,28.7,25.6,2.54,199,48.6]
["HSS","HSS14x6x0.250","HSS14x6x1/4","14x6x0.250","14x6",0.25,null,null,null,null,null,null,"Rectangular",32.630000000000003,9.59,14,6,13.25,5.25,0.25,0.25,21,53,237,42.3,33.799999999999997,4.97,63.4,23.4,21.1,2.57,162,39.5]
["HSS","HSS14x6x0.188","HSS14x6x3/16","14x6x0.188","14x6",0.188,null,null,null,null,null,null,"Rectangular",24.73,7.29,14,6,13.442,5.4331999999999994,0.1875,0.188,28.9,71.5,182,32.4,26.1,5,49.2,18,16.399999999999999,2.6,125,30.2]
["HSS","HSS14x4x0.625","HSS14x4x5/8","14x4x0.625","14x4",0.625,null,null,null,null,null,null,"Rectangular",67.819999999999993,19.899999999999999,14,4,12.125,2.125,0.625,0.625,3.4,19.399999999999999,392,77.3,56,4.4400000000000004,49.2,30,24.6,1.57,154,55.5]
["HSS","HSS14x4x0.500","HSS14x4x1/2","14x4x0.500","14x4",0.5,null,null,null,null,null,null,"Rectangular",55.66,16.399999999999999,14,4,12.5,2.5,0.5,0.5,5,25,335,64.8,47.8,4.5199999999999996,43.1,25.5,21.6,1.62,134,46.8]
["HSS","HSS14x4x0.375","HSS14x4x3/8","14x4x0.375","14x4",0.375,null,null,null,null,null,null,"Rectangular",42.79,12.6,14,4,12.862499999999999,2.8762499999999998,0.375,0.375,7.67,34.299999999999997,267,50.8,38.200000000000003,4.6100000000000003,35.4,20.3,17.7,1.68,108,36.799999999999997]
["HSS","HSS14x4x0.312","HSS14x4x5/16","14x4x0.312","14x4",0.312,null,null,null,null,null,null,"Rectangular",36.1,10.6,14,4,13.052100000000001,3.06114,0.3125,0.313,9.7799999999999994,41.7,230,43.4,32.799999999999997,4.6500000000000004,30.9,17.399999999999999,15.5,1.71,93.2,31.5]
["HSS","HSS14x4x0.250","HSS14x4x1/4","14x4x0.250","14x4",0.25,null,null,null,null,null,null,"Rectangular",29.23,8.59,14,4,13.25,3.25,0.25,0.25,13,53,189,35.4,27,4.6900000000000004,25.8,14.3,12.9,1.73,77,25.7]
["HSS","HSS14x4x0.188","HSS14x4x3/16","14x4x0.188","14x4",0.188,null,null,null,null,null,null,"Rectangular",22.18,6.54,14,4,13.442,3.4404000000000003,0.1875,0.188,18.3,71.5,147,27.2,20.9,4.74,20.3,11.1,10.199999999999999,1.76,59.8,19.8]
["HSS","HSS12x10x0.625","HSS12x10x5/8","12x10x0.625","12x10",0.625,null,null,null,null,null,null,"Rectangular",84.84,24.9,12,10,10.125,8.125,0.625,0.625,13,16.2,499,101,83.2,4.4800000000000004,376,89.3,75.2,3.88,703,132]
["HSS","HSS12x10x0.500","HSS12x10x1/2","12x10x0.500","12x10",0.5,null,null,null,null,null,null,"Rectangular",69.27,20.399999999999999,12,10,10.5,8.5,0.5,0.5,17,21,419,83.9,69.900000000000006,4.54,316,74.099999999999994,63.2,3.94,581,109]
["HSS","HSS12x10x0.375","HSS12x10x3/8","12x10x0.375","12x10",0.375,null,null,null,null,null,null,"Rectangular",53,15.6,12,10,10.875,8.8874999999999993,0.375,0.375,23.7,29,330,65.2,55,4.5999999999999996,249,57.6,49.8,4,450,83.7]
["HSS","HSS12x10x0.312","HSS12x10x5/16","12x10x0.312","12x10",0.312,null,null,null,null,null,null,"Rectangular",44.6,13.1,12,10,11.0489,9.0457000000000001,0.3125,0.313,28.9,35.299999999999997,282,55.3,46.9,4.63,213,48.9,42.6,4.03,381,70.8]
["HSS","HSS12x10x0.250","HSS12x10x1/4","12x10x0.250","12x10",0.25,null,null,null,null,null,null,"Rectangular",36.03,10.6,12,10,11.25,9.25,0.25,0.25,37,45,230,44.9,38.4,4.66,174,39.700000000000003,34.799999999999997,4.0599999999999996,309,57.2]
["HSS","HSS12x10x0.188","HSS12x10x3/16","12x10x0.188","12x10",0.188,null,null,null,null,null,null,"Rectangular",27.29,8.0399999999999991,12,10,11.430399999999999,9.4375999999999998,0.1875,0.188,50.2,60.8,177,34.4,29.5,4.6900000000000004,134,30.4,26.8,4.09,236,43.6]
["HSS","HSS12x8x0.625","HSS12x8x5/8","12x8x0.625","12x8",0.625,null,null,null,null,null,null,"Rectangular",76.33,22.4,12,8,10.125,6.125,0.625,0.625,9.8000000000000007,16.2,419,87.1,69.8,4.32,221,65.599999999999994,55.3,3.14,481,104]
["HSS","HSS12x8x0.500","HSS12x8x1/2","12x8x0.500","12x8",0.5,null,null,null,null,null,null,"Rectangular",62.46,18.399999999999999,12,8,10.5,6.5,0.5,0.5,13,21,353,72.400000000000006,58.9,4.3899999999999997,188,54.7,47,3.2,401,85.8]
["HSS","HSS12x8x0.375","HSS12x8x3/8","12x8x0.375","12x8",0.375,null,null,null,null,null,null,"Rectangular",47.9,14.1,12,8,10.875,6.8625000000000007,0.375,0.375,18.3,29,279,56.5,46.5,4.45,149,42.7,37.299999999999997,3.26,312,66.3]
["HSS","HSS12x8x0.312","HSS12x8x5/16","12x8x0.312","12x8",0.312,null,null,null,null,null,null,"Rectangular",40.35,11.9,12,8,11.0489,7.0738000000000003,0.3125,0.313,22.6,35.299999999999997,239,48,39.799999999999997,4.49,128,36.4,32,3.28,265,56.1]
["HSS","HSS12x8x0.250","HSS12x8x1/4","12x8x0.250","12x8",0.25,null,null,null,null,null,null,"Rectangular",32.630000000000003,9.59,12,8,11.25,7.25,0.25,0.25,29,45,196,39.1,32.6,4.5199999999999996,105,29.6,26.3,3.31,216,45.5]
["HSS","HSS12x8x0.188","HSS12x8x3/16","12x8x0.188","12x8",0.188,null,null,null,null,null,null,"Rectangular",24.73,7.29,12,8,11.430399999999999,7.4447999999999999,0.1875,0.188,39.6,60.8,151,29.9,25.2,4.55,81.3,22.7,20.3,3.34,165,34.700000000000003]
["HSS","HSS12x6x0.625","HSS12x6x5/8","12x6x0.625","12x6",0.625,null,null,null,null,null,null,"Rectangular",67.819999999999993,19.899999999999999,12,6,10.125,4.125,0.625,0.625,6.6,16.2,338,72.900000000000006,56.3,4.12,112,44.5,37.299999999999997,2.37,286,75.5]
["HSS","HSS12x6x0.500","HSS12x6x1/2","12x6x0.500","12x6",0.5,null,null,null,null,null,null,"Rectangular",55.66,16.399999999999999,12,6,10.5,4.5,0.5,0.5,9,21,287,60.9,47.8,4.1900000000000004,96,37.4,32,2.42,241,62.8]
["HSS","HSS12x6x0.375","HSS12x6x3/8","12x6x0.375","12x6",0.375,null,null,null,null,null,null,"Rectangular",42.79,12.6,12,6,10.875,4.875,0.375,0.375,13,29,228,47.7,38.1,4.26,77.3,29.4,25.8,2.48,190,48.8]
["HSS","HSS12x6x0.312","HSS12x6x5/16","12x6x0.312","12x6",0.312,null,null,null,null,null,null,"Rectangular",36.1,10.6,12,6,11.0489,5.0705999999999998,0.3125,0.313,16.2,35.299999999999997,196,40.700000000000003,32.700000000000003,4.3,66.7,25.1,22.2,2.5099999999999998,162,41.5]
["HSS","HSS12x6x0.250","HSS12x6x1/4","12x6x0.250","12x6",0.25,null,null,null,null,null,null,"Rectangular",29.23,8.59,12,6,11.25,5.25,0.25,0.25,21,45,161,33.200000000000003,26.9,4.33,55.2,20.6,18.399999999999999,2.5299999999999998,132,33.700000000000003]
["HSS","HSS12x6x0.188","HSS12x6x3/16","12x6x0.188","12x6",0.188,null,null,null,null,null,null,"Rectangular",22.18,6.54,12,6,11.430399999999999,5.4331999999999994,0.1875,0.188,28.9,60.8,125,25.5,20.8,4.37,42.9,15.8,14.3,2.56,102,25.8]
["HSS","HSS12x4x0.625","HSS12x4x5/8","12x4x0.625","12x4",0.625,null,null,null,null,null,null,"Rectangular",59.32,17.399999999999999,12,4,{"$f":"W197*U197","v":10.125},{"$f":"V197*U197","v":2.125},0.625,0.625,3.4,16.2,257,58.6,42.8,3.84,42,25.8,21,1.55,127,47]
["HSS","HSS12x4x0.500","HSS12x4x1/2","12x4x0.500","12x4",0.5,null,null,null,null,null,null,"Rectangular",48.85,14.4,12,4,10.5,2.5,0.5,0.5,5,21,221,49.4,36.799999999999997,3.92,37,22,18.5,1.6,110,39.799999999999997]
["HSS","HSS12x4x0.375","HSS12x4x3/8","12x4x0.375","12x4",0.375,null,null,null,null,null,null,"Rectangular",37.69,11.1,12,4,10.875,2.8762499999999998,0.375,0.375,7.67,29,178,39,29.6,4.01,30.5,17.600000000000001,15.3,1.66,89,31.4]
["HSS","HSS12x4x0.312","HSS12x4x5/16","12x4x0.312","12x4",0.312,null,null,null,null,null,null,"Rectangular",31.84,9.3699999999999992,12,4,11.0489,3.06114,0.3125,0.313,9.7799999999999994,35.299999999999997,153,33.4,25.6,4.05,26.7,15.1,13.4,1.69,77,26.9]
["HSS","HSS12x4x0.250","HSS12x4x1/4","12x4x0.250","12x4",0.25,null,null,null,null,null,null,"Rectangular",25.82,7.59,12,4,11.25,3.25,0.25,0.25,13,45,127,27.3,21.1,4.09,22.3,12.5,11.2,1.71,63.6,22]
["HSS","HSS12x4x0.188","HSS12x4x3/16","12x4x0.188","12x4",0.188,null,null,null,null,null,null,"Rectangular",19.63,5.78,12,4,11.430399999999999,3.4404000000000003,0.1875,0.188,18.3,60.8,98.4,21,16.399999999999999,4.13,17.5,9.66,8.75,1.74,49.4,16.899999999999999]
["HSS","HSS12x3x0.312","HSS12x3x5/16","12x3x0.312","12x3",0.312,null,null,null,null,null,null,"Rectangular",29.72,8.75,12,3,11.0489,2.0595400000000001,0.3125,0.313,6.58,35.299999999999997,132,29.7,22,3.89,13.8,10.6,9.1999999999999993,1.26,43.7,19.5]
["HSS","HSS12x3x0.250","HSS12x3x1/4","12x3x0.250","12x3",0.25,null,null,null,null,null,null,"Rectangular",24.12,7.09,12,3,11.25,2.25,0.25,0.25,9,45,109,24.4,18.2,3.93,11.7,8.8000000000000007,7.8,1.28,36.5,16.100000000000001]
["HSS","HSS12x3x0.188","HSS12x3x3/16","12x3x0.188","12x3",0.188,null,null,null,null,null,null,"Rectangular",18.350000000000001,5.41,12,3,11.430399999999999,2.444,0.1875,0.188,13,60.8,85.3,18.8,14.2,3.97,9.3000000000000007,6.86,6.2,1.31,28.7,12.5]
["HSS","HSS12x2x0.312","HSS12x2x5/16","12x2x0.312","12x2",0.312,null,null,null,null,null,null,"Rectangular",27.59,8.1199999999999992,12,2,11.0489,1.06107,0.3125,0.313,3.39,35.299999999999997,111,26.1,18.399999999999999,3.69,5.33,6.39,5.33,0.81,18.399999999999999,12.2]
["HSS","HSS12x2x0.250","HSS12x2x1/4","12x2x0.250","12x2",0.25,null,null,null,null,null,null,"Rectangular",22.42,6.59,12,2,11.25,1.25,0.25,0.25,5,45,92.2,21.4,15.4,3.74,4.62,5.38,4.62,0.83799999999999997,15.9,10.199999999999999]
["HSS","HSS12x2x0.188","HSS12x2x3/16","12x2x0.188","12x2",0.188,null,null,null,null,null,null,"Rectangular",17.079999999999998,5.03,12,2,11.430399999999999,1.43632,0.1875,0.188,7.64,60.8,72.2,16.600000000000001,12,3.79,3.77,4.25,3.77,0.86499999999999999,12.8,8.02]
["HSS","HSS10x8x0.625","HSS10x8x5/8","10x8x0.625","10x8",0.625,null,null,null,null,null,null,"Rectangular",67.819999999999993,19.899999999999999,10,8,8.125,6.125,0.625,0.625,9.8000000000000007,13,266,65.900000000000006,53.2,3.65,187,56.4,46.8,3.07,367,85.5]
["HSS","HSS10x8x0.500","HSS10x8x1/2","10x8x0.500","10x8",0.5,null,null,null,null,null,null,"Rectangular",55.66,16.399999999999999,10,8,8.5,6.5,0.5,0.5,13,17,226,55.1,45.2,3.72,160,47.2,40,3.12,306,70.8]
["HSS","HSS10x8x0.375","HSS10x8x3/8","10x8x0.375","10x8",0.375,null,null,null,null,null,null,"Rectangular",42.79,12.6,10,8,8.8874999999999993,6.8625000000000007,0.375,0.375,18.3,23.7,180,43.1,35.9,3.78,127,37,31.8,3.18,239,54.8]
["HSS","HSS10x8x0.312","HSS10x8x5/16","10x8x0.312","10x8",0.312,null,null,null,null,null,null,"Rectangular",36.1,10.6,10,8,9.0457000000000001,7.0738000000000003,0.3125,0.313,22.6,28.9,154,36.799999999999997,30.9,3.81,110,31.6,27.5,3.21,203,46.5]
["HSS","HSS10x8x0.250","HSS10x8x1/4","10x8x0.250","10x8",0.25,null,null,null,null,null,null,"Rectangular",29.23,8.59,10,8,9.25,7.25,0.25,0.25,29,37,127,30,25.4,3.84,90.2,25.8,22.6,3.24,166,37.700000000000003]
["HSS","HSS10x8x0.188","HSS10x8x3/16","10x8x0.188","10x8",0.188,null,null,null,null,null,null,"Rectangular",22.18,6.54,10,8,9.4375999999999998,7.4447999999999999,0.1875,0.188,39.6,50.2,98.1,23,19.600000000000001,3.87,69.8,19.8,17.5,3.27,127,28.8]
["HSS","HSS10x6x0.625","HSS10x6x5/8","10x6x0.625","10x6",0.625,null,null,null,null,null,null,"Rectangular",59.32,17.399999999999999,10,6,8.125,4.125,0.625,0.625,6.6,13,211,54.2,42.2,3.48,93.6,37.700000000000003,31.2,2.3199999999999998,221,62]
["HSS","HSS10x6x0.500","HSS10x6x1/2","10x6x0.500","10x6",0.5,null,null,null,null,null,null,"Rectangular",48.85,14.4,10,6,8.5,4.5,0.5,0.5,9,17,181,45.6,36.200000000000003,3.55,80.900000000000006,31.9,27,2.37,187,51.8]
["HSS","HSS10x6x0.375","HSS10x6x3/8","10x6x0.375","10x6",0.375,null,null,null,null,null,null,"Rectangular",37.69,11.1,10,6,8.8874999999999993,4.875,0.375,0.375,13,23.7,145,35.9,29,3.62,65.400000000000006,25.2,21.8,2.4300000000000002,147,40.4]
["HSS","HSS10x6x0.312","HSS10x6x5/16","10x6x0.312","10x6",0.312,null,null,null,null,null,null,"Rectangular",31.84,9.3699999999999992,10,6,9.0457000000000001,5.0705999999999998,0.3125,0.313,16.2,28.9,125,30.7,25,3.65,56.6,21.6,18.899999999999999,2.46,126,34.4]
["HSS","HSS10x6x0.250","HSS10x6x1/4","10x6x0.250","10x6",0.25,null,null,null,null,null,null,"Rectangular",25.82,7.59,10,6,9.25,5.25,0.25,0.25,21,37,103,25.1,20.6,3.69,46.9,17.7,15.6,2.4900000000000002,103,28]
["HSS","HSS10x6x0.188","HSS10x6x3/16","10x6x0.188","10x6",0.188,null,null,null,null,null,null,"Rectangular",19.63,5.78,10,6,9.4375999999999998,5.4331999999999994,0.1875,0.188,28.9,50.2,80,19.3,16,3.72,36.5,13.6,12.2,2.5099999999999998,79.3,21.4]
["HSS","HSS10x5x0.375","HSS10x5x3/8","10x5x0.375","10x5",0.375,null,null,null,null,null,null,"Rectangular",35.130000000000003,10.3,10,5,8.8874999999999993,3.8625000000000003,0.375,0.375,10.3,23.7,128,32.299999999999997,25.5,3.52,42.9,19.899999999999999,17.2,2.04,107,33.200000000000003]
["HSS","HSS10x5x0.312","HSS10x5x5/16","10x5x0.312","10x5",0.312,null,null,null,null,null,null,"Rectangular",29.72,8.75,10,5,9.0457000000000001,4.069,0.3125,0.313,13,28.9,110,27.7,22.1,3.55,37.299999999999997,17,14.9,2.0699999999999998,91.6,28.3]
["HSS","HSS10x5x0.250","HSS10x5x1/4","10x5x0.250","10x5",0.25,null,null,null,null,null,null,"Rectangular",24.12,7.09,10,5,9.25,4.25,0.25,0.25,17,37,91.2,22.7,18.2,3.59,31.1,14,12.4,2.09,75.2,23.1]
["HSS","HSS10x4x0.625","HSS10x4x5/8","10x4x0.625","10x4",0.625,null,null,null,null,null,null,"Rectangular",50.81,14.9,10,4,8.125,2.125,0.625,0.625,3.4,13,156,42.5,31.2,3.23,34.799999999999997,21.6,17.399999999999999,1.53,99.8,38.6]
["HSS","HSS10x4x0.500","HSS10x4x1/2","10x4x0.500","10x4",0.5,null,null,null,null,null,null,"Rectangular",42.05,12.4,10,4,8.5,2.5,0.5,0.5,5,17,136,36.1,27.1,3.31,30.8,18.5,15.4,1.58,86.9,32.799999999999997]
["HSS","HSS10x4x0.375","HSS10x4x3/8","10x4x0.375","10x4",0.375,null,null,null,null,null,null,"Rectangular",32.58,9.58,10,4,8.8874999999999993,2.8762499999999998,0.375,0.375,7.67,23.7,110,28.7,22,3.39,25.5,14.9,12.8,1.63,70.400000000000006,26]
["HSS","HSS10x4x0.312","HSS10x4x5/16","10x4x0.312","10x4",0.312,null,null,null,null,null,null,"Rectangular",27.59,8.1199999999999992,10,4,9.0457000000000001,3.06114,0.3125,0.313,9.7799999999999994,28.9,95.6,24.6,19.100000000000001,3.43,22.4,12.8,11.2,1.66,60.9,22.2]
["HSS","HSS10x4x0.250","HSS10x4x1/4","10x4x0.250","10x4",0.25,null,null,null,null,null,null,"Rectangular",22.42,6.59,10,4,9.25,3.25,0.25,0.25,13,37,79.3,20.2,15.9,3.47,18.8,10.6,9.4,1.69,50.4,18.2]
["HSS","HSS10x4x0.188","HSS10x4x3/16","10x4x0.188","10x4",0.188,null,null,null,null,null,null,"Rectangular",17.079999999999998,5.03,10,4,9.4375999999999998,3.4404000000000003,0.1875,0.188,18.3,50.2,61.9,15.6,12.4,3.51,14.8,8.2200000000000006,7.4,1.72,39.200000000000003,14]
["HSS","HSS10x3.5x0.375","HSS10x3.5x3/8","10x3.5x0.375","10x3.5",0.375,null,null,null,null,null,null,"Rectangular",31.31,9.1999999999999993,10,3.5,8.8874999999999993,2.3737500000000002,0.375,0.375,6.33,23.7,102,26.9,20.3,3.32,18.7,12.5,10.7,1.43,54.3,22.4]
["HSS","HSS10x3.5x0.312","HSS10x3.5x5/16","10x3.5x0.312","10x3.5",0.312,null,null,null,null,null,null,"Rectangular",26.53,7.81,10,3.5,9.0457000000000001,2.5603400000000001,0.3125,0.313,8.18,28.9,88.2,23.1,17.600000000000001,3.36,16.5,10.8,9.43,1.45,47.3,19.2]
["HSS","HSS10x3.5x0.250","HSS10x3.5x1/4","10x3.5x0.250","10x3.5",0.25,null,null,null,null,null,null,"Rectangular",21.57,6.34,10,3.5,9.25,2.75,0.25,0.25,11,37,73.400000000000006,19,14.7,3.4,13.9,8.98,7.94,1.48,39.299999999999997,15.8]
["HSS","HSS10x3.5x0.188","HSS10x3.5x3/16","10x3.5x0.188","10x3.5",0.188,null,null,null,null,null,null,"Rectangular",16.440000000000001,4.84,10,3.5,9.4375999999999998,2.9327999999999999,0.1875,0.188,15.6,50.2,57.4,14.7,11.5,3.44,11,6.99,6.29,1.51,30.7,12.2]
["HSS","HSS10x3x0.375","HSS10x3x3/8","10x3x0.375","10x3",0.375,null,null,null,null,null,null,"Rectangular",30.03,8.83,10,3,8.8874999999999993,1.875,0.375,0.375,5,23.7,92.8,25.1,18.600000000000001,3.24,13,10.3,8.67,1.21,39.799999999999997,18.7]
["HSS","HSS10x3x0.312","HSS10x3x5/16","10x3x0.312","10x3",0.312,null,null,null,null,null,null,"Rectangular",25.46,7.49,10,3,9.0457000000000001,2.0595400000000001,0.3125,0.313,6.58,28.9,80.900000000000006,21.6,16.2,3.29,11.5,8.93,7.67,1.24,34.9,16.2]
["HSS","HSS10x3x0.250","HSS10x3x1/4","10x3x0.250","10x3",0.25,null,null,null,null,null,null,"Rectangular",20.72,6.09,10,3,9.25,2.25,0.25,0.25,9,37,67.400000000000006,17.8,13.5,3.33,9.7899999999999991,7.42,6.53,1.27,29.3,13.3]
["HSS","HSS10x3x0.188","HSS10x3x3/16","10x3x0.188","10x3",0.188,null,null,null,null,null,null,"Rectangular",15.8,4.66,10,3,9.4375999999999998,2.444,0.1875,0.188,13,50.2,52.8,13.8,10.6,3.37,7.82,5.8,5.21,1.3,23,10.3]
["HSS","HSS10x2x0.375","HSS10x2x3/8","10x2x0.375","10x2",0.375,null,null,null,null,null,null,"Rectangular",27.48,8.08,10,2,8.8874999999999993,0.87375000000000003,0.375,0.375,2.33,23.7,75.400000000000006,21.5,15.1,3.06,4.87,6.05,4.87,0.77600000000000002,16.5,11.5]
["HSS","HSS10x2x0.312","HSS10x2x5/16","10x2x0.312","10x2",0.312,null,null,null,null,null,null,"Rectangular",23.34,6.87,10,2,9.0457000000000001,1.06107,0.3125,0.313,3.39,28.9,66.2,18.600000000000001,13.2,3.1,4.43,5.34,4.43,0.80300000000000005,14.9,10.1]
["HSS","HSS10x2x0.250","HSS10x2x1/4","10x2x0.250","10x2",0.25,null,null,null,null,null,null,"Rectangular",19.02,5.59,10,2,9.25,1.25,0.25,0.25,5,37,55.6,15.4,11.1,3.15,3.85,4.5,3.85,0.83,12.8,8.4700000000000006]
["HSS","HSS10x2x0.188","HSS10x2x3/16","10x2x0.188","10x2",0.188,null,null,null,null,null,null,"Rectangular",14.53,4.28,10,2,9.4375999999999998,1.43632,0.1875,0.188,7.64,50.2,43.8,11.9,8.76,3.2,3.15,3.57,3.15,0.85799999999999998,10.4,6.66]
["HSS","HSS9x7x0.625","HSS9x7x5/8","9x7x0.625","9x7",0.625,null,null,null,null,null,null,"Rectangular",59.32,17.399999999999999,9,7,7.125,5.125,0.625,0.625,8.1999999999999993,11.4,183,51,40.700000000000003,3.24,123,42.8,35.1,2.66,248,65.8]
["HSS","HSS9x7x0.500","HSS9x7x1/2","9x7x0.500","9x7",0.5,null,null,null,null,null,null,"Rectangular",48.85,14.4,9,7,7.5,5.5,0.5,0.5,11,15,157,42.9,34.799999999999997,3.31,106,36.1,30.3,2.72,209,54.8]
["HSS","HSS9x7x0.375","HSS9x7x3/8","9x7x0.375","9x7",0.375,null,null,null,null,null,null,"Rectangular",37.69,11.1,9,7,7.875,5.8874999999999993,0.375,0.375,15.7,21,126,33.799999999999997,27.9,3.37,85.2,28.4,24.3,2.77,164,42.7]
["HSS","HSS9x7x0.312","HSS9x7x5/16","9x7x0.312","9x7",0.312,null,null,null,null,null,null,"Rectangular",31.84,9.3699999999999992,9,7,8.0754000000000001,6.0721999999999996,0.3125,0.313,19.399999999999999,25.8,108,28.9,24.1,3.4,73.599999999999994,24.3,21,2.8,140,36.200000000000003]
["HSS","HSS9x7x0.250","HSS9x7x1/4","9x7x0.250","9x7",0.25,null,null,null,null,null,null,"Rectangular",25.82,7.59,9,7,8.25,6.25,0.25,0.25,25,33,89.4,23.6,19.899999999999999,3.43,60.8,19.899999999999999,17.399999999999999,2.83,114,29.5]
["HSS","HSS9x7x0.188","HSS9x7x3/16","9x7x0.188","9x7",0.188,null,null,null,null,null,null,"Rectangular",19.63,5.78,9,7,8.4412000000000003,6.4296000000000006,0.1875,0.188,34.200000000000003,44.9,69.400000000000006,18.2,15.4,3.46,47.3,15.3,13.5,2.86,87.9,22.5]
["HSS","HSS9x5x0.625","HSS9x5x5/8","9x5x0.625","9x5",0.625,null,null,null,null,null,null,"Rectangular",50.81,14.9,9,5,7.125,3.125,0.625,0.625,5,11.4,139,40.5,30.9,3.05,54.1,26.6,21.6,1.9,135,44.9]
["HSS","HSS9x5x0.500","HSS9x5x1/2","9x5x0.500","9x5",0.5,null,null,null,null,null,null,"Rectangular",42.05,12.4,9,5,7.5,3.5,0.5,0.5,7,15,121,34.4,26.8,3.12,47.4,22.7,19,1.96,115,37.799999999999997]
["HSS","HSS9x5x0.375","HSS9x5x3/8","9x5x0.375","9x5",0.375,null,null,null,null,null,null,"Rectangular",32.58,9.58,9,5,7.875,3.8625000000000003,0.375,0.375,10.3,21,97.8,27.3,21.7,3.2,38.9,18.100000000000001,15.6,2.0099999999999998,92.2,29.7]
["HSS","HSS9x5x0.312","HSS9x5x5/16","9x5x0.312","9x5",0.312,null,null,null,null,null,null,"Rectangular",27.59,8.1199999999999992,9,5,8.0754000000000001,4.069,0.3125,0.313,13,25.8,84.7,23.4,18.8,3.23,33.9,15.6,13.6,2.04,79.3,25.4]
["HSS","HSS9x5x0.250","HSS9x5x1/4","9x5x0.250","9x5",0.25,null,null,null,null,null,null,"Rectangular",22.42,6.59,9,5,8.25,4.25,0.25,0.25,17,33,70.3,19.3,15.6,3.27,28.2,12.8,11.3,2.0699999999999998,65.2,20.7]
["HSS","HSS9x5x0.188","HSS9x5x3/16","9x5x0.188","9x5",0.188,null,null,null,null,null,null,"Rectangular",17.079999999999998,5.03,9,5,8.4412000000000003,4.4367999999999999,0.1875,0.188,23.6,44.9,54.8,14.9,12.2,3.3,22.1,9.93,8.84,2.1,50.4,15.9]
["HSS","HSS9x3x0.500","HSS9x3x1/2","9x3x0.500","9x3",0.5,null,null,null,null,null,null,"Rectangular",35.24,10.4,9,3,7.5,1.5,0.5,0.5,3,15,84.5,25.9,18.8,2.86,13.7,11.3,9.1300000000000008,1.1499999999999999,41.6,20.8]
["HSS","HSS9x3x0.375","HSS9x3x3/8","9x3x0.375","9x3",0.375,null,null,null,null,null,null,"Rectangular",27.48,8.08,9,3,7.875,1.875,0.375,0.375,5,21,69.900000000000006,20.9,15.5,2.94,11.7,9.2899999999999991,7.8,1.2,34.9,16.8]
["HSS","HSS9x3x0.312","HSS9x3x5/16","9x3x0.312","9x3",0.312,null,null,null,null,null,null,"Rectangular",23.34,6.87,9,3,8.0754000000000001,2.0595400000000001,0.3125,0.313,6.58,25.8,61.1,18,13.6,2.98,10.4,8.09,6.93,1.23,30.6,14.5]
["HSS","HSS9x3x0.250","HSS9x3x1/4","9x3x0.250","9x3",0.25,null,null,null,null,null,null,"Rectangular",19.02,5.59,9,3,8.25,2.25,0.25,0.25,9,33,51.1,14.9,11.4,3.02,8.85,6.73,5.9,1.26,25.6,12]
["HSS","HSS9x3x0.188","HSS9x3x3/16","9x3x0.188","9x3",0.188,null,null,null,null,null,null,"Rectangular",14.53,4.28,9,3,8.4412000000000003,2.444,0.1875,0.188,13,44.9,40.200000000000003,11.6,8.93,3.06,7.07,5.27,4.71,1.29,20.2,9.2899999999999991]
["HSS","HSS8x6x0.625","HSS8x6x5/8","8x6x0.625","8x6",0.625,null,null,null,null,null,null,"Rectangular",50.81,14.9,8,6,6.125,4.125,0.625,0.625,6.6,9.8000000000000007,119,38,29.8,2.83,75.5,31,25.2,2.25,158,48.6]
["HSS","HSS8x6x0.500","HSS8x6x1/2","8x6x0.500","8x6",0.5,null,null,null,null,null,null,"Rectangular",42.05,12.4,8,6,6.5,4.5,0.5,0.5,9,13,103,32.200000000000003,25.8,2.89,65.7,26.4,21.9,2.31,135,40.799999999999997]
["HSS","HSS8x6x0.375","HSS8x6x3/8","8x6x0.375","8x6",0.375,null,null,null,null,null,null,"Rectangular",32.58,9.58,8,6,{"$f":"W261*U261","v":6.8625000000000007},{"$f":"V261*U261","v":4.875},0.375,0.375,13,18.3,83.7,25.6,20.9,2.96,53.5,21,17.8,2.36,107,32]
["HSS","HSS8x6x0.312","HSS8x6x5/16","8x6x0.312","8x6",0.312,null,null,null,null,null,null,"Rectangular",27.59,8.1199999999999992,8,6,7.0738000000000003,5.0705999999999998,0.3125,0.313,16.2,22.6,72.5,22,18.100000000000001,2.99,46.5,18,15.5,2.39,91.4,27.2]
["HSS","HSS8x6x0.250","HSS8x6x1/4","8x6x0.250","8x6",0.25,null,null,null,null,null,null,"Rectangular",22.42,6.59,8,6,7.25,5.25,0.25,0.25,21,29,60.1,18,15,3.02,38.6,14.8,12.9,2.42,74.900000000000006,22.2]
["HSS","HSS8x6x0.188","HSS8x6x3/16","8x6x0.188","8x6",0.188,null,null,null,null,null,null,"Rectangular",17.079999999999998,5.03,8,6,7.4447999999999999,5.4331999999999994,0.1875,0.188,28.9,39.6,46.9,13.9,11.7,3.05,30.2,11.4,10.1,2.4500000000000002,57.7,17]
["HSS","HSS8x4x0.625","HSS8x4x5/8","8x4x0.625","8x4",0.625,null,null,null,null,null,null,"Rectangular",42.3,12.4,8,4,6.125,2.125,0.625,0.625,3.4,9.8000000000000007,85.2,28.8,21.3,2.62,27.6,17.3,13.8,1.49,73.2,30.2]
["HSS","HSS8x4x0.500","HSS8x4x1/2","8x4x0.500","8x4",0.5,null,null,null,null,null,null,"Rectangular",35.24,10.4,8,4,6.5,2.5,0.5,0.5,5,13,75.2,24.7,18.8,2.69,24.6,15,12.3,1.54,64.099999999999994,25.8]
["HSS","HSS8x4x0.375","HSS8x4x3/8","8x4x0.375","8x4",0.375,null,null,null,null,null,null,"Rectangular",27.48,8.08,8,4,6.8625000000000007,2.8762499999999998,0.375,0.375,7.67,18.3,61.9,19.899999999999999,15.5,2.77,20.6,12.2,10.3,1.6,52.2,20.5]
["HSS","HSS8x4x0.312","HSS8x4x5/16","8x4x0.312","8x4",0.312,null,null,null,null,null,null,"Rectangular",23.34,6.87,8,4,7.0738000000000003,3.06114,0.3125,0.313,9.7799999999999994,22.6,54,17.100000000000001,13.5,2.8,18.100000000000001,10.5,9.0500000000000007,1.62,45.2,17.600000000000001]
["HSS","HSS8x4x0.250","HSS8x4x1/4","8x4x0.250","8x4",0.25,null,null,null,null,null,null,"Rectangular",19.02,5.59,8,4,7.25,3.25,0.25,0.25,13,29,45.1,14.1,11.3,2.84,15.3,8.7200000000000006,7.65,1.65,37.5,14.5]
["HSS","HSS8x4x0.188","HSS8x4x3/16","8x4x0.188","8x4",0.188,null,null,null,null,null,null,"Rectangular",14.53,4.28,8,4,7.4447999999999999,3.4404000000000003,0.1875,0.188,18.3,39.6,35.4,11,8.85,2.88,12.1,6.79,6.05,1.68,29.2,11.2]
["HSS","HSS8x3x0.500","HSS8x3x1/2","8x3x0.500","8x3",0.5,null,null,null,null,null,null,"Rectangular",31.84,9.36,8,3,6.5,1.5,0.5,0.5,3,13,61.1,21,15.3,2.5499999999999998,12.1,10.1,8.07,1.1399999999999999,35.700000000000003,18.3]
["HSS","HSS8x3x0.375","HSS8x3x3/8","8x3x0.375","8x3",0.375,null,null,null,null,null,null,"Rectangular",24.93,7.33,8,3,6.8625000000000007,1.875,0.375,0.375,5,18.3,51,17,12.7,2.64,10.4,8.31,6.93,1.19,29.9,14.8]
["HSS","HSS8x3x0.312","HSS8x3x5/16","8x3x0.312","8x3",0.312,null,null,null,null,null,null,"Rectangular",21.21,6.24,8,3,7.0738000000000003,2.0595400000000001,0.3125,0.313,6.58,22.6,44.8,14.7,11.2,2.68,9.26,7.25,6.17,1.22,26.3,12.8]
["HSS","HSS8x3x0.250","HSS8x3x1/4","8x3x0.250","8x3",0.25,null,null,null,null,null,null,"Rectangular",17.32,5.09,8,3,7.25,2.25,0.25,0.25,9,29,37.6,12.2,9.4,2.72,7.9,6.05,5.27,1.25,22.1,10.6]
["HSS","HSS8x3x0.188","HSS8x3x3/16","8x3x0.188","8x3",0.188,null,null,null,null,null,null,"Rectangular",13.25,3.9,8,3,7.4447999999999999,2.444,0.1875,0.188,13,39.6,29.7,9.51,7.42,2.76,6.33,4.74,4.22,1.27,17.399999999999999,8.23]
["HSS","HSS8x2x0.500","HSS8x2x1/2","8x2x0.500","8x2",0.5,null,null,null,null,null,null,"Rectangular",28.43,8.36,8,2,6.5,0.5,0.5,0.5,1,13,47,17.2,11.7,2.37,4.28,5.67,4.28,0.71599999999999997,13.9,10.8]
["HSS","HSS8x2x0.375","HSS8x2x3/8","8x2x0.375","8x2",0.375,null,null,null,null,null,null,"Rectangular",22.37,6.58,8,2,6.8625000000000007,0.87375000000000003,0.375,0.375,2.33,18.3,40.1,14.2,10,2.4700000000000002,3.86,4.83,3.86,0.76600000000000001,12.6,9.09]
["HSS","HSS8x2x0.312","HSS8x2x5/16","8x2x0.312","8x2",0.312,null,null,null,null,null,null,"Rectangular",19.079999999999998,5.62,8,2,7.0738000000000003,1.06107,0.3125,0.313,3.39,22.6,35.5,12.3,8.8800000000000008,2.5099999999999998,3.53,4.28,3.53,0.79200000000000004,11.4,8]
["HSS","HSS8x2x0.250","HSS8x2x1/4","8x2x0.250","8x2",0.25,null,null,null,null,null,null,"Rectangular",15.62,4.59,8,2,7.25,1.25,0.25,0.25,5,29,30.1,10.3,7.52,2.56,3.08,3.63,3.08,0.81899999999999995,9.84,6.72]
["HSS","HSS8x2x0.188","HSS8x2x3/16","8x2x0.188","8x2",0.188,null,null,null,null,null,null,"Rectangular",11.97,3.53,8,2,7.4447999999999999,1.43632,0.1875,0.188,7.64,39.6,23.9,8.0399999999999991,5.98,2.6,2.5299999999999998,2.89,2.5299999999999998,0.84699999999999998,7.95,5.3]
["HSS","HSS7x5x0.500","HSS7x5x1/2","7x5x0.500","7x5",0.5,null,null,null,null,null,null,"Rectangular",35.24,10.4,7,5,5.5,3.5,0.5,0.5,7,11,63.5,23.1,18.100000000000001,2.48,37.299999999999997,18.2,14.9,1.9,79.900000000000006,28.8]
["HSS","HSS7x5x0.375","HSS7x5x3/8","7x5x0.375","7x5",0.375,null,null,null,null,null,null,"Rectangular",27.48,8.08,7,5,5.8874999999999993,3.8625000000000003,0.375,0.375,10.3,15.7,52.2,18.5,14.9,2.54,30.8,14.6,12.3,1.95,64.2,22.8]
["HSS","HSS7x5x0.312","HSS7x5x5/16","7x5x0.312","7x5",0.312,null,null,null,null,null,null,"Rectangular",23.34,6.87,7,5,6.0721999999999996,4.069,0.3125,0.313,13,19.399999999999999,45.5,16,13,2.58,27,12.6,10.8,1.98,55.4,19.5]
["HSS","HSS7x5x0.250","HSS7x5x1/4","7x5x0.250","7x5",0.25,null,null,null,null,null,null,"Rectangular",19.02,5.59,7,5,6.25,4.25,0.25,0.25,17,25,38,13.2,10.9,2.61,22.6,10.4,9.0399999999999991,2.0099999999999998,45.6,16]
["HSS","HSS7x5x0.188","HSS7x5x3/16","7x5x0.188","7x5",0.188,null,null,null,null,null,null,"Rectangular",14.53,4.28,7,5,6.4296000000000006,4.4367999999999999,0.1875,0.188,23.6,34.200000000000003,29.8,10.199999999999999,8.52,2.64,17.8,8.1199999999999992,7.12,2.04,35.299999999999997,12.3]
["HSS","HSS7x4x0.500","HSS7x4x1/2","7x4x0.500","7x4",0.5,null,null,null,null,null,null,"Rectangular",31.84,9.36,7,4,5.5,2.5,0.5,0.5,5,11,52.9,19.8,15.1,2.38,21.6,13.3,10.8,1.52,53,22.3]
["HSS","HSS7x4x0.375","HSS7x4x3/8","7x4x0.375","7x4",0.375,null,null,null,null,null,null,"Rectangular",24.93,7.33,7,4,5.8874999999999993,2.8762499999999998,0.375,0.375,7.67,15.7,44,16,12.6,2.4500000000000002,18.100000000000001,10.8,9.0500000000000007,1.57,43.3,17.8]
["HSS","HSS7x4x0.312","HSS7x4x5/16","7x4x0.312","7x4",0.312,null,null,null,null,null,null,"Rectangular",21.21,6.24,7,4,6.0721999999999996,3.06114,0.3125,0.313,9.7799999999999994,19.399999999999999,38.5,13.9,11,2.48,16,9.3699999999999992,8,1.6,37.6,15.3]
["HSS","HSS7x4x0.250","HSS7x4x1/4","7x4x0.250","7x4",0.25,null,null,null,null,null,null,"Rectangular",17.32,5.09,7,4,6.25,3.25,0.25,0.25,13,25,32.299999999999997,11.5,9.23,2.52,13.5,7.78,6.75,1.63,31.2,12.6]
["HSS","HSS7x4x0.188","HSS7x4x3/16","7x4x0.188","7x4",0.188,null,null,null,null,null,null,"Rectangular",13.25,3.9,7,4,6.4296000000000006,3.4404000000000003,0.1875,0.188,18.3,34.200000000000003,25.5,8.93,7.28,2.5499999999999998,10.7,6.07,5.35,1.66,24.3,9.74]
["HSS","HSS7x3x0.500","HSS7x3x1/2","7x3x0.500","7x3",0.5,null,null,null,null,null,null,"Rectangular",28.43,8.36,7,3,5.5,1.5,0.5,0.5,3,11,42.3,16.600000000000001,12.1,2.25,10.5,8.84,7,1.1200000000000001,29.8,15.8]
["HSS","HSS7x3x0.375","HSS7x3x3/8","7x3x0.375","7x3",0.375,null,null,null,null,null,null,"Rectangular",22.37,6.58,7,3,5.8874999999999993,1.875,0.375,0.375,5,15.7,35.700000000000003,13.5,10.199999999999999,2.33,9.1,7.32,6.07,1.18,25.1,12.8]
["HSS","HSS7x3x0.312","HSS7x3x5/16","7x3x0.312","7x3",0.312,null,null,null,null,null,null,"Rectangular",19.079999999999998,5.62,7,3,6.0721999999999996,2.0595400000000001,0.3125,0.313,6.58,19.399999999999999,31.5,11.8,9.01,2.37,8.1300000000000008,6.41,5.42,1.2,22.1,11.1]
["HSS","HSS7x3x0.250","HSS7x3x1/4","7x3x0.250","7x3",0.25,null,null,null,null,null,null,"Rectangular",15.62,4.59,7,3,6.25,2.25,0.25,0.25,9,25,26.6,9.7899999999999991,7.61,2.41,6.95,5.36,4.63,1.23,18.5,9.2200000000000006]
["HSS","HSS7x3x0.188","HSS7x3x3/16","7x3x0.188","7x3",0.188,null,null,null,null,null,null,"Rectangular",11.97,3.53,7,3,6.4296000000000006,2.444,0.1875,0.188,13,34.200000000000003,21.1,7.65,6.03,2.4500000000000002,5.58,4.21,3.72,1.26,14.6,7.18]
["HSS","HSS7x2x0.250","HSS7x2x1/4","7x2x0.250","7x2",0.25,null,null,null,null,null,null,"Rectangular",13.91,4.09,7,2,6.25,1.25,0.25,0.25,5,25,20.9,8.1,5.98,2.2599999999999998,2.7,3.19,2.7,0.81200000000000006,8.36,5.85]
["HSS","HSS7x2x0.188","HSS7x2x3/16","7x2x0.188","7x2",0.188,null,null,null,null,null,null,"Rectangular",10.7,3.15,7,2,6.4296000000000006,1.43632,0.1875,0.188,7.64,34.200000000000003,16.7,6.37,4.78,2.2999999999999998,2.2200000000000002,2.54,2.2200000000000002,0.83899999999999997,6.76,4.62]
["HSS","HSS6x5x0.500","HSS6x5x1/2","6x5x0.500","6x5",0.5,null,null,null,null,null,null,"Rectangular",31.84,9.36,6,5,4.5,3.5,0.5,0.5,7,9,43,18.100000000000001,14.3,2.14,32.200000000000003,16,12.9,1.85,62.9,24.3]
["HSS","HSS6x5x0.375","HSS6x5x3/8","6x5x0.375","6x5",0.375,null,null,null,null,null,null,"Rectangular",24.93,7.33,6,5,4.875,3.8625000000000003,0.375,0.375,10.3,13,35.700000000000003,14.7,11.9,2.21,26.8,12.9,10.7,1.91,50.9,19.3]
["HSS","HSS6x5x0.312","HSS6x5x5/16","6x5x0.312","6x5",0.312,null,null,null,null,null,null,"Rectangular",21.21,6.24,6,5,5.0705999999999998,4.069,0.3125,0.313,13,16.2,31.3,12.7,10.4,2.2400000000000002,23.5,11.2,9.4,1.94,44,16.600000000000001]
["HSS","HSS6x5x0.250","HSS6x5x1/4","6x5x0.250","6x5",0.25,null,null,null,null,null,null,"Rectangular",17.32,5.09,6,5,5.25,4.25,0.25,0.25,17,21,26.2,10.5,8.74,2.27,19.8,9.26,7.92,1.97,36.299999999999997,13.6]
["HSS","HSS6x5x0.188","HSS6x5x3/16","6x5x0.188","6x5",0.188,null,null,null,null,null,null,"Rectangular",13.25,3.9,6,5,5.4331999999999994,4.4367999999999999,0.1875,0.188,23.6,28.9,20.7,8.17,6.89,2.2999999999999998,15.6,7.21,6.24,2,28.2,10.5]
["HSS","HSS6x4x0.500","HSS6x4x1/2","6x4x0.500","6x4",0.5,null,null,null,null,null,null,"Rectangular",28.43,8.36,6,4,4.5,2.5,0.5,0.5,5,9,35.4,15.4,11.8,2.06,18.5,11.5,9.25,1.49,42.1,18.8]
["HSS","HSS6x4x0.375","HSS6x4x3/8","6x4x0.375","6x4",0.375,null,null,null,null,null,null,"Rectangular",22.37,6.58,6,4,4.875,2.8762499999999998,0.375,0.375,7.67,13,29.7,12.5,9.91,2.13,15.7,9.44,7.85,1.54,34.6,15.1]
["HSS","HSS6x4x0.312","HSS6x4x5/16","6x4x0.312","6x4",0.312,null,null,null,null,null,null,"Rectangular",19.079999999999998,5.62,6,4,5.0705999999999998,3.06114,0.3125,0.313,9.7799999999999994,16.2,26.2,10.9,8.73,2.16,13.9,8.2200000000000006,6.95,1.57,30.1,13]
["HSS","HSS6x4x0.250","HSS6x4x1/4","6x4x0.250","6x4",0.25,null,null,null,null,null,null,"Rectangular",15.62,4.59,6,4,5.25,3.25,0.25,0.25,13,21,22.1,9.06,7.36,2.19,11.7,6.84,5.85,1.6,25,10.7]
["HSS","HSS6x4x0.188","HSS6x4x3/16","6x4x0.188","6x4",0.188,null,null,null,null,null,null,"Rectangular",11.97,3.53,6,4,5.4331999999999994,3.4404000000000003,0.1875,0.188,18.3,28.9,17.5,7.07,5.83,2.23,9.34,5.36,4.67,1.63,19.600000000000001,8.3000000000000007]
["HSS","HSS6x3x0.500","HSS6x3x1/2","6x3x0.500","6x3",0.5,null,null,null,null,null,null,"Rectangular",25.03,7.36,6,3,4.5,1.5,0.5,0.5,3,9,27.8,12.6,9.26,1.94,8.9600000000000009,7.59,5.97,1.1000000000000001,23.9,13.3]
["HSS","HSS6x3x0.375","HSS6x3x3/8","6x3x0.375","6x3",0.375,null,null,null,null,null,null,"Rectangular",19.82,5.83,6,3,4.875,1.875,0.375,0.375,5,13,23.8,10.4,7.93,2.02,7.8,6.34,5.2,1.1599999999999999,20.3,10.9]
["HSS","HSS6x3x0.312","HSS6x3x5/16","6x3x0.312","6x3",0.312,null,null,null,null,null,null,"Rectangular",16.96,4.99,6,3,5.0705999999999998,2.0595400000000001,0.3125,0.313,6.58,16.2,21.1,9.1199999999999992,7.04,2.06,6.99,5.56,4.66,1.18,17.899999999999999,9.4499999999999993]
["HSS","HSS6x3x0.250","HSS6x3x1/4","6x3x0.250","6x3",0.25,null,null,null,null,null,null,"Rectangular",13.91,4.09,6,3,5.25,2.25,0.25,0.25,9,21,17.899999999999999,7.62,5.98,2.09,6,4.67,4,1.21,15.1,7.85]
["HSS","HSS6x3x0.188","HSS6x3x3/16","6x3x0.188","6x3",0.188,null,null,null,null,null,null,"Rectangular",10.7,3.15,6,3,5.4331999999999994,2.444,0.1875,0.188,13,28.9,14.3,5.98,4.7699999999999996,2.13,4.84,3.69,3.23,1.24,11.9,6.12]
["HSS","HSS6x2x0.375","HSS6x2x3/8","6x2x0.375","6x2",0.375,null,null,null,null,null,null,"Rectangular",17.27,5.08,6,2,4.875,0.87375000000000003,0.375,0.375,2.33,13,17.8,8.33,5.95,1.87,2.85,3.61,2.85,0.75,8.7200000000000006,6.65]
["HSS","HSS6x2x0.312","HSS6x2x5/16","6x2x0.312","6x2",0.312,null,null,null,null,null,null,"Rectangular",14.83,4.3600000000000003,6,2,5.0705999999999998,1.06107,0.3125,0.313,3.39,16.2,16.100000000000001,7.34,5.35,1.92,2.62,3.23,2.62,0.77500000000000002,7.94,5.89]
["HSS","HSS6x2x0.250","HSS6x2x1/4","6x2x0.250","6x2",0.25,null,null,null,null,null,null,"Rectangular",12.21,3.59,6,2,5.25,1.25,0.25,0.25,5,21,13.8,6.18,4.5999999999999996,1.96,2.31,2.75,2.31,0.80200000000000005,6.88,4.97]
["HSS","HSS6x2x0.188","HSS6x2x3/16","6x2x0.188","6x2",0.188,null,null,null,null,null,null,"Rectangular",9.42,2.78,6,2,5.4331999999999994,1.43632,0.1875,0.188,7.64,28.9,11.1,4.8899999999999997,3.71,2,1.91,2.2000000000000002,1.91,0.82899999999999996,5.58,3.93]
["HSS","HSS5x4x0.500","HSS5x4x1/2","5x4x0.500","5x4",0.5,null,null,null,null,null,null,"Rectangular",25.03,7.36,5,4,3.5,2.5,0.5,0.5,5,7,22,11.5,8.8000000000000007,1.73,15.4,9.77,7.7,1.45,31.7,15.3]
["HSS","HSS5x4x0.375","HSS5x4x3/8","5x4x0.375","5x4",0.375,null,null,null,null,null,null,"Rectangular",19.82,5.83,5,4,3.8625000000000003,2.8762499999999998,0.375,0.375,7.67,10.3,18.8,9.44,7.5,1.79,13.2,8.08,6.6,1.5,26.3,12.4]
["HSS","HSS5x4x0.312","HSS5x4x5/16","5x4x0.312","5x4",0.312,null,null,null,null,null,null,"Rectangular",16.96,4.99,5,4,4.069,3.06114,0.3125,0.313,9.7799999999999994,13,16.600000000000001,8.25,6.66,1.83,11.7,7.06,5.85,1.53,22.9,10.7]
["HSS","HSS5x4x0.250","HSS5x4x1/4","5x4x0.250","5x4",0.25,null,null,null,null,null,null,"Rectangular",13.91,4.09,5,4,4.25,3.25,0.25,0.25,13,17,14.1,6.89,5.65,1.86,9.98,5.9,4.99,1.56,19.100000000000001,8.85]
["HSS","HSS5x4x0.188","HSS5x4x3/16","5x4x0.188","5x4",0.188,null,null,null,null,null,null,"Rectangular",10.7,3.15,5,4,4.4367999999999999,3.4404000000000003,0.1875,0.188,18.3,23.6,11.3,5.4,4.5,1.89,7.98,4.6399999999999997,3.99,1.59,15,6.87]
["HSS","HSS5x3x0.500","HSS5x3x1/2","5x3x0.500","5x3",0.5,null,null,null,null,null,null,"Rectangular",21.63,6.36,5,3,3.5,1.5,0.5,0.5,3,7,16.899999999999999,9.1999999999999993,6.77,1.63,7.37,6.34,4.91,1.08,18.2,10.8]
["HSS","HSS5x3x0.375","HSS5x3x3/8","5x3x0.375","5x3",0.375,null,null,null,null,null,null,"Rectangular",17.27,5.08,5,3,3.8625000000000003,1.875,0.375,0.375,5,10.3,14.7,7.71,5.9,1.7,6.5,5.35,4.33,1.1299999999999999,15.6,8.9]
["HSS","HSS5x3x0.312","HSS5x3x5/16","5x3x0.312","5x3",0.312,null,null,null,null,null,null,"Rectangular",14.83,4.3600000000000003,5,3,4.069,2.0595400000000001,0.3125,0.313,6.58,13,13.2,6.78,5.28,1.74,5.86,4.72,3.91,1.1599999999999999,13.8,7.77]
["HSS","HSS5x3x0.250","HSS5x3x1/4","5x3x0.250","5x3",0.25,null,null,null,null,null,null,"Rectangular",12.21,3.59,5,3,{"$f":"W325*U325","v":4.25},{"$f":"V325*U325","v":2.25},0.25,0.25,9,17,11.3,5.7,4.5199999999999996,1.77,5.05,3.98,3.37,1.19,11.7,6.47]
["HSS","HSS5x3x0.188","HSS5x3x3/16","5x3x0.188","5x3",0.188,null,null,null,null,null,null,"Rectangular",9.42,2.78,5,3,4.4367999999999999,2.444,0.1875,0.188,13,23.6,9.08,4.5,3.63,1.81,4.09,3.16,2.73,1.21,9.23,5.0599999999999996]
["HSS","HSS5x2.5x0.250","HSS5x2.5x1/4","5x2.5x0.250","5x2.5",0.25,null,null,null,null,null,null,"Rectangular",11.36,3.34,5,2.5,4.25,1.75,0.25,0.25,7,17,9.89,5.1100000000000003,3.96,1.72,3.28,3.12,2.62,0.99099999999999999,8.36,5.28]
["HSS","HSS5x2.5x0.188","HSS5x2.5x3/16","5x2.5x0.188","5x2.5",0.188,null,null,null,null,null,null,"Rectangular",8.7799999999999994,2.59,5,2.5,4.4367999999999999,1.9364000000000001,0.1875,0.188,10.3,23.6,7.99,4.05,3.2,1.76,2.69,2.4900000000000002,2.15,1.02,6.68,4.16]
["HSS","HSS5x2x0.375","HSS5x2x3/8","5x2x0.375","5x2",0.375,null,null,null,null,null,null,"Rectangular",14.72,4.33,5,2,3.8625000000000003,0.87375000000000003,0.375,0.375,2.33,10.3,10.7,5.98,4.29,1.57,2.35,3,2.35,0.73699999999999999,6.82,5.43]
["HSS","HSS5x2x0.312","HSS5x2x5/16","5x2x0.312","5x2",0.312,null,null,null,null,null,null,"Rectangular",12.7,3.74,5,2,4.069,1.06107,0.3125,0.313,3.39,13,9.76,5.31,3.9,1.62,2.17,2.7,2.17,0.76300000000000001,6.24,4.83]
["HSS","HSS5x2x0.250","HSS5x2x1/4","5x2x0.250","5x2",0.25,null,null,null,null,null,null,"Rectangular",10.51,3.09,5,2,4.25,1.25,0.25,0.25,5,17,8.48,4.51,3.39,1.66,1.93,2.3199999999999998,1.93,0.78900000000000003,5.43,4.0999999999999996]
["HSS","HSS5x2x0.188","HSS5x2x3/16","5x2x0.188","5x2",0.188,null,null,null,null,null,null,"Rectangular",8.15,2.4,5,2,4.4367999999999999,1.43632,0.1875,0.188,7.64,23.6,6.9,3.59,2.76,1.7,1.6,1.86,1.6,0.81599999999999995,4.41,3.25]
["HSS","HSS4x3x0.375","HSS4x3x3/8","4x3x0.375","4x3",0.375,null,null,null,null,null,null,"Rectangular",14.72,4.33,4,3,2.8762499999999998,1.875,0.375,0.375,5,7.67,8.23,5.36,4.12,1.38,5.19,4.37,3.46,1.1000000000000001,11.1,6.93]
["HSS","HSS4x3x0.312","HSS4x3x5/16","4x3x0.312","4x3",0.312,null,null,null,null,null,null,"Rectangular",12.7,3.74,4,3,3.06114,2.0595400000000001,0.3125,0.313,6.58,9.7799999999999994,7.46,4.75,3.73,1.41,4.72,3.88,3.15,1.1200000000000001,9.9,6.08]
["HSS","HSS4x3x0.250","HSS4x3x1/4","4x3x0.250","4x3",0.25,null,null,null,null,null,null,"Rectangular",10.51,3.09,4,3,3.25,2.25,0.25,0.25,9,13,6.46,4.03,3.23,1.45,4.1100000000000003,3.3,2.74,1.1499999999999999,8.41,5.0999999999999996]
["HSS","HSS4x3x0.188","HSS4x3x3/16","4x3x0.188","4x3",0.188,null,null,null,null,null,null,"Rectangular",8.15,2.4,4,3,3.4404000000000003,2.444,0.1875,0.188,13,18.3,5.24,3.21,2.62,1.48,3.35,2.63,2.23,1.18,6.68,4]
["HSS","HSS4x2.5x0.250","HSS4x2.5x1/4","4x2.5x0.250","4x2.5",0.25,null,null,null,null,null,null,"Rectangular",9.66,2.84,4,2.5,3.25,1.75,0.25,0.25,7,13,5.58,3.56,2.79,1.4,2.65,2.56,2.12,0.96499999999999997,6.09,4.16]
["HSS","HSS4x2.5x0.188","HSS4x2.5x3/16","4x2.5x0.188","4x2.5",0.188,null,null,null,null,null,null,"Rectangular",7.51,2.21,4,2.5,3.4404000000000003,1.9364000000000001,0.1875,0.188,10.3,18.3,4.5599999999999996,2.85,2.2799999999999998,1.44,2.1800000000000002,2.0499999999999998,1.74,0.99299999999999999,4.8899999999999997,3.29]
["HSS","HSS4x2x0.375","HSS4x2x3/8","4x2x0.375","4x2",0.375,null,null,null,null,null,null,"Rectangular",12.17,3.58,4,2,2.8762499999999998,0.87375000000000003,0.375,0.375,2.33,7.67,5.76,4,2.88,1.27,1.84,2.39,1.84,0.71799999999999997,4.97,4.21]
["HSS","HSS4x2x0.312","HSS4x2x5/16","4x2x0.312","4x2",0.312,null,null,null,null,null,null,"Rectangular",10.58,3.11,4,2,3.06114,1.06107,0.3125,0.313,3.39,9.7799999999999994,5.33,3.6,2.66,1.31,1.72,2.17,1.72,0.74399999999999999,4.58,3.78]
["HSS","HSS4x2x0.250","HSS4x2x1/4","4x2x0.250","4x2",0.25,null,null,null,null,null,null,"Rectangular",8.81,2.59,4,2,3.25,1.25,0.25,0.25,5,13,4.7,3.09,2.35,1.35,1.54,1.88,1.54,0.77100000000000002,4.01,3.22]
["HSS","HSS4x2x0.188","HSS4x2x3/16","4x2x0.188","4x2",0.188,null,null,null,null,null,null,"Rectangular",6.87,2.02,4,2,3.4404000000000003,1.43632,0.1875,0.188,7.64,18.3,3.88,2.4900000000000002,1.94,1.38,1.29,1.52,1.29,0.79800000000000004,3.27,2.57]
["HSS","HSS4x1.5x0.250","HSS4x1.5x1/4","4x1.5x0.250","4x1.5",0.25,null,null,null,null,null,null,"Rectangular",7.96,2.34,4,1.5,3.25,0.75,0.25,0.25,3,13,3.82,2.62,1.91,1.28,0.75800000000000001,1.26,1.01,0.56899999999999995,2.23,2.2799999999999998]
["HSS","HSS4x1.5x0.188","HSS4x1.5x3/16","4x1.5x0.188","4x1.5",0.188,null,null,null,null,null,null,"Rectangular",6.23,1.84,4,1.5,3.4404000000000003,0.93624000000000007,0.1875,0.188,4.9800000000000004,18.3,3.19,2.13,1.6,1.32,0.65100000000000002,1.04,0.86799999999999999,0.59499999999999997,1.87,1.85]
["HSS","HSS3.5x2.5x0.375","HSS3.5x2.5x3/8","3.5x2.5x0.375","3.5x2.5",0.375,null,null,null,null,null,null,"Rectangular",12.17,3.58,3.5,2.5,2.3737500000000002,1.37625,0.375,0.375,3.67,6.33,4.9000000000000004,3.74,2.8,1.17,2.84,2.94,2.27,0.89200000000000002,6.38,4.78]
["HSS","HSS3.5x2.5x0.312","HSS3.5x2.5x5/16","3.5x2.5x0.312","3.5x2.5",0.312,null,null,null,null,null,null,"Rectangular",10.58,3.11,3.5,2.5,2.5603400000000001,1.5618700000000001,0.3125,0.313,4.99,8.18,4.51,3.36,2.58,1.2,2.63,2.64,2.1,0.92,5.79,4.24]
["HSS","HSS3.5x2.5x0.250","HSS3.5x2.5x1/4","3.5x2.5x0.250","3.5x2.5",0.25,null,null,null,null,null,null,"Rectangular",8.81,2.59,3.5,2.5,2.75,1.75,0.25,0.25,7,11,3.97,2.88,2.27,1.24,2.33,2.2799999999999998,1.86,0.94799999999999995,4.99,3.6]
["HSS","HSS3.5x2.5x0.188","HSS3.5x2.5x3/16","3.5x2.5x0.188","3.5x2.5",0.188,null,null,null,null,null,null,"Rectangular",6.87,2.02,3.5,2.5,2.9327999999999999,1.9364000000000001,0.1875,0.188,10.3,15.6,3.27,2.3199999999999998,1.87,1.27,1.93,1.83,1.54,0.97699999999999998,4.0199999999999996,2.85]
["HSS","HSS3.5x2x0.250","HSS3.5x2x1/4","3.5x2x0.250","3.5x2",0.25,null,null,null,null,null,null,"Rectangular",7.96,2.34,3.5,2,2.75,1.25,0.25,0.25,5,11,3.31,2.48,1.89,1.19,1.35,1.66,1.35,0.75900000000000001,3.31,2.78]
["HSS","HSS3.5x2x0.188","HSS3.5x2x3/16","3.5x2x0.188","3.5x2",0.188,null,null,null,null,null,null,"Rectangular",6.23,1.84,3.5,2,2.9327999999999999,1.43632,0.1875,0.188,7.64,15.6,2.75,2.0099999999999998,1.57,1.22,1.1299999999999999,1.35,1.1299999999999999,0.78600000000000003,2.71,2.23]
["HSS","HSS3.5x1.5x0.250","HSS3.5x1.5x1/4","3.5x1.5x0.250","3.5x1.5",0.25,null,null,null,null,null,null,"Rectangular",7.11,2.09,3.5,1.5,2.75,0.75,0.25,0.25,3,11,2.65,2.0699999999999998,1.51,1.1299999999999999,0.65900000000000003,1.1100000000000001,0.879,0.56200000000000006,1.86,1.97]
["HSS","HSS3.5x1.5x0.188","HSS3.5x1.5x3/16","3.5x1.5x0.188","3.5x1.5",0.188,null,null,null,null,null,null,"Rectangular",5.59,1.65,3.5,1.5,2.9327999999999999,0.93624000000000007,0.1875,0.188,4.9800000000000004,15.6,2.2400000000000002,1.7,1.28,1.17,0.56899999999999995,0.91700000000000004,0.75900000000000001,0.58799999999999997,1.57,1.61]
["HSS","HSS3x2.5x0.312","HSS3x2.5x5/16","3x2.5x0.312","3x2.5",0.312,null,null,null,null,null,null,"Rectangular",9.51,2.8,3,2.5,2.0595400000000001,1.5618700000000001,0.3125,0.313,4.99,6.58,3.02,2.62,2.0099999999999998,1.04,2.2599999999999998,2.2999999999999998,1.81,0.89800000000000002,4.53,3.56]
["HSS","HSS3x2.5x0.250","HSS3x2.5x1/4","3x2.5x0.250","3x2.5",0.25,null,null,null,null,null,null,"Rectangular",7.96,2.34,3,2.5,2.25,1.75,0.25,0.25,7,9,2.68,2.27,1.79,1.07,2.0099999999999998,1.99,1.61,0.92700000000000005,3.93,3.03]
["HSS","HSS3x2.5x0.188","HSS3x2.5x3/16","3x2.5x0.188","3x2.5",0.188,null,null,null,null,null,null,"Rectangular",6.23,1.84,3,2.5,2.444,1.9364000000000001,0.1875,0.188,10.3,13,2.23,1.84,1.49,1.1000000000000001,1.68,1.62,1.34,0.95599999999999996,3.19,2.42]
["HSS","HSS3x2x0.312","HSS3x2x5/16","3x2x0.312","3x2",0.312,null,null,null,null,null,null,"Rectangular",8.4499999999999993,2.4900000000000002,3,2,2.0595400000000001,1.06107,0.3125,0.313,3.39,6.58,2.4500000000000002,2.2000000000000002,1.64,0.99299999999999999,1.27,1.64,1.27,0.71599999999999997,2.97,2.72]
["HSS","HSS3x2x0.250","HSS3x2x1/4","3x2x0.250","3x2",0.25,null,null,null,null,null,null,"Rectangular",7.11,2.09,3,2,2.25,1.25,0.25,0.25,5,9,2.21,1.92,1.47,1.03,1.1499999999999999,1.44,1.1499999999999999,0.74299999999999999,2.63,2.35]
["HSS","HSS3x2x0.188","HSS3x2x3/16","3x2x0.188","3x2",0.188,null,null,null,null,null,null,"Rectangular",5.59,1.65,3,2,2.444,1.43632,0.1875,0.188,7.64,13,1.86,1.57,1.24,1.06,0.98,1.18,0.98,0.77100000000000002,2.17,1.89]
["HSS","HSS3x1.5x0.250","HSS3x1.5x1/4","3x1.5x0.250","3x1.5",0.25,null,null,null,null,null,null,"Rectangular",6.26,1.84,3,1.5,2.25,0.75,0.25,0.25,3,9,1.74,1.58,1.1599999999999999,0.97199999999999998,0.56000000000000005,0.94899999999999995,0.747,0.55200000000000005,1.5,1.66]
["HSS","HSS3x1.5x0.188","HSS3x1.5x3/16","3x1.5x0.188","3x1.5",0.188,null,null,null,null,null,null,"Rectangular",4.96,1.46,3,1.5,2.444,0.93624000000000007,0.1875,0.188,4.9800000000000004,13,1.49,1.31,0.99199999999999999,1.01,0.48799999999999999,0.79400000000000004,0.65100000000000002,0.57799999999999996,1.27,1.36]
["HSS","HSS3x1x0.188","HSS3x1x3/16","3x1x0.188","3x1",0.188,null,null,null,null,null,null,"Rectangular",4.32,1.27,3,1,2.444,0.43615999999999999,0.1875,0.188,2.3199999999999998,13,1.1200000000000001,1.04,0.74399999999999999,0.93700000000000006,0.17799999999999999,0.45200000000000001,0.35599999999999998,0.375,0.54600000000000004,0.83299999999999996]
["HSS","HSS2.5x2x0.250","HSS2.5x2x1/4","2.5x2x0.250","2.5x2",0.25,null,null,null,null,null,null,"Rectangular",6.26,1.84,2.5,2,1.75,1.25,0.25,0.25,5,7,1.38,1.43,1.1000000000000001,0.86499999999999999,0.96199999999999997,1.22,0.96199999999999997,0.72299999999999998,1.98,1.91]
["HSS","HSS2.5x2x0.188","HSS2.5x2x3/16","2.5x2x0.188","2.5x2",0.188,null,null,null,null,null,null,"Rectangular",4.96,1.46,2.5,2,1.9364000000000001,1.43632,0.1875,0.188,7.64,10.3,1.17,1.18,0.93899999999999995,0.89700000000000002,0.82499999999999996,1.01,0.82499999999999996,0.752,1.64,1.55]
["HSS","HSS2.5x1.5x0.250","HSS2.5x1.5x1/4","2.5x1.5x0.250","2.5x1.5",0.25,null,null,null,null,null,null,"Rectangular",5.41,1.59,2.5,1.5,1.75,0.75,0.25,0.25,3,7,1.06,1.1499999999999999,0.84599999999999997,0.81599999999999995,0.46100000000000002,0.79300000000000004,0.61499999999999999,0.53800000000000003,1.1399999999999999,1.35]
["HSS","HSS2.5x1.5x0.188","HSS2.5x1.5x3/16","2.5x1.5x0.188","2.5x1.5",0.188,null,null,null,null,null,null,"Rectangular",4.32,1.27,2.5,1.5,1.9364000000000001,0.93624000000000007,0.1875,0.188,4.9800000000000004,10.3,0.92300000000000004,0.96499999999999997,0.73799999999999999,0.85199999999999998,0.40699999999999997,0.67,0.54300000000000004,0.56499999999999995,0.97699999999999998,1.1100000000000001]
["HSS","HSS2.5x1x0.188","HSS2.5x1x3/16","2.5x1x0.188","2.5x1",0.188,null,null,null,null,null,null,"Rectangular",3.68,1.08,2.5,1,1.9364000000000001,0.43615999999999999,0.1875,0.188,2.3199999999999998,10.3,0.67100000000000004,0.748,0.53700000000000003,0.78700000000000003,0.14699999999999999,0.376,0.29399999999999998,0.36799999999999999,0.42699999999999999,0.68]
["HSS","HSS2x1.5x0.188","HSS2x1.5x3/16","2x1.5x0.188","2x1.5",0.188,null,null,null,null,null,null,"Rectangular",3.68,1.08,2,1.5,1.43632,0.93624000000000007,0.1875,0.188,4.9800000000000004,7.64,0.51500000000000001,0.67100000000000004,0.51500000000000001,0.69,0.32500000000000001,0.54700000000000004,0.433,0.54800000000000004,0.69599999999999995,0.86799999999999999]
["HSS","HSS2x1x0.188","HSS2x1x3/16","2x1x0.188","2x1",0.188,null,null,null,null,null,null,"Rectangular",3.04,0.89600000000000002,2,1,1.43632,0.43615999999999999,0.1875,0.188,2.3199999999999998,7.64,0.36,0.501,0.36,0.63400000000000001,0.115,0.3,0.23,0.35899999999999999,0.311,0.52800000000000002]
[null," ",null," "," "," ",null,null,null,null,null,null,null,null,null,null,null,0,0]
["HSS","HSS22x22x1","HSS22x22x1","22x22x1","22x22",1,"22x22",null,null,5,370,{"$f":"+K370+J370-1","v":374},"Square",277.07,81.400000000000006,22,22,19,19,1,1,19,19,5890,634,535,8.5,5890,634,535,8.5,9470,878]
["HSS","HSS22x22x0.875","HSS22x22x7/8","22x22x0.875","22x22",0.875,"20x20",null,null,7,{"$f":"+L370+1","v":375},{"$f":"+K371+J371-1","v":381},"Square",244.88,72,22,22,19.337500000000002,19.337500000000002,0.875,0.875,22.1,22.1,5280,565,480,8.56,5280,565,480,8.56,8420,778]
["HSS","HSS22x22x0.750","HSS22x22x3/4","22x22x0.750","22x22",0.75,"18x18",null,null,8,{"$f":"+L371+1","v":382},{"$f":"+K372+J372-1","v":389},"Square",212,62.3,22,22,19.725000000000001,19.725000000000001,0.75,0.75,26.3,26.3,4630,492,421,8.6199999999999992,4630,492,421,8.6199999999999992,7330,676]
["HSS","HSS22x22x0.625","HSS22x22x5/8","22x22x0.625","22x22",0.625,"16x16",null,null,8,390,397,"Square",178.41,52.4,22,22,20.125,20.125,0.625,0.625,32.200000000000003,32.200000000000003,3950,418,359,8.68,3950,418,359,8.68,6200,570]
["HSS","HSS22x22x0.500","HSS22x22x1/2","22x22x0.500","22x22",0.5,"14x14",null,null,8,398,405,"Square",144.13,42.4,22,22,20.5,20.5,0.5,0.5,41,41,3240,340,294,8.74,3240,340,294,8.74,5030,462]
["HSS","HSS20x20x1","HSS20x20x1","20x20x1","20x20",1,"12x12",null,null,9,406,414,"Square",249.85,73.400000000000006,20,20,17,17,1,1,17,17,4340,517,434,7.69,4340,517,434,7.69,7020,718]
["HSS","HSS20x20x0.875","HSS20x20x7/8","20x20x0.875","20x20",0.875,"10x10",null,null,7,415,421,"Square",221.06,65,20,20,17.412499999999998,17.412499999999998,0.875,0.875,19.899999999999999,19.899999999999999,3900,461,390,7.75,3900,461,390,7.75,6260,638]
["HSS","HSS20x20x0.750","HSS20x20x3/4","20x20x0.750","20x20",0.75,"9x9",null,null,6,422,427,"Square",191.58,56.3,20,20,17.774999999999999,17.774999999999999,0.75,0.75,23.7,23.7,3430,403,343,7.81,3430,403,343,7.81,5460,554]
["HSS","HSS20x20x0.625","HSS20x20x5/8","20x20x0.625","20x20",0.625,"8x8",null,null,6,428,433,"Square",161.4,47.4,20,20,18.125,18.125,0.625,0.625,29,29,2940,342,294,7.87,2940,342,294,7.87,4620,468]
["HSS","HSS20x20x0.500","HSS20x20x1/2","20x20x0.500","20x20",0.5,"7x7",null,null,6,434,439,"Square",130.52000000000001,38.4,20,20,18.5,18.5,0.5,0.5,37,37,2410,279,241,7.93,2410,279,241,7.93,3760,380]
["HSS","HSS20x20x0.375","HSS20x20x3/8","20x20x0.375","20x20",0.375,"6x6",null,null,6,440,445,"Square",98.94,29.1,20,20,18.862499999999997,18.862499999999997,0.375,0.375,50.3,50.3,1850,213,185,7.99,1850,213,185,7.99,2870,289]
["HSS","HSS20x20x0.312","HSS20x20x5/16","20x20x0.312","20x20",0.312,"5.5x5.5",null,null,4,446,449,"Square",82.88,24.4,20,20,19.061699999999998,19.061699999999998,0.3125,0.313,60.9,60.9,1570,179,157,8.02,1570,179,157,8.02,2410,243]
["HSS","HSS18x18x1","HSS18x18x1","18x18x1","18x18",1,"5x5",null,null,5,450,454,"Square",222.63,65.400000000000006,18,18,15,15,1,1,15,15,3090,411,343,6.87,3090,411,343,6.87,5040,574]
["HSS","HSS18x18x0.875","HSS18x18x7/8","18x18x0.875","18x18",0.875,"4.5x4.5",null,null,5,455,459,"Square",197.24,58,18,18,15.400000000000002,15.400000000000002,0.875,0.875,17.600000000000001,17.600000000000001,2780,368,309,6.93,2780,368,309,6.93,4500,511]
["HSS","HSS18x18x0.750","HSS18x18x3/4","18x18x0.750","18x18",0.75,"4x4",null,null,5,460,464,"Square",171.16,50.3,18,18,15.75,15.75,0.75,0.75,21,21,2460,322,273,6.99,2460,322,273,6.99,3930,445]
["HSS","HSS18x18x0.625","HSS18x18x5/8","18x18x0.625","18x18",0.625,"3.5x3.5",null,null,4,465,468,"Square",144.38999999999999,42.4,18,18,16.125,16.125,0.625,0.625,25.8,25.8,2110,274,234,7.05,2110,274,234,7.05,3340,376]
["HSS","HSS18x18x0.500","HSS18x18x1/2","18x18x0.500","18x18",0.5,"3x3",null,null,4,469,472,"Square",116.91,34.4,18,18,16.5,16.5,0.5,0.5,33,33,1740,224,193,7.11,1740,224,193,7.11,2720,306]
["HSS","HSS18x18x0.375","HSS18x18x3/8","18x18x0.375","18x18",0.375,"2.5x2.5",null,null,3,473,475,"Square",88.73,26.1,18,18,16.875,16.875,0.375,0.375,45,45,1340,172,149,7.17,1340,172,149,7.17,2080,233]
["HSS","HSS18x18x0.312","HSS18x18x5/16","18x18x0.312","18x18",0.312,"2.25x2.25",null,null,2,476,477,"Square",74.38,21.9,18,18,17.058499999999999,17.058499999999999,0.3125,0.313,54.5,54.5,1130,145,126,7.2,1130,145,126,7.2,1750,196]
["HSS","HSS18x18x0.250","HSS18x18x1/4","18x18x0.250","18x18",0.25,"2x2",null,null,2,478,479,"Square",59.85,17.600000000000001,18,18,{"$f":"W389*U389","v":17.25},{"$f":"V389*U389","v":17.25},0.25,0.25,69,69,919,117,102,7.23,919,117,102,7.23,1410,157]
["HSS","HSS16x16x1","HSS16x16x1","16x16x1","16x16",1,"1.5x1.5",null,null,2,480,481,"Square",195.4,57.4,16,16,13,13,1,1,13,13,2100,318,263,6.05,2100,318,263,6.05,3470,446]
["HSS","HSS16x16x0.875","HSS16x16x7/8","16x16x0.875","16x16",0.875,null,null,null,null,null,null,"Square",173.43,51,16,16,13.387500000000001,13.387500000000001,0.875,0.875,15.3,15.3,1900,285,238,6.11,1900,285,238,6.11,3100,398]
["HSS","HSS16x16x0.750","HSS16x16x3/4","16x16x0.750","16x16",0.75,null,null,null,null,null,null,"Square",150.75,44.3,16,16,13.725000000000001,13.725000000000001,0.75,0.75,18.3,18.3,1690,250,211,6.17,1690,250,211,6.17,2720,347]
["HSS","HSS16x16x0.625","HSS16x16x5/8","16x16x0.625","16x16",0.625,null,null,null,null,null,null,"Square",127.37,37.4,16,16,14.125,14.125,0.625,0.625,22.6,22.6,1450,214,182,6.23,1450,214,182,6.23,2320,295]
["HSS","HSS16x16x0.500","HSS16x16x1/2","16x16x0.500","16x16",0.5,null,null,null,null,null,null,"Square",103.3,30.4,16,16,14.5,14.5,0.5,0.5,29,29,1200,175,150,6.29,1200,175,150,6.29,1890,240]
["HSS","HSS16x16x0.375","HSS16x16x3/8","16x16x0.375","16x16",0.375,null,null,null,null,null,null,"Square",78.52,23.1,16,16,14.887500000000001,14.887500000000001,0.375,0.375,39.700000000000003,39.700000000000003,931,134,116,6.35,931,134,116,6.35,1450,183]
["HSS","HSS16x16x0.312","HSS16x16x5/16","16x16x0.312","16x16",0.312,null,null,null,null,null,null,"Square",65.87,19.399999999999999,16,16,15.055300000000001,15.055300000000001,0.3125,0.313,48.1,48.1,790,114,98.7,6.38,790,114,98.7,6.38,1220,154]
["HSS","HSS16x16x0.250","HSS16x16x1/4","16x16x0.250","16x16",0.25,null,null,null,null,null,null,"Square",53.05,15.6,16,16,15.25,15.25,0.25,0.25,61,61,641,91.8,80.099999999999994,6.41,641,91.8,80.099999999999994,6.41,986,124]
["HSS","HSS14x14x1","HSS14x14x1","14x14x1","14x14",1,null,null,null,null,null,null,"Square",168.18,49.4,14,14,11,11,1,1,11,11,1350,236,194,5.24,1350,236,194,5.24,2260,334]
["HSS","HSS14x14x0.875","HSS14x14x7/8","14x14x0.875","14x14",0.875,null,null,null,null,null,null,"Square",149.61000000000001,44,14,14,11.375,11.375,0.875,0.875,13,13,1230,213,176,5.3,1230,213,176,5.3,2030,299]
["HSS","HSS14x14x0.750","HSS14x14x3/4","14x14x0.750","14x14",0.75,null,null,null,null,null,null,"Square",130.33000000000001,38.299999999999997,14,14,11.774999999999999,11.774999999999999,0.75,0.75,15.7,15.7,1100,188,157,5.36,1100,188,157,5.36,1790,262]
["HSS","HSS14x14x0.625","HSS14x14x5/8","14x14x0.625","14x14",0.625,null,null,null,null,null,null,"Square",110.36,32.4,14,14,12.125,12.125,0.625,0.625,19.399999999999999,19.399999999999999,952,161,136,5.42,952,161,136,5.42,1530,223]
["HSS","HSS14x14x0.500","HSS14x14x1/2","14x14x0.500","14x14",0.5,null,null,null,null,null,null,"Square",89.68,26.4,14,14,12.5,12.5,0.5,0.5,25,25,791,132,113,5.48,791,132,113,5.48,1250,182]
["HSS","HSS14x14x0.375","HSS14x14x3/8","14x14x0.375","14x14",0.375,null,null,null,null,null,null,"Square",68.31,20.100000000000001,14,14,12.862499999999999,12.862499999999999,0.375,0.375,34.299999999999997,34.299999999999997,615,102,87.9,5.54,615,102,87.9,5.54,963,139]
["HSS","HSS14x14x0.312","HSS14x14x5/16","14x14x0.312","14x14",0.312,null,null,null,null,null,null,"Square",57.36,16.899999999999999,14,14,13.052100000000001,13.052100000000001,0.3125,0.313,41.7,41.7,523,86.2,74.7,5.57,523,86.2,74.7,5.57,813,117]
["HSS","HSS14x14x0.250","HSS14x14x1/4","14x14x0.250","14x14",0.25,null,null,null,null,null,null,"Square",46.24,13.6,14,14,13.25,13.25,0.25,0.25,53,53,426,69.8,60.8,5.6,426,69.8,60.8,5.6,657,94.5]
["HSS","HSS12x12x1","HSS12x12x1","12x12x1","12x12",1,null,null,null,null,null,null,"Square",140.96,41.4,12,12,9,9,1,1,9,9,809,167,135,4.42,809,167,135,4.42,1370,238]
["HSS","HSS12x12x0.875","HSS12x12x7/8","12x12x0.875","12x12",0.875,null,null,null,null,null,null,"Square",125.79,37,12,12,9.3624999999999989,9.3624999999999989,0.875,0.875,10.7,10.7,742,151,124,4.4800000000000004,742,151,124,4.4800000000000004,1240,214]
["HSS","HSS12x12x0.750","HSS12x12x3/4","12x12x0.750","12x12",0.75,null,null,null,null,null,null,"Square",109.91,32.299999999999997,12,12,9.75,9.75,0.75,0.75,13,13,666,134,111,4.54,666,134,111,4.54,1100,188]
["HSS","HSS12x12x0.625","HSS12x12x5/8","12x12x0.625","12x12",0.625,null,null,null,null,null,null,"Square",93.34,27.4,12,12,10.125,10.125,0.625,0.625,16.2,16.2,580,116,96.7,4.5999999999999996,580,116,96.7,4.5999999999999996,943,161]
["HSS","HSS12x12x0.500","HSS12x12x1/2","12x12x0.500","12x12",0.5,null,null,null,null,null,null,"Square",76.069999999999993,22.4,12,12,10.5,10.5,0.5,0.5,21,21,486,95.4,80.900000000000006,4.66,486,95.4,80.900000000000006,4.66,777,132]
["HSS","HSS12x12x0.375","HSS12x12x3/8","12x12x0.375","12x12",0.375,null,null,null,null,null,null,"Square",58.1,17.100000000000001,12,12,10.875,10.875,0.375,0.375,29,29,380,73.900000000000006,63.4,4.72,380,73.900000000000006,63.4,4.72,599,101]
["HSS","HSS12x12x0.312","HSS12x12x5/16","12x12x0.312","12x12",0.312,null,null,null,null,null,null,"Square",48.86,14.4,12,12,11.0489,11.0489,0.3125,0.313,35.299999999999997,35.299999999999997,324,62.6,54.1,4.75,324,62.6,54.1,4.75,507,85.4]
["HSS","HSS12x12x0.250","HSS12x12x1/4","12x12x0.250","12x12",0.25,null,null,null,null,null,null,"Square",39.43,11.6,12,12,11.25,11.25,0.25,0.25,45,45,265,50.8,44.1,4.78,265,50.8,44.1,4.78,410,69]
["HSS","HSS12x12x0.188","HSS12x12x3/16","12x12x0.188","12x12",0.188,null,null,null,null,null,null,"Square",29.84,8.7899999999999991,12,12,11.430399999999999,11.430399999999999,0.1875,0.188,60.8,60.8,203,38.799999999999997,33.9,4.8099999999999996,203,38.799999999999997,33.9,4.8099999999999996,313,52.4]
["HSS","HSS10x10x0.750","HSS10x10x3/4","10x10x0.750","10x10",0.75,null,null,null,null,null,null,"Square",89.5,26.3,10,10,7.7250000000000005,7.7250000000000005,0.75,0.75,10.3,10.3,364,89.4,72.900000000000006,3.72,364,89.4,72.900000000000006,3.72,610,127]
["HSS","HSS10x10x0.625","HSS10x10x5/8","10x10x0.625","10x10",0.625,null,null,null,null,null,null,"Square",76.33,22.4,10,10,8.125,8.125,0.625,0.625,13,13,321,77.599999999999994,64.2,3.78,321,77.599999999999994,64.2,3.78,529,109]
["HSS","HSS10x10x0.500","HSS10x10x1/2","10x10x0.500","10x10",0.5,null,null,null,null,null,null,"Square",62.46,18.399999999999999,10,10,8.5,8.5,0.5,0.5,17,17,271,64.599999999999994,54.2,3.84,271,64.599999999999994,54.2,3.84,439,89.8]
["HSS","HSS10x10x0.375","HSS10x10x3/8","10x10x0.375","10x10",0.375,null,null,null,null,null,null,"Square",47.9,14.1,10,10,8.8874999999999993,8.8874999999999993,0.375,0.375,23.7,23.7,214,50.4,42.9,3.9,214,50.4,42.9,3.9,341,69.3]
["HSS","HSS10x10x0.312","HSS10x10x5/16","10x10x0.312","10x10",0.312,null,null,null,null,null,null,"Square",40.35,11.9,10,10,9.0457000000000001,9.0457000000000001,0.3125,0.313,28.9,28.9,184,42.8,36.700000000000003,3.93,184,42.8,36.700000000000003,3.93,289,58.6]
["HSS","HSS10x10x0.250","HSS10x10x1/4","10x10x0.250","10x10",0.25,null,null,null,null,null,null,"Square",32.630000000000003,9.59,10,10,9.25,9.25,0.25,0.25,37,37,151,34.9,30.1,3.96,151,34.9,30.1,3.96,235,47.5]
["HSS","HSS10x10x0.188","HSS10x10x3/16","10x10x0.188","10x10",0.188,null,null,null,null,null,null,"Square",24.73,7.29,10,10,9.4375999999999998,9.4375999999999998,0.1875,0.188,50.2,50.2,116,26.7,23.2,3.99,116,26.7,23.2,3.99,180,36.200000000000003]
["HSS","HSS9x9x0.625","HSS9x9x5/8","9x9x0.625","9x9",0.625,null,null,null,null,null,null,"Square",67.819999999999993,19.899999999999999,9,9,7.125,7.125,0.625,0.625,11.4,11.4,227,61.5,50.4,3.37,227,61.5,50.4,3.37,377,86.7]
["HSS","HSS9x9x0.500","HSS9x9x1/2","9x9x0.500","9x9",0.5,null,null,null,null,null,null,"Square",55.66,16.399999999999999,9,9,7.5,7.5,0.5,0.5,15,15,193,51.4,42.9,3.43,193,51.4,42.9,3.43,315,71.8]
["HSS","HSS9x9x0.375","HSS9x9x3/8","9x9x0.375","9x9",0.375,null,null,null,null,null,null,"Square",42.79,12.6,9,9,7.875,7.875,0.375,0.375,21,21,154,40.299999999999997,34.1,3.5,154,40.299999999999997,34.1,3.5,246,55.6]
["HSS","HSS9x9x0.312","HSS9x9x5/16","9x9x0.312","9x9",0.312,null,null,null,null,null,null,"Square",36.1,10.6,9,9,8.0754000000000001,8.0754000000000001,0.3125,0.313,25.8,25.8,132,34.299999999999997,29.3,3.52,132,34.299999999999997,29.3,3.52,209,47.1]
["HSS","HSS9x9x0.250","HSS9x9x1/4","9x9x0.250","9x9",0.25,null,null,null,null,null,null,"Square",29.23,8.59,9,9,8.25,8.25,0.25,0.25,33,33,109,28,24.1,3.56,109,28,24.1,3.56,170,38.200000000000003]
["HSS","HSS9x9x0.188","HSS9x9x3/16","9x9x0.188","9x9",0.188,null,null,null,null,null,null,"Square",22.18,6.54,9,9,8.4412000000000003,8.4412000000000003,0.1875,0.188,44.9,44.9,84,21.5,18.7,3.58,84,21.5,18.7,3.58,130,29.2]
["HSS","HSS8x8x0.625","HSS8x8x5/8","8x8x0.625","8x8",0.625,null,null,null,null,null,null,"Square",59.32,17.399999999999999,8,8,6.125,6.125,0.625,0.625,9.8000000000000007,9.8000000000000007,153,47.2,38.299999999999997,2.97,153,47.2,38.299999999999997,2.97,258,67]
["HSS","HSS8x8x0.500","HSS8x8x1/2","8x8x0.500","8x8",0.5,null,null,null,null,null,null,"Square",48.85,14.4,8,8,6.5,6.5,0.5,0.5,13,13,131,39.700000000000003,32.9,3.03,131,39.700000000000003,32.9,3.03,217,55.8]
["HSS","HSS8x8x0.375","HSS8x8x3/8","8x8x0.375","8x8",0.375,null,null,null,null,null,null,"Square",37.69,11.1,8,8,6.8625000000000007,6.8625000000000007,0.375,0.375,18.3,18.3,106,31.3,26.4,3.09,106,31.3,26.4,3.09,170,43.4]
["HSS","HSS8x8x0.312","HSS8x8x5/16","8x8x0.312","8x8",0.312,null,null,null,null,null,null,"Square",31.84,9.3699999999999992,8,8,7.0738000000000003,7.0738000000000003,0.3125,0.313,22.6,22.6,91,26.8,22.8,3.12,91,26.8,22.8,3.12,145,36.9]
["HSS","HSS8x8x0.250","HSS8x8x1/4","8x8x0.250","8x8",0.25,null,null,null,null,null,null,"Square",25.82,7.59,8,8,7.25,7.25,0.25,0.25,29,29,75.2,21.9,18.8,3.15,75.2,21.9,18.8,3.15,118,30]
["HSS","HSS8x8x0.188","HSS8x8x3/16","8x8x0.188","8x8",0.188,null,null,null,null,null,null,"Square",19.63,5.78,8,8,7.4447999999999999,7.4447999999999999,0.1875,0.188,39.6,39.6,58.4,16.899999999999999,14.6,3.18,58.4,16.899999999999999,14.6,3.18,90.8,22.9]
["HSS","HSS7x7x0.625","HSS7x7x5/8","7x7x0.625","7x7",0.625,null,null,null,null,null,null,"Square",50.81,14.9,7,7,5.125,5.125,0.625,0.625,8.1999999999999993,8.1999999999999993,97.6,34.799999999999997,27.9,2.56,97.6,34.799999999999997,27.9,2.56,166,49.9]
["HSS","HSS7x7x0.500","HSS7x7x1/2","7x7x0.500","7x7",0.5,null,null,null,null,null,null,"Square",42.05,12.4,7,7,5.5,5.5,0.5,0.5,11,11,84.7,29.6,24.2,2.62,84.7,29.6,24.2,2.62,141,41.8]
["HSS","HSS7x7x0.375","HSS7x7x3/8","7x7x0.375","7x7",0.375,null,null,null,null,null,null,"Square",32.58,9.58,7,7,5.8874999999999993,5.8874999999999993,0.375,0.375,15.7,15.7,68.7,23.5,19.600000000000001,2.68,68.7,23.5,19.600000000000001,2.68,112,32.700000000000003]
["HSS","HSS7x7x0.312","HSS7x7x5/16","7x7x0.312","7x7",0.312,null,null,null,null,null,null,"Square",27.59,8.1199999999999992,7,7,6.0721999999999996,6.0721999999999996,0.3125,0.313,19.399999999999999,19.399999999999999,59.6,20.100000000000001,17,2.71,59.6,20.100000000000001,17,2.71,95.7,27.9]
["HSS","HSS7x7x0.250","HSS7x7x1/4","7x7x0.250","7x7",0.25,null,null,null,null,null,null,"Square",22.42,6.59,7,7,6.25,6.25,0.25,0.25,25,25,49.4,16.5,14.1,2.74,49.4,16.5,14.1,2.74,78.3,22.7]
["HSS","HSS7x7x0.188","HSS7x7x3/16","7x7x0.188","7x7",0.188,null,null,null,null,null,null,"Square",17.079999999999998,5.03,7,7,6.4296000000000006,6.4296000000000006,0.1875,0.188,34.200000000000003,34.200000000000003,38.6,12.8,11,2.77,38.6,12.8,11,2.77,60.3,17.399999999999999]
["HSS","HSS6x6x0.625","HSS6x6x5/8","6x6x0.625","6x6",0.625,null,null,null,null,null,null,"Square",42.3,12.4,6,6,4.125,4.125,0.625,0.625,6.6,6.6,57.4,24.3,19.100000000000001,2.15,57.4,24.3,19.100000000000001,2.15,99.5,35.200000000000003]
["HSS","HSS6x6x0.500","HSS6x6x1/2","6x6x0.500","6x6",0.5,null,null,null,null,null,null,"Square",35.24,10.4,6,6,4.5,4.5,0.5,0.5,9,9,50.5,20.9,16.8,2.21,50.5,20.9,16.8,2.21,85.6,29.8]
["HSS","HSS6x6x0.375","HSS6x6x3/8","6x6x0.375","6x6",0.375,null,null,null,null,null,null,"Square",27.48,8.08,6,6,4.875,4.875,0.375,0.375,13,13,41.6,16.8,13.9,2.27,41.6,16.8,13.9,2.27,68.5,23.5]
["HSS","HSS6x6x0.312","HSS6x6x5/16","6x6x0.312","6x6",0.312,null,null,null,null,null,null,"Square",23.34,6.87,6,6,5.0705999999999998,5.0705999999999998,0.3125,0.313,16.2,16.2,36.299999999999997,14.5,12.1,2.2999999999999998,36.299999999999997,14.5,12.1,2.2999999999999998,59,20.100000000000001]
["HSS","HSS6x6x0.250","HSS6x6x1/4","6x6x0.250","6x6",0.25,null,null,null,null,null,null,"Square",19.02,5.59,6,6,5.25,5.25,0.25,0.25,21,21,30.3,11.9,10.1,2.33,30.3,11.9,10.1,2.33,48.5,16.5]
["HSS","HSS6x6x0.188","HSS6x6x3/16","6x6x0.188","6x6",0.188,null,null,null,null,null,null,"Square",14.53,4.28,6,6,5.4331999999999994,5.4331999999999994,0.1875,0.188,28.9,28.9,23.8,9.26,7.94,2.36,23.8,9.26,7.94,2.36,37.5,12.7]
["HSS","HSS5.5x5.5x0.375","HSS5.5x5.5x3/8","5.5x5.5x0.375","5.5x5.5",0.375,null,null,null,null,null,null,"Square",24.93,7.33,5.5,5.5,4.3874999999999993,4.3874999999999993,0.375,0.375,11.7,11.7,31.3,13.8,11.4,2.0699999999999998,31.3,13.8,11.4,2.0699999999999998,51.9,19.5]
["HSS","HSS5.5x5.5x0.312","HSS5.5x5.5x5/16","5.5x5.5x0.312","5.5x5.5",0.312,null,null,null,null,null,null,"Square",21.21,6.24,5.5,5.5,4.5697999999999999,4.5697999999999999,0.3125,0.313,14.6,14.6,27.4,12,9.9700000000000006,2.1,27.4,12,9.9700000000000006,2.1,44.8,16.7]
["HSS","HSS5.5x5.5x0.250","HSS5.5x5.5x1/4","5.5x5.5x0.250","5.5x5.5",0.25,null,null,null,null,null,null,"Square",17.32,5.09,5.5,5.5,4.75,4.75,0.25,0.25,19,19,23,9.91,8.36,2.13,23,9.91,8.36,2.13,37,13.7]
["HSS","HSS5.5x5.5x0.188","HSS5.5x5.5x3/16","5.5x5.5x0.188","5.5x5.5",0.188,null,null,null,null,null,null,"Square",13.25,3.9,5.5,5.5,4.9443999999999999,4.9443999999999999,0.1875,0.188,26.3,26.3,18.100000000000001,7.71,6.6,2.16,18.100000000000001,7.71,6.6,2.16,28.7,10.6]
["HSS","HSS5x5x0.500","HSS5x5x1/2","5x5x0.500","5x5",0.5,null,null,null,null,null,null,"Square",28.43,8.36,5,5,3.5,3.5,0.5,0.5,7,7,27.1,13.7,10.8,1.8,27.1,13.7,10.8,1.8,46.8,19.8]
["HSS","HSS5x5x0.375","HSS5x5x3/8","5x5x0.375","5x5",0.375,null,null,null,null,null,null,"Square",22.37,6.58,5,5,3.8625000000000003,3.8625000000000003,0.375,0.375,10.3,10.3,22.8,11.2,9.11,1.86,22.8,11.2,9.11,1.86,38.200000000000003,15.8]
["HSS","HSS5x5x0.312","HSS5x5x5/16","5x5x0.312","5x5",0.312,null,null,null,null,null,null,"Square",19.079999999999998,5.62,5,5,4.069,4.069,0.3125,0.313,13,13,20.100000000000001,9.7100000000000009,8.0299999999999994,1.89,20.100000000000001,9.7100000000000009,8.0299999999999994,1.89,33.1,13.6]
["HSS","HSS5x5x0.250","HSS5x5x1/4","5x5x0.250","5x5",0.25,null,null,null,null,null,null,"Square",15.62,4.59,5,5,{"$f":"W453*U453","v":4.25},{"$f":"V453*U453","v":4.25},0.25,0.25,17,17,16.899999999999999,8.07,6.78,1.92,16.899999999999999,8.07,6.78,1.92,27.4,11.2]
["HSS","HSS5x5x0.188","HSS5x5x3/16","5x5x0.188","5x5",0.188,null,null,null,null,null,null,"Square",11.97,3.53,5,5,4.4367999999999999,4.4367999999999999,0.1875,0.188,23.6,23.6,13.4,6.31,5.37,1.95,13.4,6.31,5.37,1.95,21.4,8.68]
["HSS","HSS4.5x4.5x0.500","HSS4.5x4.5x1/2","4.5x4.5x0.500","4.5x4.5",0.5,null,null,null,null,null,null,"Square",25.03,7.36,4.5,4.5,3,3,0.5,0.5,6,6,18.7,10.7,8.33,1.6,18.7,10.7,8.33,1.6,32.700000000000003,15.5]
["HSS","HSS4.5x4.5x0.375","HSS4.5x4.5x3/8","4.5x4.5x0.375","4.5x4.5",0.375,null,null,null,null,null,null,"Square",19.82,5.83,4.5,4.5,3.375,3.375,0.375,0.375,9,9,16,8.81,7.11,1.66,16,8.81,7.11,1.66,27.1,12.6]
["HSS","HSS4.5x4.5x0.312","HSS4.5x4.5x5/16","4.5x4.5x0.312","4.5x4.5",0.312,null,null,null,null,null,null,"Square",16.96,4.99,4.5,4.5,3.5682,3.5682,0.3125,0.313,11.4,11.4,14.2,7.69,6.31,1.69,14.2,7.69,6.31,1.69,23.6,10.9]
["HSS","HSS4.5x4.5x0.250","HSS4.5x4.5x1/4","4.5x4.5x0.250","4.5x4.5",0.25,null,null,null,null,null,null,"Square",13.91,4.09,4.5,4.5,3.75,3.75,0.25,0.25,15,15,12.1,6.43,5.36,1.72,12.1,6.43,5.36,1.72,19.7,8.9700000000000006]
["HSS","HSS4.5x4.5x0.188","HSS4.5x4.5x3/16","4.5x4.5x0.188","4.5x4.5",0.188,null,null,null,null,null,null,"Square",10.7,3.15,4.5,4.5,3.9291999999999998,3.9291999999999998,0.1875,0.188,20.9,20.9,9.6199999999999992,5.05,4.28,1.75,9.6199999999999992,5.05,4.28,1.75,15.4,6.97]
["HSS","HSS4x4x0.500","HSS4x4x1/2","4x4x0.500","4x4",0.5,null,null,null,null,null,null,"Square",21.63,6.36,4,4,2.5,2.5,0.5,0.5,5,5,12.3,8.02,6.15,1.39,12.3,8.02,6.15,1.39,21.8,11.8]
["HSS","HSS4x4x0.375","HSS4x4x3/8","4x4x0.375","4x4",0.375,null,null,null,null,null,null,"Square",17.27,5.08,4,4,2.8762499999999998,2.8762499999999998,0.375,0.375,7.67,7.67,10.7,6.72,5.35,1.45,10.7,6.72,5.35,1.45,18.399999999999999,9.65]
["HSS","HSS4x4x0.312","HSS4x4x5/16","4x4x0.312","4x4",0.312,null,null,null,null,null,null,"Square",14.83,4.3600000000000003,4,4,3.06114,3.06114,0.3125,0.313,9.7799999999999994,9.7799999999999994,9.59,5.91,4.8,1.48,9.59,5.91,4.8,1.48,16.100000000000001,8.39]
["HSS","HSS4x4x0.250","HSS4x4x1/4","4x4x0.250","4x4",0.25,null,null,null,null,null,null,"Square",12.21,3.59,4,4,3.25,3.25,0.25,0.25,13,13,8.2200000000000006,4.97,4.1100000000000003,1.51,8.2200000000000006,4.97,4.1100000000000003,1.51,13.5,6.97]
["HSS","HSS4x4x0.188","HSS4x4x3/16","4x4x0.188","4x4",0.188,null,null,null,null,null,null,"Square",9.42,2.78,4,4,3.4404000000000003,3.4404000000000003,0.1875,0.188,18.3,18.3,6.61,3.92,3.3,1.54,6.61,3.92,3.3,1.54,10.7,5.44]
["HSS","HSS3.5x3.5x0.375","HSS3.5x3.5x3/8","3.5x3.5x0.375","3.5x3.5",0.375,null,null,null,null,null,null,"Square",14.72,4.33,3.5,3.5,2.3737500000000002,2.3737500000000002,0.375,0.375,6.33,6.33,6.74,4.91,3.85,1.25,6.74,4.91,3.85,1.25,11.7,7.12]
["HSS","HSS3.5x3.5x0.312","HSS3.5x3.5x5/16","3.5x3.5x0.312","3.5x3.5",0.312,null,null,null,null,null,null,"Square",12.7,3.74,3.5,3.5,2.5603400000000001,2.5603400000000001,0.3125,0.313,8.18,8.18,6.11,4.3600000000000003,3.49,1.28,6.11,4.3600000000000003,3.49,1.28,10.4,6.24]
["HSS","HSS3.5x3.5x0.250","HSS3.5x3.5x1/4","3.5x3.5x0.250","3.5x3.5",0.25,null,null,null,null,null,null,"Square",10.51,3.09,3.5,3.5,2.75,2.75,0.25,0.25,11,11,5.29,3.69,3.02,1.31,5.29,3.69,3.02,1.31,8.82,5.22]
["HSS","HSS3.5x3.5x0.188","HSS3.5x3.5x3/16","3.5x3.5x0.188","3.5x3.5",0.188,null,null,null,null,null,null,"Square",8.15,2.4,3.5,3.5,2.9327999999999999,2.9327999999999999,0.1875,0.188,15.6,15.6,4.3,2.94,2.46,1.34,4.3,2.94,2.46,1.34,7,4.0999999999999996]
["HSS","HSS3x3x0.375","HSS3x3x3/8","3x3x0.375","3x3",0.375,null,null,null,null,null,null,"Square",12.17,3.58,3,3,1.875,1.875,0.375,0.375,5,5,3.89,3.38,2.6,1.04,3.89,3.38,2.6,1.04,6.89,4.96]
["HSS","HSS3x3x0.312","HSS3x3x5/16","3x3x0.312","3x3",0.312,null,null,null,null,null,null,"Square",10.58,3.11,3,3,2.0595400000000001,2.0595400000000001,0.3125,0.313,6.58,6.58,3.59,3.04,2.39,1.07,3.59,3.04,2.39,1.07,6.22,4.4000000000000004]
["HSS","HSS3x3x0.250","HSS3x3x1/4","3x3x0.250","3x3",0.25,null,null,null,null,null,null,"Square",8.81,2.59,3,3,2.25,2.25,0.25,0.25,9,9,3.16,2.61,2.11,1.1000000000000001,3.16,2.61,2.11,1.1000000000000001,5.35,3.72]
["HSS","HSS3x3x0.188","HSS3x3x3/16","3x3x0.188","3x3",0.188,null,null,null,null,null,null,"Square",6.87,2.02,3,3,2.444,2.444,0.1875,0.188,13,13,2.61,2.1,1.74,1.1299999999999999,2.61,2.1,1.74,1.1299999999999999,4.29,2.95]
["HSS","HSS2.5x2.5x0.312","HSS2.5x2.5x5/16","2.5x2.5x0.312","2.5x2.5",0.312,null,null,null,null,null,null,"Square",8.4499999999999993,2.4900000000000002,2.5,2.5,1.5618700000000001,1.5618700000000001,0.3125,0.313,4.99,4.99,1.88,1.96,1.5,0.86899999999999999,1.88,1.96,1.5,0.86899999999999999,3.33,2.88]
["HSS","HSS2.5x2.5x0.250","HSS2.5x2.5x1/4","2.5x2.5x0.250","2.5x2.5",0.25,null,null,null,null,null,null,"Square",7.11,2.09,2.5,2.5,1.75,1.75,0.25,0.25,7,7,1.69,1.71,1.35,0.9,1.69,1.71,1.35,0.9,2.92,2.4700000000000002]
["HSS","HSS2.5x2.5x0.188","HSS2.5x2.5x3/16","2.5x2.5x0.188","2.5x2.5",0.188,null,null,null,null,null,null,"Square",5.59,1.65,2.5,2.5,1.9364000000000001,1.9364000000000001,0.1875,0.188,10.3,10.3,1.43,1.4,1.1399999999999999,0.93,1.43,1.4,1.1399999999999999,0.93,2.39,1.98]
["HSS","HSS2.25x2.25x0.250","HSS2.25x2.25x1/4","2.25x2.25x0.250","2.25x2.25",0.25,null,null,null,null,null,null,"Square",6.26,1.84,2.25,2.25,1.5,1.5,0.25,0.25,6,6,1.17,1.33,1.04,0.79800000000000004,1.17,1.33,1.04,0.79800000000000004,2.0499999999999998,1.94]
["HSS","HSS2.25x2.25x0.188","HSS2.25x2.25x3/16","2.25x2.25x0.188","2.25x2.25",0.188,null,null,null,null,null,null,"Square",4.96,1.46,2.25,2.25,1.6863600000000001,1.6863600000000001,0.1875,0.188,8.9700000000000006,8.9700000000000006,1,1.1000000000000001,0.89,0.82799999999999996,1,1.1000000000000001,0.89,0.82799999999999996,1.7,1.57]
["HSS","HSS2x2x0.250","HSS2x2x1/4","2x2x0.250","2x2",0.25,null,null,null,null,null,null,"Square",5.41,1.59,2,2,1.25,1.25,0.25,0.25,5,5,0.76900000000000002,1,0.76900000000000002,0.69599999999999995,0.76900000000000002,1,0.76900000000000002,0.69599999999999995,1.36,1.47]
["HSS","HSS2x2x0.188","HSS2x2x3/16","2x2x0.188","2x2",0.188,null,null,null,null,null,null,"Square",4.32,1.27,2,2,1.43632,1.43632,0.1875,0.188,7.64,7.64,0.67,0.84099999999999997,0.67,0.72599999999999998,0.67,0.84099999999999997,0.67,0.72599999999999998,1.1499999999999999,1.21]
["HSS","HSS1.5x1.5x0.250","HSS1.5x1.5x1/4","1.5x1.5x0.250","1.5x1.5",0.25,null,null,null,null,null,null,"Square",3.71,1.0900000000000001,1.5,1.5,0.75,0.75,0.25,0.25,3,3,0.26300000000000001,0.48099999999999998,0.35,0.49099999999999999,0.26300000000000001,0.48099999999999998,0.35,0.49099999999999999,0.47699999999999998,0.72099999999999997]
["HSS","HSS1.5x1.5x0.188","HSS1.5x1.5x3/16","1.5x1.5x0.188","1.5x1.5",0.188,null,null,null,null,null,null,"Square",3.04,0.89600000000000002,1.5,1.5,0.93624000000000007,0.93624000000000007,0.1875,0.188,4.9800000000000004,4.9800000000000004,0.24399999999999999,0.42399999999999999,0.32500000000000001,0.52200000000000002,0.24399999999999999,0.42399999999999999,0.32500000000000001,0.52200000000000002,0.43099999999999999,0.622]
[]
[null,null,null,null,null,null,null,null,null,null,null,null,null," "," "]

{"sheet":"Comparisons","index":9,"n_rows":48,"n_cols":16,"rows_kept":48,"cut":false,"hidden":true,"merged":[]}
[]
[]
[]
[]
[null,"Me","AISC"]
["F.6",7.20344193719286,7.2]
["F.7",59.7,59.7]
["F.7B",59.7,59.7]
["F.8A",45.7,46.3]
["F.8B",45.7,45.4]
[]
[]
[]
[]
["500,Gr. C"]
["34x10x1"]
[0.1,3429,3430]
[20,2698,2700]
[40,1312,1310]
[null,null,null,null,"ɸtTYn",null,"ɸtuTUn",null,"ɸbMn = Mcx",null,"ɸbMn = Mcy",null,"ɸvVnx",null,"ɸvVny"]
["20x8x0.3125",null,null,null,"Me","AISC","Me","AISC","Me","AISC","Me","AISC","Me","AISC","Me","AISC"]
[0.1,501,510,{"$f":"+(C22-B22)/C22","v":1.7647058823529412E-2},706,707,547.53749999999991,548,362.70631067388661,363,121.71666031006285,122,271,271,112.04082000000001,112]
[20,388,393,{"$f":"+(C23-B23)/C23","v":1.2722646310432569E-2}]
[40,185,185,{"$f":"+(C24-B24)/C24","v":0}]
[]
[]
[]
[]
[]
["12x10x0.25"]
[0.1,368,372,{"$f":"+(C31-B31)/C31","v":1.0752688172043012E-2},"ɸtTYn",null,"ɸtuTUn",null,"ɸbMn = Mcx",null,"ɸbMn = Mcy",null,"ɸvVnx",null,"ɸvVny"]
[20,313,314,{"$f":"+(C32-B32)/C32","v":3.1847133757961785E-3},"Me","AISC","Me","AISC","Me","AISC","Me","AISC","Me","AISC","Me","AISC"]
[40,161,161,{"$f":"+(C33-B33)/C33","v":0},446,446,345,345,125,127,104,105,142,142,117,117]
[]
[]
[]
["2.5 x 2.5 x 0.1875"]
[0.1,69.3,69.3,{"$f":"+(C38-B38)/C38","v":0},"ɸtTYn",null,"ɸtuTUn",null,"ɸbMn = Mcx",null,"ɸbMn = Mcy",null,"ɸvVnx",null,"ɸvVny"]
[8,32.700000000000003,32.200000000000003,{"$f":"+(C39-B39)/C39","v":-1.5527950310559004E-2},"Me","AISC","Me","AISC","Me","AISC","Me","AISC","Me","AISC","Me","AISC"]
[15,9.43,9.43,{"$f":"+(C40-B40)/C40","v":0},69.3,69.3,53.7,53.7,4.95,4.95,4.95,4.95,18.600000000000001,18.600000000000001,18.600000000000001,18.600000000000001]
[]
[]
[]
[]
["5x5x0.125"]
[0.1,89.8,89.8,{"$f":"+(C46-B46)/C46","v":0},"ɸtTYn",null,"ɸtuTUn",null,"ɸbMn = Mcx",null,"ɸbMn = Mcy",null,"ɸvVnx",null,"ɸvVny"]
[16,50.8,50.8,{"$f":"+(C47-B47)/C47","v":0},"Me","AISC","Me","AISC","Me","AISC","Me","AISC","Me","AISC","Me","AISC"]
[32,13.5,13.5,{"$f":"+(C48-B48)/C48","v":0},100.4,100,77.8,77.8,12.5,12.3,12.5,12.3,29.1,29.1,29.1,29.1]