{"text_format":"1","workbook":"xlsx","n_sheets":10,"sheets":["ReadMe","HSS_Member","HSS_Section_Properties","HSS_Axial_Calculations","HSS_Bending_Calculations","HSS_Tension,_Shear","HSS_Torsion_Calculations","HSS500_Database","HSS1085_Database","Comparisons"],"not_rendered":{"charts":0,"images":1,"macros":1,"external_links":0,"defined_names":115,"comments":0,"pivot_tables":0},"unopened":[],"bounds":{"document_bytes":16777216,"sheet_cells":100000,"rows_first":2000,"rows_last":500,"rows_between":2000,"halvings":0,"cell_chars":16384,"cell_head_chars":4096},"cells_cut":0,"cells_raw":0,"read":"whole","date_system":"1900"}

{"sheet":"ReadMe","index":0,"n_rows":57,"n_cols":2,"rows_kept":57,"cut":false,"hidden":false,"merged":[]}
[null,"HSS Sections - Rectangular and Square - LRFD"]
[null,"AISC 360-22"]
[null,"Norman R. Mahan, PE.                                                                                                                 Ver. 2.0 - 3/19/2025"]
[null,"Overview"]
[null,"TraditionBS"]
[1,"This workbook was originally developed to analyze HSS sections used as crane columns.  The eccentricity"]
[null,"   of the crane load at the top of the column was to be account for.  "]
[null,"   As time went on it became clear that the analysis of HSS beam sections could be incorporated.  It finally"]
[null,"   became a complete analysis spreadsheet for HSS sections, equivalent to the available strength tables"]
[null,"   in the AISC manual.  No deflections are analyzed.  "]
[]
[{"$f":"+A6+1","v":2},"   It computes the available strength of HSS sections, obtaining the values of ɸcPn, ɸbMnx, "]
[null,"      ɸbMny, ɸtTyn, ɸtuTUn, ɸtorTort, ɸtorTorny,ɸvVx, and ɸvVy, in accordance with AISC 360-22."]
[null,"       All HSS sections in the AISC Shapes Database, V16.0 are included, including ASTM 1085 sections."]
[]
[{"$f":"+A12+1","v":3},"The workbook consists of 8 sheets and this 'ReadMe' sheet.  'HSS_Member' is the only sheet with which the user interacts.  All sheets are protected, with the necessary input cells on 'HSS_Member' unprotected.  Almost all calculations are done on the other sheets.  Two of the other sheets are:  HSS_Database and 1085HSS_Database.  These are subsets of 'aisc-shapes-database-v16.0' and 'aisc-shapes-database-v16.0_a1085.'  Columns of these two sheets haved been named within Excel to allow quick access to the data within the databases.   "]
[]
[{"$f":"+A16+1","v":4},"The sheet 'HSS_Section_Properties' retrieves the necessary section properties for the input section from the appropriate database.  If the section is 'Slender' or requires adjustment of the full section properites for some reason it is done on this sheet."]
[]
[{"$f":"+A18+1","v":5},"HSS Axial Calculations', 'HSS Bending Calculations', 'HSS Torsion Calculations', and 'HSS Tension, Shear' sheets compute the values accordingly.  At the top of each page (take Axial for example) is the governing value (Pn and ɸcPn)."]
{"$rows_left_out":38}
{"sheet":"HSS_Member","index":1,"n_rows":72,"n_cols":15,"rows_kept":72,"cut":false,"hidden":false,"merged":[]}
[null,null,"HSS Sections - Rectangular and Square - LRFD",null,null,null,null,null,"Ver. 2.0",null," "]
[" ",null,null,null,"AISC 360-22",null,null,null,null,null,null,null,{"$f":"INDEX(HSS500_Database!$H$4:$H$82, $K$6)","v":"8x8"}]
["8x8x1/2 section",null,null,null,"Test section",null,null,null,{"$f":"TODAY()","v":"2025-03-25"},null,null,null,{"$f":"INDEX(HSS500_Database!$I$4:$I$12,$K$7)","v":0}]
["  Square=>",null,"<==Rectangle",null,null," ",null,null,null,null,null,"Work area:"," "," "]
[null,"Square",2,null,null,null,null,null,"500, Gr. C",null,"index:",null,"Size:"]
[null,"HSS 500, Gr. C","Fy","Fu",null,null,"500, Gr. B","500, Gr. C","1085, Gr. A"," ",9,"<=Seq in H",{"$f":"INDEX(HSS500_Database!$H4:$H82, $K$6)","v":"8x8"},{"$f":"M6 &\"x\"&IF(M7=1,TEXT(M7,\"0\"),TEXT(M7,\"0.000\"))","v":"8x8x0.000"}]
[null,"8x8x0.500",50,62,"  <== ksi ==>",null,"46, 58","50, 62","50, 65"," ",2,"<=Seq in T",{"$f":"INDEX(HSS500_Database!$I4:$I14, $K$7)","v":0},null," "]
["Insert",null,null,null,null,null,null," ","(Full Prop.)"]
["Compression",null,null,null,null," ","Flexure"]
["                          All input forces to be factored forces.",null,null,null,null,null,null,0]
[" ",null,null," "," ",null,null,null,"No"]
["LL",0,"kips",null,null,null,null,null,"Crane force"]
["DL",0,"kips",null," ",null,null,null,"eccentricity?"]
["Total - Pn",{"$f":"B12+B13","v":0},"kips",null,"Mrx",50,"kip-ft",null,"      Y    N"]
[null,null,null,null,null,null,"in          <==","e to col flg centerline"]
[null,{"$f":"IF(B20>200, \"L/r > 200\", \"\")","v":""},{"$f":"IF(C20>200, \"L/r > 200\", \"\")","v":""},null,null,null,"kip-ft    <==","crane load Mx"]
[null,"X-axis","Y-axis","Z-axis","Total - Mrx",{"$f":"+F14+F16","v":50},"kip-ft"]
["k",1,1,1,"Mry",0,"kip-ft"]
["Lc",20,20,20,"Lb",20,"ft"]
["Lc/r",{"$f":"+B18*B19*12/rx","v":78.94736842105263},{"$f":"+C18*C19*12/ry","v":78.94736842105263},"Lcz <= Lcy"]
{"$rows_left_out":53}
{"sheet":"HSS_Section_Properties","index":2,"n_rows":114,"n_cols":16,"rows_kept":114,"cut":false,"hidden":false,"merged":[]}
[null,null,"HSS Sections - Rectangular and Square - LRFD",null,null,null,null,null,{"$f":"+HSS_Member!I1","v":"Ver. 2.0"}]
[" ",null,null,null,"AISC 360-22"]
[{"$f":"+HSS_Member!A3","v":"8x8x1/2 section"},null,null,null,{"$f":"+HSS_Member!E3","v":"Test section"},null,null,null,{"$f":"TODAY()","v":"2025-03-25"}]
[null,null,null," ",null," "]
["HSS Properties","ASTM",null,"HSS type:",null,"Depth","Width"]
[{"$f":"+Member","v":"8x8x0.500"},{"$f":"+HSS_Member!B6","v":"HSS 500, Gr. C"},null,{"$f":"IF(F6=G6, \"Square\", \"Rectangular\")","v":"Square"},null,{"$f":"LEFT(I22,SEARCH(\"x\",I22)-1)","v":"8"},{"$f":"LEFT(J22,SEARCH(\"x\",J22)-1)","v":"8"},"in"]
[null,null,null,null,null,null,null,null,null,null,null,null," ",null,null," "]
[{"$f":"\"HSS \"&$A$6 & \" section properties\"","v":"HSS 8x8x0.500 section properties"}]
["Area","Depth","Width","h","b","t","h/t","b/t","J","C"]
["in^2","in","in","in","in","in"," "," ","in^4","in^6"]
[{"$f":"INDEX(hss500_area,MATCH($A$6,hss500_hss,0))","v":13.5},{"$f":"INDEX(hss500_depth,MATCH($A$6, hss500_hss,0))","v":8},{"$f":"INDEX(hss500_width,MATCH($A$6, hss500_hss,0))","v":8},{"$f":"_xlfn.SINGLE(INDEX(hss500_h,MATCH($A$6, hss500_hss,0)))","v":6.6},{"$f":"_xlfn.SINGLE(INDEX(hss500_b,MATCH($A$6, hss500_hss,0)))","v":6.6},{"$f":"_xlfn.SINGLE(INDEX(hss500_tdes,MATCH($A$6, hss500_hss,0)))","v":0.46500000000000002},{"$f":"INDEX(hss500_h_t,MATCH($A$6, hss500_hss,0))","v":14.2},{"$f":"INDEX(hss500_b_t,MATCH($A$6, hss500_hss,0))","v":14.2},{"$f":"_xlfn.SINGLE(INDEX(hss500_j,MATCH($A$6, hss500_hss,0)))","v":204},{"$f":"_xlfn.SINGLE(INDEX(hss500_c,MATCH($A$6, hss500_hss,0)))","v":52.4},null,null,null," "]
[null,null,null,null,null,null," "," "]
["Ix","Sx","rx","Zx","Iy","Sy","ry","Zy"]
["in^4","in^3","in","in^3","in^4","in^3","in","in^3"]
[{"$f":"_xlfn.SINGLE(INDEX(hss500_ix,MATCH($A$6, hss500_hss,0)))","v":125},{"$f":"_xlfn.SINGLE(INDEX(hss500_sx,MATCH($A$6, hss500_hss,0)))","v":31.2},{"$f":"_xlfn.SINGLE(INDEX(hss500_rx,MATCH($A$6, hss500_hss,0)))","v":3.04},{"$f":"_xlfn.SINGLE(INDEX(hss500_zx,MATCH($A$6, hss500_hss,0)))","v":37.5},{"$f":"_xlfn.SINGLE(INDEX(hss500_iy,MATCH($A$6, hss500_hss,0)))","v":125},{"$f":"_xlfn.SINGLE(INDEX(hss500_sy,MATCH($A$6, hss500_hss,0)))","v":31.2},{"$f":"_xlfn.SINGLE(INDEX(hss500_ry,MATCH($A$6, hss500_hss,0)))","v":3.04},{"$f":"_xlfn.SINGLE(INDEX(hss500_zy,MATCH($A$6, hss500_hss,0)))","v":37.5},null,null,null,null," "]
[]
["Lp","Lr","Weight",null,null,null,null,null,null,null,null,null," "]
["ft","ft","lbs/ft",null,null,null,null,null,null,"sqrt(E/Fy)"]
[{"$f":"0.13*E*ry*((SQRT(j*area))/(HSS_Bending_Calculations!C22*12))/12","v":26.730949390577205},{"$f":"((SQRT(j*area)/(0.7*Fy*Sx))*2*E*ry)/12","v":706.12186682632102},{"$f":"_xlfn.SINGLE(INDEX(hss500_weight,MATCH($A$6,hss500_hss,0)))","v":48.85},null,null," ",null,null,null,{"$f":"SQRT(E/Fy)","v":24.083189157584592}]
["Eq. F7-10","Eq. F7-11",null,null,null,null,null,null,null," "]
{"$rows_left_out":95}
{"sheet":"HSS_Axial_Calculations","index":3,"n_rows":61,"n_cols":11,"rows_kept":61,"cut":false,"hidden":false,"merged":[]}
[null,null,"HSS Sections - Rectangular and Square - LRFD",null,null,null,null,null,{"$f":"+HSS_Member!I1","v":"Ver. 2.0"}]
[" ",null,null,null,"AISC 360-22"]
[{"$f":"+HSS_Member!A3","v":"8x8x1/2 section"},null,null,null,{"$f":"+HSS_Member!E3","v":"Test section"},null,null,null,{"$f":"TODAY()","v":"2025-03-25"}]
[null,null,null," ",null," "]
["HSS Axial","ASTM"]
[{"$f":"+Member","v":"8x8x0.500"},{"$f":"+HSS_Member!B6","v":"HSS 500, Gr. C"}]
[null,null,"Pn",{"$f":"IF(B10<> \"Slender\",D23,D58)","v":427.94507752831652}]
[null,null,"ɸcPn",{"$f":"phi_c*D7","v":385.15056977548488},"kips"," "]
[]
["Section is:",{"$f":"+HSS_Section_Properties!I32","v":"Nonslender"}]
["HSS Section:","Elements are stiffened"]
[]
[null,null,"Max Lc/r",{"$f":"MAX(HSS_Member!B20,HSS_Member!C20)","v":78.94736842105263}]
[null,null,"sqrt(E/Fy)",{"$f":"+sqrtefy","v":24.083189157584592},null,null,null,null," "]
[null,null,"Fe = π^2*E/(Lc/r)^2",{"$f":"pi^2*E/D13^2","v":45.922095077990619},"ksi",null,null,"E3-4"," "]
[]
["E3 - Flexural buckling of members without slender elements"]
[null,null,"Pn = FnAg",null,null,null,null,"E3-1"]
[null,null,"4.71*sqrt(E/Fy)",{"$f":"4.71*D14","v":113.43182093222343}]
[null,null,"Fn = [0.658^(Fy/Fe)]Fy",{"$f":"(0.658^(Fy/D15))*Fy","v":31.699635372467888},"ksi",null,null,"E3-2"," "," "," "]
{"$rows_left_out":42}
{"sheet":"HSS_Bending_Calculations","index":4,"n_rows":77,"n_cols":11,"rows_kept":77,"cut":false,"hidden":false,"merged":[]}
[null,null,"HSS Sections - Rectangular and Square - LRFD",null,null,null,null,null,{"$f":"+HSS_Member!I1","v":"Ver. 2.0"}]
[" ",null,null,null,"AISC 360-22"]
[{"$f":"+HSS_Member!A3","v":"8x8x1/2 section"},null,null,null,{"$f":"+HSS_Member!E3","v":"Test section"},null,null,null,{"$f":"TODAY()","v":"2025-03-25"}]
[null,null,null," ",null," "]
["HSS Bending","ASTM"]
[{"$f":"+Member","v":"8x8x0.500"},{"$f":"+HSS_Member!B6","v":"HSS 500, Gr. C"}]
[null," ",null,"Mnx",{"$f":"MIN(E13:E14,IF(HSS_Member!B5 = \"Square\",C77,100000))","v":156.25},"kip-ft"]
[null,null,null,"ɸbMnx",{"$f":"phi_b*E7","v":140.625},"kip-ft"]
[null,null,null,"Mny",{"$f":"MIN(E16:E17)","v":156.25},"kip-ft"]
[null,null,null,"ɸbMny",{"$f":"phi_b*E9","v":140.625},"kip-ft"]
[]
["For X-axis bending:",null,null,"X-axis:"]
["Flanges:",{"$f":"+HSS_Section_Properties!C42","v":"Compact"},null,"Flange:",{"$f":"IF($B$13=\"Compact\",$C$22,IF($B$13 = \"Noncompact\",$C$36,IF($B$13 = \"Slender\",$C$41)))","v":156.25},"kip-ft"]
["Web:",{"$f":"+HSS_Section_Properties!C57","v":"Compact"},null,"Web:",{"$f":"IF(B14= \"Compact\",\"NA\",C54)","v":"NA"},"kip-ft"]
["For Y-axis bending:",null,null,"Y-axis:"]
["Flanges:",{"$f":"+HSS_Section_Properties!G42","v":"Compact"},null,"Flange:",{"$f":"IF(B16=\"Compact\",F22,IF(B16 = \"Noncompact\",F36,IF(B16= \"Slender\",F41)))","v":156.25},"kip-ft"]
["Web:",{"$f":"+HSS_Section_Properties!G57","v":"Compact"},null,"Web:",{"$f":"IF(B17=\"Compact\", \"NA\",F54)","v":"NA"},"kip-ft"]
[]
["F7. Square and Rectangular HSS and Box-shaped members"]
[null,"X - axis bending",null,null,null,"Y - axis bending"]
{"$rows_left_out":58}
{"sheet":"HSS_Tension,_Shear","index":5,"n_rows":34,"n_cols":9,"rows_kept":34,"cut":false,"hidden":false,"merged":[]}
[null,null,"HSS Sections - Rectangular and Square - LRFD",null,null,null,null,null,{"$f":"+HSS_Member!I1","v":"Ver. 2.0"}]
[" ",null,null,null,"AISC 360-22"]
[{"$f":"+HSS_Member!A3","v":"8x8x1/2 section"},null,null,null,{"$f":"+HSS_Member!E3","v":"Test section"},null,null,null,{"$f":"TODAY()","v":"2025-03-25"}]
[null,null,null," ",null," "]
["HSS Tension, Shear","ASTM"]
[{"$f":"+Member","v":"8x8x0.500"},{"$f":"+HSS_Member!B6","v":"HSS 500, Gr. C"}]
[]
[null,"Vnx",{"$f":"+C24","v":184.14},"kips"," TYn",{"$f":"+C30","v":675},"kips"]
[null,"ɸvVnx",{"$f":"+phi_v*C8","v":165.726},"kips","ɸtTYn",{"$f":"+phi_t*F8","v":607.5},"kips"]
[null,"Vny",{"$f":"+E24","v":184.14},"kips","TUn",{"$f":"+C34","v":627.75},"kips"]
[null,"ɸvVny",{"$f":"phi_v*C10","v":165.726},"kips","ɸtuTUn",{"$f":"phi_tu*F10","v":470.8125},"kips"]
["Shear",null,null,null,null,null," "]
["Vn = 0.6FyAwCv2",null,null,null,null,null,"G4-1"]
[null,null,"X-axis",null,"Y-axis"]
[null,"Aw = 2ht",{"$f":"2*h*t","v":6.1379999999999999},"in^2",{"$f":"2*b*t","v":6.1379999999999999},"in^2"]
[null,"kv",5,null,5]
[null,"1.10sqrt(kvE/Fy)",{"$f":"1.1*SQRT($C$16*E/Fy)","v":59.236812878479547},null,{"$f":"+C17","v":59.236812878479547}]
[null,"1.37sqrt(kvE/Fy)",{"$f":"1.37*SQRT($C$16*E/Fy)","v":73.776757857742709},null,{"$f":"+C18","v":73.776757857742709}]
[null,"h/t",{"$f":"+h_t","v":14.2},null,{"$f":"+b_t","v":14.2}]
[null,"Cv2 = 1.0",1,null,{"$f":"+C20","v":1},null,"G2-9"]
{"$rows_left_out":15}
{"sheet":"HSS_Torsion_Calculations","index":6,"n_rows":22,"n_cols":9,"rows_kept":22,"cut":false,"hidden":false,"merged":[]}
[null,null,"HSS Sections - Rectangular and Square - LRFD",null,null,null,null,null,{"$f":"+HSS_Member!I1","v":"Ver. 2.0"}]
[" ",null,null,null,"AISC 360-22"]
[{"$f":"+HSS_Member!A3","v":"8x8x1/2 section"},null,null,null,{"$f":"+HSS_Member!E3","v":"Test section"},null,null,null,{"$f":"TODAY()","v":"2025-03-25"}]
[null,null,null," ",null," "]
["HSS Torsion Calculations"]
["Member","ASTM"]
[{"$f":"+Member","v":"8x8x0.500"},{"$f":"+HSS_Section_Properties!B6","v":"HSS 500, Gr. C"}]
[]
[]
[null,null,"TORn",{"$f":"+D22","v":131}]
[null,null,"ɸTTORn",{"$f":"phi_c*D10","v":117.9},"kips"]
[]
["1. Round and rectangular HSS subject to torsion"]
[null,"Tn = FcrC",null,null,null,null,"H3-1"]
[null,null,"C",{"$f":"+Cw","v":52.4},"in^3"]
[null,null,"2.45sqrt(E/Fy)",{"$f":"2.45*sqrtefy","v":59.003813436082254}]
[null,null,"3.07sqrt(E/Fy)",{"$f":"3.07*sqrtefy","v":73.935390713784699}]
[null,null,"0.6Fy ",{"$f":"0.6*Fy","v":30},"ksi",null,"H3-3"]
[null,null,"0.6Fy(2.45sqrt(E/Fy))/(h/t)",{"$f":"0.6*Fy*(2.45*sqrtefy)/h_t","v":124.65594387904702},"ksi",null,"H3-4"]
[null,null,"0.458π^2E/(h/t)^2",{"$f":"0.458*pi^2*E/(h/t)^2","v":650.69957386696228},"ksi",null,"H3-5"]
{"$rows_left_out":3}
{"sheet":"HSS500_Database","index":7,"n_rows":529,"n_cols":33,"rows_kept":529,"cut":false,"hidden":false,"merged":[]}
["Type","EDI_Std_Nomenclature","AISC_Manual_Label",null,null,null,null,3,null,null,null,null," ","W","A","Ht","h","B","b","tnom","tdes","b/tdes","h/tdes","Ix","Zx","Sx","rx","Iy","Zy","Sy","ry","J","C"]
[null,null,null,"hss_hss","Size","Thickness","Unique","Member","Thickness","Different","t start row","t end row","Sq/Rect","weight","area","depth","h","width","b","tnom","tdes","b_t","h_t","Ix","Zx","Sx","rx","Iy","Zy","Sy","ry","J","C"]
[null,null,null,"Strip HSS",null,null,"sizes",null,null,"thicknesses",null,null,null,"lbs/ft^2","in^2","in","in","in","in","in","in",null,null,"in^4","in^4","in^3","in","in^4","in^4","in^3","in","in^4","in^6"]
["HSS","HSS34x10x1","HSS34x10x1","34x10x1","34x10","1","34x10","22x22",null,4,4,7,"Rectangle",277.07,76.2,34,31.2,10,"7.21",1,0.93,7.75,33.6,9600,750,565,11.2,1340,307,268,4.1900000000000004,4040,555]
["HSS","HSS34x10x0.875","HSS34x10x7/8","34x10x0.875","34x10","0.875","30x10","20x20",null,5,8,12,"Rectangle",244.88,67.3,34,31.6,10,"7.56",0.875,0.81399999999999995,9.2899999999999991,38.799999999999997,8600,668,506,11.3,1210,274,242,4.24,3630,494]
["HSS","HSS34x10x0.750","HSS34x10x3/4","34x10x0.750","34x10","0.750","24x20","18x18",null,5,13,17,"Rectangle",212,58.2,34,31.9,10,"7.91",0.75,0.69799999999999995,11.3,45.7,7550,582,444,11.4,1070,240,215,4.29,3190,431]
["HSS","HSS34x10x0.625","HSS34x10x5/8","34x10x0.625","34x10","0.625","24x18","16x16",null,5,18,22,"Rectangle",178.41,48.9,34,32.299999999999997,10,"8.26",0.625,0.58099999999999996,14.2,55.5,6430,493,378,11.5,924,205,185,4.3499999999999996,2720,365]
["HSS","HSS30x10x1","HSS30x10x1","30x10x1","30x10","1","24x16","14x14",null,5,23,27,"Rectangle",249.85,68.7,30,27.2,10,"7.21",1,0.93,7.75,29.3,6900,606,460,10,1180,273,237,4.1500000000000004,3460,487]
["HSS","HSS30x10x0.875","HSS30x10x7/8","30x10x0.875","30x10","0.875","24x14","12x12",null,6,28,33,"Rectangle",221.06,60.8,30,27.6,10,"7.56",0.875,0.81399999999999995,9.2899999999999991,33.9,6190,540,413,10.1,1070,245,215,4.2,3110,434]
["HSS","HSS30x10x0.750","HSS30x10x3/4","30x10x0.750","30x10","0.750","24x12","10x10",null,8,34,41,"Rectangle",191.58,52.6,30,27.9,10,"7.91",0.75,0.69799999999999995,11.3,40,5440,471,363,10.199999999999999,952,215,190,4.25,2730,379]
["HSS","HSS30x10x0.625","HSS30x10x5/8","30x10x0.625","30x10","0.625","24x8","9x9",null,4,42,45,"Rectangle",161.4,44.3,30,28.3,10,"8.26",0.625,0.58099999999999996,14.2,48.6,4640,400,310,10.199999999999999,820,183,164,4.3099999999999996,2330,321]
["HSS","HSS30x10x0.500","HSS30x10x1/2","30x10x0.500","30x10","0.500","22x20","8x8",null,5,46,50,"Rectangle",130.52000000000001,35.799999999999997,30,28.6,10,"8.61",0.5,0.46500000000000002,18.5,61.5,3810,326,254,10.3,679,149,136,4.3600000000000003,1910,262]
["HSS","HSS24x20x0.750","HSS24x20x3/4","24x20x0.750","24x20","0.750","22x18","7x7",null,5,51,55,"Rectangle",212,58.2,24,21.9,20,"17.9",0.75,0.69799999999999995,25.7,31.4,4960,489,413,9.23,3750,432,375,8.02,6740,627]
["HSS","HSS24x20x0.625","HSS24x20x5/8","24x20x0.625","24x20","0.625","22x16","6x6",null,6,56,61,"Rectangle",178.41,48.9,24,22.3,20,"18.3",0.625,0.58099999999999996,31.4,38.299999999999997,4220,413,351,9.2899999999999991,3190,365,319,8.08,5690,528]
["HSS","HSS24x20x0.500","HSS24x20x1/2","24x20x0.500","24x20","0.500","22x14","5.5x5.5",null,6,62,67,"Rectangle",144.13,39.5,24,22.6,20,"18.6",0.5,0.46500000000000002,40,48.6,3450,336,287,9.34,2610,297,261,8.1300000000000008,4620,427]
["HSS","HSS24x20x0.375","HSS24x20x3/8","24x20x0.375","24x20","0.375","22x10","5x5",null,5,68,72,"Rectangle",109.15,29.9,24,23,20,"19.0",0.375,0.34899999999999998,54.3,65.8,2640,256,220,9.4,2000,226,200,8.19,3510,324]
["HSS","HSS24x20x0.313","HSS24x20x5/16","24x20x0.313","24x20","0.313","20x16","4.5x4.5",null,6,73,78,"Rectangle",91.39,25.1,24,23.1,20,"19.1",0.3125,0.29099999999999998,65.7,79.5,2230,215,186,9.43,1690,190,169,8.2100000000000009,2950,272]
["HSS","HSS24x18x0.750","HSS24x18x3/4","24x18x0.750","24x18","0.750","20x12","4x4",null,7,79,85,"Rectangle",201.79,55.4,24,21.9,18,"15.9",0.75,0.69799999999999995,22.8,31.4,4580,456,382,9.09,2940,375,327,7.29,5690,562]
["HSS","HSS24x18x0.625","HSS24x18x5/8","24x18x0.625","24x18","0.625","20x8","3.5x3.5",null,7,86,92,"Rectangle",169.91,46.6,24,22.3,18,"16.3",0.625,0.58099999999999996,28,38.299999999999997,3900,386,325,9.15,2510,318,279,7.34,4810,473]
["HSS","HSS24x18x0.500","HSS24x18x1/2","24x18x0.500","24x18","0.500","20x6","3x3",null,5,93,97,"Rectangle",137.32,37.6,24,22.6,18,"16.6",0.5,0.46500000000000002,35.700000000000003,48.6,3190,314,266,9.2100000000000009,2060,258,229,7.39,3910,383]
{"$rows_left_out":510}
{"sheet":"HSS1085_Database","index":8,"n_rows":483,"n_cols":33,"rows_kept":483,"cut":false,"hidden":false,"merged":[]}
["Type","EDI_Std_Nomenclature","AISC_Manual_Label","Column1","Column2","Column3","Column4","Column5","Column6","Column7","Column8","Column9","Column10","W","A","Depth","Width","Added to database",null,"tnom","tdes","b/tdes","h/tdes","Ix","Zx","Sx","rx","Iy","Zy","Sy","ry","J","C"]
[null,null,null,"hss1085_hss","Size","Thickness","Unique ","Member ","Thickness","Different","t start row","t end row","Sq/rect","weight","area","depth","width","h","b","tnom","tdes","b_t","h_t","Ix","Zx","Sx","rx","Iy","Zy","Sy","ry","J","C"]
[null,null,null,null,null,null,"sizes",null,null,"thicknesses",null,null,null,"lbs/ft^2","in^2","in","in","in","in","in","in",null," ","in^4","in^4","in^3","in","in^4","in^4","in^3","in","in^4","in^6"]
["HSS","HSS34x10x1","HSS34x10x1","34x10x1","34x10",1,"34x10",null,null,4,4,{"$f":"+K4+J4-1","v":7},"Rectangular",277.07,81.400000000000006,34,10,{"$f":"W4*U4","v":31},{"$f":"V4*U4","v":7},1,1,7,31,10200,799,599,11.2,1410,326,282,4.16,4280,590]
["HSS","HSS34x10x0.875","HSS34x10x7/8","34x10x0.875","34x10",0.875,"30x10",null,null,5,{"$f":"+L4+1","v":8},{"$f":"+K5+J5-1","v":12},"Rectangular",244.88,72,34,10,{"$f":"W5*U5","v":31.412499999999998},{"$f":"V5*U5","v":7.3762499999999998},0.875,0.875,8.43,35.9,9130,712,537,11.3,1280,292,256,4.22,3850,526]
["HSS","HSS34x10x0.750","HSS34x10x3/4","34x10x0.750","34x10",0.75,"24x20",null,null,5,{"$f":"+L5+1","v":13},{"$f":"+K6+J6-1","v":17},"Rectangular",212,62.3,34,10,31.724999999999998,7.7250000000000005,0.75,0.75,10.3,42.3,8030,621,472,11.4,1140,256,228,4.2699999999999996,3390,460]
["HSS","HSS34x10x0.625","HSS34x10x5/8","34x10x0.625","34x10",0.625,"24x18",null,null,5,18,22,"Rectangular",178.41,52.4,34,10,32.125,8.125,0.625,0.625,13,51.4,6850,527,403,11.4,981,218,196,4.33,2900,390]
["HSS","HSS30x10x1","HSS30x10x1","30x10x1","30x10",1,"24x16",null,null,5,23,27,"Rectangular",249.85,73.400000000000006,30,10,27,7,1,1,7,27,7300,644,487,9.9700000000000006,1250,290,250,4.12,3660,518]
["HSS","HSS30x10x0.875","HSS30x10x7/8","30x10x0.875","30x10",0.875,"24x14",null,null,6,28,33,"Rectangular",221.06,65,30,10,27.387499999999999,7.3762499999999998,0.875,0.875,8.43,31.3,6570,575,438,10.1,1130,260,226,4.18,3290,463]
["HSS","HSS30x10x0.750","HSS30x10x3/4","30x10x0.750","30x10",0.75,"24x12",null,null,8,34,41,"Rectangular",191.58,56.3,30,10,27.75,7.7250000000000005,0.75,0.75,10.3,37,5780,502,386,10.1,1010,228,202,4.2300000000000004,2900,404]
["HSS","HSS30x10x0.625","HSS30x10x5/8","30x10x0.625","30x10",0.625,"24x8",null,null,4,42,45,"Rectangular",161.4,47.4,30,10,28.125,8.125,0.625,0.625,13,45,4950,427,330,10.199999999999999,871,195,174,4.29,2480,343]
["HSS","HSS30x10x0.500","HSS30x10x1/2","30x10x0.500","30x10",0.5,"22x20",null,null,5,46,50,"Rectangular",130.52000000000001,38.4,30,10,28.5,8.5,0.5,0.5,17,57,4070,348,271,10.3,723,160,145,4.34,2040,280]
["HSS","HSS24x20x0.750","HSS24x20x3/4","24x20x0.750","24x20",0.75,"22x18",null,null,5,51,55,"Rectangular",212,62.3,24,20,21.75,17.774999999999999,0.75,0.75,23.7,29,5280,521,440,9.1999999999999993,3990,461,399,8,7200,670]
["HSS","HSS24x20x0.625","HSS24x20x5/8","24x20x0.625","24x20",0.625,"22x16",null,null,6,56,61,"Rectangular",178.41,52.4,24,20,22.125,18.125,0.625,0.625,29,35.4,4500,442,375,9.26,3400,391,340,8.06,6090,565]
["HSS","HSS24x20x0.500","HSS24x20x1/2","24x20x0.500","24x20",0.5,"22x14",null,null,6,62,67,"Rectangular",144.13,42.4,24,20,22.5,18.5,0.5,0.5,37,45,3680,360,307,9.33,2790,318,279,8.1199999999999992,4950,458]
["HSS","HSS24x20x0.375","HSS24x20x3/8","24x20x0.375","24x20",0.375,"22x10",null,null,5,68,72,"Rectangular",109.15,32.1,24,20,22.875,18.862499999999997,0.375,0.375,50.3,61,2830,274,236,9.39,2140,243,214,8.17,3770,348]
["HSS","HSS24x20x0.312","HSS24x20x5/16","24x20x0.312","24x20",0.312,"20x16",null,null,6,73,78,"Rectangular",91.39,26.9,24,20,23.068100000000001,19.061699999999998,0.3125,0.313,60.9,73.7,2390,231,199,9.42,1810,204,181,8.1999999999999993,3170,292]
["HSS","HSS24x18x0.750","HSS24x18x3/4","24x18x0.750","24x18",0.75,"20x12",null,null,7,79,85,"Rectangular",201.79,59.3,24,18,21.75,15.75,0.75,0.75,21,29,4870,487,406,9.06,3130,400,348,7.26,6070,600]
["HSS","HSS24x18x0.625","HSS24x18x5/8","24x18x0.625","24x18",0.625,"20x8",null,null,7,86,92,"Rectangular",169.91,49.9,24,18,22.125,16.125,0.625,0.625,25.8,35.4,4160,413,347,9.1300000000000008,2680,339,298,7.32,5140,507]
["HSS","HSS24x18x0.500","HSS24x18x1/2","24x18x0.500","24x18",0.5,"20x6",null,null,5,93,97,"Rectangular",137.32,40.4,24,18,22.5,16.5,0.5,0.5,33,45,3410,336,284,9.19,2200,277,244,7.38,4180,411]
{"$rows_left_out":464}
{"sheet":"Comparisons","index":9,"n_rows":48,"n_cols":16,"rows_kept":48,"cut":false,"hidden":true,"merged":[]}
[]
[]
[]
[]
[null,"Me","AISC"]
["F.6",7.20344193719286,7.2]
["F.7",59.7,59.7]
["F.7B",59.7,59.7]
["F.8A",45.7,46.3]
["F.8B",45.7,45.4]
[]
[]
[]
[]
["500,Gr. C"]
["34x10x1"]
[0.1,3429,3430]
[20,2698,2700]
[40,1312,1310]
[null,null,null,null,"ɸtTYn",null,"ɸtuTUn",null,"ɸbMn = Mcx",null,"ɸbMn = Mcy",null,"ɸvVnx",null,"ɸvVny"]
{"$rows_left_out":28}