{"text_format":"1","workbook":"xlsx","n_sheets":8,"sheets":["ReadMe","WF_Member","WF_Section_Properties","WF_Axial Calculations","WF Bending Calculations","WF Tension Calculations","WF Shear Calculations","WF16"],"not_rendered":{"charts":0,"images":2,"macros":1,"external_links":0,"defined_names":146,"comments":0,"pivot_tables":0},"unopened":[],"bounds":{"document_bytes":16777216,"sheet_cells":100000,"rows_first":2000,"rows_last":500,"rows_between":2000,"halvings":0,"cell_chars":16384,"cell_head_chars":4096},"cells_cut":0,"cells_raw":0,"read":"whole","date_system":"1900"}

{"sheet":"ReadMe","index":0,"n_rows":58,"n_cols":9,"rows_kept":58,"cut":false,"hidden":false,"merged":[]}
[null,"Wide Flange Analysis - LRFD"]
[null,"AISC 360-22"]
[null,"Norman R. Mahan, PE.                                                                                                          Ver. 1.2 - 2/21/2025"]
[null,"Overview"]
[]
[1,"This spreadsheet computes the available strength of WF sections, obtaining the values of ɸcPn, ɸbMnx,    ɸbMny, ɸtTyn, ɸtuTun, ɸvVx, and ɸvVy, in accordance with AISC 360-22.  All WF sections in the AISC Shapes Database, V16.0 are included.  Thus it provide the user with the values that are in the AISC Manual, Table 6-2.  Torsion effects are not included."]
[]
[{"$f":"+A6+1","v":2},"The spreadsheet consists of 7 sheets and this 'ReadMe' sheet.  'WF_Member' is the only sheet with which the user interacts.  All sheets are protected, with the necessary input cells on 'WF_Member' unprotected.  Almost all calculations are done on the other sheets.  WF16 is a subset of 'aisc-shapes-database-v16.0.'  Columns of this sheet haved been named within Excel to allow quick access to the data within the databases.   Two columns were added to this sheet, values for 'rt' and 'h'."]
[null,null,null,null,null,null,null,null," "]
[3,"The 'Heading' area on WF_Member is row 3.  There are two cells in which the user may enter heading information.  This information is copied to each sheet in the workbook.  Note, however, that the cell widths vary from sheet to sheet due to calculation formatting, and the entire information entered may not appear on each sheet."]
[]
[{"$f":"+A10+1","v":4},"The sheet 'WF_Section_Properties' retrieves the necessary section properties for the input section from the  WF16 database.   In the lower right had corner of the table of the properties there are three properties which have been calculated.  'rt' and 'h' values were computed and added to the WF16 sheet, and √(E/Fy) is calculated as it is required a number of times in the formulas.  Lp and Lr are calculated values, where Lp = Lp' for the few WF sections with noncompact flanges.  See Figure 3.1  in the AISC manual.",null,null,null," "]
[]
[{"$f":"+A12+1","v":5},"'WF Axial Calculations', 'WF Bending Calculations', 'WF Tension Calculations',and  'WF  Shear' sheets compute the values accordingly.  At the top of each page (take Axial for example) is the governing value (Pn and ɸcPn).  The latter value is copied to the 'WF Member' sheet so that the user needs to only view the 'WF Member' sheet to obtain all of the results."]
[]
{"$rows_left_out":44}
{"sheet":"WF_Member","index":1,"n_rows":92,"n_cols":22,"rows_kept":92,"cut":false,"hidden":false,"merged":[]}
["Wide Flange Analysis - LRFD",null,null,null,null,null,null,null,"Ver. 1.2",null,null,null,null,null,null,null,null," "," "]
["AISC 360-22"]
["Heading 1",null,null,null,"Heading 2",null,null," ",{"$f":"TODAY()","v":"2025-03-25"},null," "," "]
["Select depth, weight:",null," "," ",null," ",null,null,null,null,"For WF size insertion:",null,"Wt  + bf","Wt"]
[null,"WF Section","Fy - ksi","Fu - ksi",null,"A36","A992","A913-65","A913-70",null,5,{"$f":"INDEX(_xlfn.ANCHORARRAY(wf_depths),WF_Member!K5)","v":"30"}]
[null,"30x116",50,65,"<= ksi =>","       36, 58","        50, 65","        65, 80","        70, 90"," ",13,{"$f":"IFERROR(+N6,M6)","v":"116"},{"$f":"INDEX(_xlfn.ANCHORARRAY(SelWeights),$K$6)","v":"116"},{"$f":"TRIM(LEFT(M6, (SEARCH(\"-\",M6)-2)))","v":{"$error":"#VALUE!"}}," "]
[null,{"$f":"_xlfn.XLOOKUP(\"W\" & B6,wf_section,wf_blank_col,\"Invalid section\")","v":0},null,null,null,null,null,null,null,null,null," "]
["Compression    ",null,null,null,"Flexure",null,null,null,null,null,null,null,null,null,null," "]
["All input forces to be factored forces."]
[null,"(- for Tension)",null,null," Pδx ","Trans. Load?","M1 - kip-ft","M2 - kip-ft","ψ- Scroll down",null,null,null,null,null," "]
["LL",0,"kips",null,"      Y   N","      Y   N",0,0,0.4,null,null,null,null,null," ",null,null,null," "]
["DL",0,"kips",null,null,null,null,null,"Crane force eccentricity?",null,null,"Crane Y, N",null,null," "]
["Total - Pr",{"$f":"SUM(B11:B12)","v":0},"kips",null,"Mrx  ",0,"kip-ft"," ","     Y      N",null," ",2]
[" ",null,null,null,null,null,null,null,null,null,null,null,null,null," "]
[null,{"$f":"IF(B19>200, \"kL/r > 200\", \"\")","v":""},{"$f":"IF(C19>200, \"kL/r > 200\", \"\")","v":""}]
{"$rows_left_out":78}
{"sheet":"WF_Section_Properties","index":2,"n_rows":84,"n_cols":12,"rows_kept":84,"cut":false,"hidden":false,"merged":[]}
[{"$f":"+WF_Member!A1","v":"Wide Flange Analysis - LRFD"},null,null,null,null,null,null,null,null,{"$f":"+WF_Member!I1","v":"Ver. 1.2"}]
[{"$f":"+WF_Member!A2 & \" - Section Properties\"","v":"AISC 360-22 - Section Properties"}]
[{"$f":"+WF_Member!A3","v":"Heading 1"},null,null,null,{"$f":"+WF_Member!E3","v":"Heading 2"},null,null,null,{"$f":"TODAY()","v":"2025-03-25"}]
[null,null,null,null,null,null,null,null," "]
["WF Section","Fy - ksi",null," "]
[{"$f":"\"W\" & Member","v":"W30x116"},{"$f":"+Fy","v":50}]
[null," "]
[{"$f":"$A$6 & \" section properties\"","v":"W30x116 section properties"}]
["Area","Depth","bf","tf","tw","h/tw","bf/2tf","ho","J","Cw"]
["in2","in","in","in","in"," ",null,"in","in4","in6"]
[{"$f":"INDEX('WF16'!$X$7:$AT$296,MATCH($A$6,'WF16'!$A$7:$A$296,0),MATCH(A$9,'WF16'!$X$6:$AT$6,0))","v":34.200000000000003},{"$f":"INDEX('WF16'!$X$7:$AT$296,MATCH($A$6,'WF16'!$A$7:$A$296,0),MATCH(B$9,'WF16'!$X$6:$AT$6,0))","v":30},{"$f":"INDEX('WF16'!$X$7:$AT$296,MATCH($A$6,'WF16'!$A$7:$A$296,0),MATCH(C$9,'WF16'!$X$6:$AT$6,0))","v":10.5},{"$f":"INDEX('WF16'!$X$7:$AT$296,MATCH($A$6,'WF16'!$A$7:$A$296,0),MATCH(D$9,'WF16'!$X$6:$AT$6,0))","v":0.85},{"$f":"INDEX('WF16'!$X$7:$AT$296,MATCH($A$6,'WF16'!$A$7:$A$296,0),MATCH(E$9,'WF16'!$X$6:$AT$6,0))","v":0.56499999999999995},{"$f":"INDEX('WF16'!$X$7:$AT$296,MATCH($A$6,'WF16'!$A$7:$A$296,0),MATCH(F$9,'WF16'!$X$6:$AT$6,0))","v":47.8},{"$f":"INDEX('WF16'!$X$7:$AT$296,MATCH($A$6,'WF16'!$A$7:$A$296,0),MATCH(G$9,'WF16'!$X$6:$AT$6,0))","v":6.17},{"$f":"INDEX('WF16'!$X$7:$AT$296,MATCH($A$6,'WF16'!$A$7:$A$296,0),MATCH(H$9,'WF16'!$X$6:$AT$6,0))","v":29.2},{"$f":"INDEX('WF16'!$X$7:$AT$296,MATCH($A$6,'WF16'!$A$7:$A$296,0),MATCH(I$9,'WF16'!$X$6:$AT$6,0))","v":6.43},{"$f":"INDEX('WF16'!$X$7:$AT$296,MATCH($A$6,'WF16'!$A$7:$A$296,0),MATCH(J9,'WF16'!$X$6:$AT$6,0))","v":34900}]
[]
["Ix","Sx","rx","Zx","Iy","Sy","ry","Zy","rts","Cb"]
["in4","in3","in","in3","in4","in3","in","in3","in"]
[{"$f":"INDEX('WF16'!$X$7:$AT$296,MATCH($A$6,'WF16'!$A$7:$A$296,0),MATCH(A$13,'WF16'!$X$6:$AT$6,0))","v":4930},{"$f":"INDEX('WF16'!$X$7:$AT$296,MATCH($A$6,'WF16'!$A$7:$A$296,0),MATCH(B$13,'WF16'!$X$6:$AT$6,0))","v":329},{"$f":"INDEX('WF16'!$X$7:$AT$296,MATCH($A$6,'WF16'!$A$7:$A$296,0),MATCH(C$13,'WF16'!$X$6:$AT$6,0))","v":12},{"$f":"INDEX('WF16'!$X$7:$AT$296,MATCH($A$6,'WF16'!$A$7:$A$296,0),MATCH(D$13,'WF16'!$X$6:$AT$6,0))","v":378},{"$f":"INDEX('WF16'!$X$7:$AT$296,MATCH($A$6,'WF16'!$A$7:$A$296,0),MATCH(E$13,'WF16'!$X$6:$AT$6,0))","v":164},{"$f":"INDEX('WF16'!$X$7:$AT$296,MATCH($A$6,'WF16'!$A$7:$A$296,0),MATCH(F$13,'WF16'!$X$6:$AT$6,0))","v":31.3},{"$f":"INDEX('WF16'!$X$7:$AT$296,MATCH($A$6,'WF16'!$A$7:$A$296,0),MATCH(G$13,'WF16'!$X$6:$AT$6,0))","v":2.19},{"$f":"INDEX('WF16'!$X$7:$AT$296,MATCH($A$6,'WF16'!$A$7:$A$296,0),MATCH(H$13,'WF16'!$X$6:$AT$6,0))","v":49.2},{"$f":"INDEX('WF16'!$X$7:$AT$296,MATCH($A$6,'WF16'!$A$7:$A$296,0),MATCH(I13,'WF16'!$X$6:$AT$6,0))","v":2.7},{"$f":"IF(WF_Member!H31=0, WF_Member!H32,WF_Member!H31)","v":1},null," "]
{"$rows_left_out":70}
{"sheet":"WF_Axial Calculations","index":3,"n_rows":63,"n_cols":10,"rows_kept":63,"cut":false,"hidden":false,"merged":[]}
["Wide Flange Analysis - LRFD",null,null,null,null,null,null,{"$f":"+WF_Member!I1","v":"Ver. 1.2"},{"$f":"ROW()","v":1},"axial_heading_start"]
["AISC 360-22 - Compression"]
[{"$f":"+WF_Member!A3","v":"Heading 1"},null,null,null,{"$f":"+WF_Member!E3","v":"Heading 2"},null,null,{"$f":"TODAY()","v":"2025-03-25"}]
[]
["WF Section","Fy - ksi","Pn",{"$f":"IF(B8= \"Slender\",D45, D13)","v":317.69175016202973},"kips"]
[{"$f":"\"W\" & Member","v":"W30x116"},{"$f":"+WF_Section_Properties!B6","v":50},"ɸcPn",{"$f":"+phi_c*D5","v":285.92257514582678},"kips"]
[]
["Section is:",{"$f":"IF(AND(B9=\"Nonslender\", B10 = \"Nonslender\"), \"Nonslender\",\"Slender\")","v":"Slender"}]
["Flanges:",{"$f":"+WF_Section_Properties!C27","v":"Nonslender"}]
["Web:",{"$f":"+WF_Section_Properties!C34","v":"Slender"}]
["Section has:","Both stiffened (web) and nonstiffened (flanges) elements",null,null,null,null,null,null,{"$f":"ROW()","v":11},"axial_heading_end"]
["E3 - Flexural buckling of members without slender elements",null,null,null,null,null,null,null,{"$f":"ROW()","v":12},"wo_slender_start"]
[null,null,"Pn = FnAg",{"$f":"+$D$19*area","v":317.69175016202973},"kips",null,null,"E3-1"]
[null,null,"Max Lc/r",{"$f":"MAX(WF_Member!$B$19,WF_Member!$C$19)","v":164.38356164383563}]
[null,null,"4.71*√(E/Fy)",{"$f":"4.71*sqrtefy","v":113.43182093222343}]
{"$rows_left_out":49}
{"sheet":"WF Bending Calculations","index":4,"n_rows":264,"n_cols":15,"rows_kept":264,"cut":false,"hidden":false,"merged":[]}
["Wide Flange Analysis - LRFD",null,null,null,null,null,null,null,null,null,{"$f":"+WF_Member!I1","v":"Ver. 1.2"}]
["AISC 360-22 - Flexure"]
[{"$f":"+WF_Member!A3","v":"Heading 1"},null,null,null,{"$f":"+WF_Member!E3","v":"Heading 2"},null,null,null,null,null,{"$f":"TODAY()","v":"2025-03-25"}]
[]
["WF Section",null,"Fy - ksi",null,null,null,null,null,null,null,null,null,null,null," "]
[{"$f":"\"W\" & Member","v":"W30x116"},null,{"$f":"+WF_Section_Properties!B6","v":50}]
[null,null,null,null,"Mnx",{"$f":"_xlfn.IFS(BC_applicable=\"F2\",$H$30,BC_applicable = \"F3\",$H$63,BC_applicable = \"F4\",#REF!,BC_applicable= \"F5\",#REF!)","v":612.91642321123925},"kip-ft"]
["For bending:",null,null,null,"ɸbMnx",{"$f":"+phi_b*F7","v":551.62478089011529},"kip-ft"," "]
[null,"Flanges:",{"$f":"+WF_Section_Properties!H27","v":"Compact"},null,"Mny",{"$f":"+H85","v":205},"kip-ft"]
[null,"Web:",{"$f":"+WF_Section_Properties!H34","v":"Compact"},null,"ɸbMny",{"$f":"+phi_b*F9","v":184.5},"kip-ft"]
[]
[null,"Governs"]
[null,null,"Lp - ft","AISC Eq.","Lr - ft","AISC Eq.","User Note: Lp for WF sections which have compact"]
[null,{"$f":"_xlfn.IFS(B15<>\"*\",B15,B16<>\"*\",B16,B17<>\"*\",B17,B18<>\"*\",B18)","v":"F2"},{"$f":"_xlfn.IFS($B$14=\"F2\",C15,$B$14=\"F3\",C16,$B$14=\"F4\",C17,$B$14=\"F5\",C18)","v":7.7355203574161706},null,{"$f":"_xlfn.IFS($B$14=\"F2\",E15,$B$14=\"F3\",E16,$B$14=\"F4\",E17,$B$14=\"F5\",E18)","v":22.638198313137021},null,"webs and noncompact or slender flanges (Section F3) "]
["F2",{"$f":"IF(AND(C9=\"Compact\", C10=\"Compact\"),\"F2\",\"*\")","v":"F2"},{"$f":"1.76*ry*sqrtefy/12","v":7.7355203574161706},"F2-5",{"$f":"+WF_Section_Properties!C60","v":22.638198313137021},"F2-6","is computed using Formula 3-2 on page 3-5 of the"]
{"$rows_left_out":250}
{"sheet":"WF Tension Calculations","index":5,"n_rows":18,"n_cols":10,"rows_kept":18,"cut":false,"hidden":false,"merged":[]}
["Wide Flange Analysis - LRFD",null,null,null,null,null,null,null,{"$f":"+WF_Member!I1","v":"Ver. 1.2"}," "]
["AISC 360-22 - Tension"]
[{"$f":"+WF_Member!A3","v":"Heading 1"},null,null,null,{"$f":"+WF_Member!E3","v":"Heading 2"},null,null,null,{"$f":"TODAY()","v":"2025-03-25"}]
[]
["WF Section","Fy - ksi","Fu - ksi",null,null,"Pn",{"$f":"+D13","v":1710.0000000000002},"kips"]
[{"$f":"\"W\" & Member","v":"W30x116"},{"$f":"+Fy","v":50},{"$f":"+Fu","v":65},"ɸt_yield",{"$f":"+phi_t_yield","v":0.9},"ɸt_yield*Pn",{"$f":"+phi_t_yield*G5","v":1539.0000000000002},"kips"]
[null,null,null,null,null,"Pn",{"$f":"+D16","v":1667.2500000000002},"kips"]
[null,null,null,"ɸt_rupture",{"$f":"phi_t_rupture","v":0.75},"ɸt_rupture*Pn",{"$f":"+phi_t_rupture*G7","v":1250.4375000000002},"kips"]
[]
[]
["D2. Tensile Strength"]
["   (a) Tensile yielding"]
[null,null,"Pn = FyAg",{"$f":"+Fy*area","v":1710.0000000000002},"kips",null,null,null,"D2-1"]
[]
["   (b) Tensile rupture"]
{"$rows_left_out":4}
{"sheet":"WF Shear Calculations","index":6,"n_rows":44,"n_cols":9,"rows_kept":44,"cut":false,"hidden":false,"merged":[]}
["Wide Flange Analysis - LRFD",null,null,null,null,null,null,null,{"$f":"+WF_Member!I1","v":"Ver. 1.2"}]
["AISC 360-22 - Shear"]
[{"$f":"+WF_Member!A3","v":"Heading 1"},null,null,null,{"$f":"+WF_Member!E3","v":"Heading 2"},null,null,null,{"$f":"TODAY()","v":"2025-03-25"}]
[null," "]
["WF Section","Fy - ksi",null,"Vnx",{"$f":"+E12","v":508.5},"kips"," "]
[{"$f":"\"W\" & Member","v":"W30x116"},{"$f":"+WF_Section_Properties!B6","v":50},null,"ɸvVnx",{"$f":"H6*E5","v":508.5},"kips","ɸv",{"$f":"IF(E16<=E17,1,phi_v)","v":1}," "]
[null,null,null,"Vny",{"$f":"+E32","v":535.5},"kips"]
[null,null,null,"ɸvVny",{"$f":"E7*H8","v":481.95},"kips","ɸv",0.9]
[]
["G2. I-Shaped members and channels"]
["1. Shear Strength of Webs"]
[null,null,null,"Vn = 0.6FyAwCv1",{"$f":"0.6*Fy*E13*E27","v":508.5},"kips",null,null,"G2-1"]
[null,null,null,"Aw",{"$f":"+depth*tw","v":16.95},"in2"]
[]
["   (a) For webs of rolled I-shaped members with h/tw <=2.24√(E/Fy)"]
{"$rows_left_out":30}
{"sheet":"WF16","index":7,"n_rows":296,"n_cols":69,"rows_kept":296,"cut":false,"hidden":false,"merged":[]}
[null,null,null,null,null,null,null,null,null,null,null,null,null,null,null,null,null,null,null,null,null,null,null,null,null,null,null,null,null,null,null,null,null,null,null,null,null,null,null,null,null,null,null,null,null,null,null,null,{"$f":"\"Fy =  \" & Fy","v":"Fy =  50"}," ksi"]
[null,null,null," ",null,null,null,null,null,null,null,null,null,null,null,null,null,null,null,null,null,null,null,null,null,null,null,null,null,null,null,null,null,null,null,null,null,null,null,null,null,null,null,null,null,null,null,"Axial compression",null,"Flexural compression"]
[null,null,null,null," ",null,null,null,null,null,null,null,null,null,null,null,null,null,null,null,null,null,null,null," ",null,null,null,null,null,null,null,"This column "," ",null,null,null,null,null,null,null,null,null,null,null,"This column ",null,"Flanges","Web","Flanges","Web",null,"Lp - F2-5","Lr - F2-6",null,null,null,null,null,"Lp - F4-7","Lr - F4-8",null,null,null,null,null,null,"Lp (F5 = F4-7)","Lr - F5-5"]
[null,null,null," "," ",null,null,null,null,null,null,null,null,null,null,null,null,null,null,null,null,null,null,null,null,null,null,null,null,null,null,null,"inserted by me",null,null,null,null,null,null,null,null,null,null,null,null,"inserted by me","λp",null,null," 0.38*√(E/Fy)","3.76*√(E/Fy)",null,"ft","ft","6.76*(0.7Fy/E)2","c",null,null,null,"ft","ft","FL = 0.7Fy ","6.76(FL/E)2",null,null,null,null,"ft","ft"]
[null,null,null,"Column number for Index/Match ==>",null,null,null,null,null,null,null,null,null,null,null,null,null,null,null,null,null,null,null,null,null,null,null,null,null,null,null,null,null,11,12,13,14,15,16,17,18,19,20,21,22,23,"λp",null,null,{"$f":"0.38*sqrtefy","v":9.1516118798821449},{"$f":"3.76*sqrtefy","v":90.552791232518061},null,null,null,{"$f":"6.76*(0.7*Fy/E)^2","v":9.8466111771700377E-6},1,null,null,null,null,null,{"$f":"0.7*Fy","v":35},{"$f":"6.76*(BJ5/E)^2","v":9.8466111771700377E-6}]
["AISC_Manual_Label",null,null,"Depths","wf_blank_col","SelWeights",null,null,null,null,null,null,null,null,null,null,null,null,null,null,null,null,null,"Weight","Area","depth","bf","tw","tf","kdes","bf/2tf","h/tw","h","Ix","Zx","Sx","rx","Iy","Zy","Sy","ry","J","Cw","rts","ho","rt","λr "," 0.56*√(E/Fy)"," 1.49*√(E/Fy)","1.0*√(E/Fy)"," 5.70*√(E/Fy)",null," 1.76ry*√(E/Fy)",null,"(Jc)/(Sxho)","((Jc)/(Sxho))2","Inner sqrt","Outer sqrt","1.95rtsE/0.7Fy","1.1rt√(E/Fy)",null,"aw = hctw/bftf","(J)/(Sxho)","((J)/(Sxho))2","Inner sqrt","Outer sqrt","1.95rsE/FL","1.1rt√(E/Fy)","πrt√(E/Fy)"]
["wf_section",null,null,null,null,null,44,40,36,33,30,27,24,21,18,16,14,12,10,8,6,5,4,null,null,null,null,null,null,null,null,null,null,null,null,null,null,null,null,"wf_Sy","wf_ry","wf_J","wf_Cw","wf_rts","wf_ho","wf_rt","λr ",{"$f":"0.56*sqrtefy","v":13.486585928247372},{"$f":"1.49*sqrtefy","v":35.883951844801039},{"$f":"1*sqrtefy","v":24.083189157584592},{"$f":"5.7*sqrtefy","v":137.27417819823216},null," ",null,null,null,null,null,null," ",null," "]
["W44X408",{"$f":"RIGHT(A8,LEN(A8)-1)","v":"44X408"},{"$f":"LEFT(B8,(FIND(\"X\",B8)-1))","v":"44"},{"$f":"_xlfn.UNIQUE(C8:C296)","v":"44"},null,{"$f":"INDEX('WF16'!$G$8:$W$45,,WF_Member!$K$5)","v":391},"408 - 16.125","655","925","387",391,"539 - 15.25","370","275","311 - 12","100","873","336","112","67","25",19,"13 - 4",408,120,44.8,16.100000000000001,1.22,2.17,2.96,3.71,31.9,{"$f":"+AF8*AB8","v":38.917999999999999},38700,2000,1730,18,1520,297,189,3.56,134,691000,4.33,42.6,{"$f":"$AA8/(SQRT(12*(1+$BJ8/6)))","v":4.1966329811065393},null,{"$f":"IF($AE8<=$AV$7,\"N\",\"S\")","v":"N"},{"$f":"IF($AF8<=$AW$7,\"N\",\"S\")","v":"N"},{"$f":"_xlfn.IFS($AE8<=$AX$5,\"C\",$AE8<=$AX$7,\"N\",TRUE,\"S\")","v":"C"},{"$f":"_xlfn.IFS($AF8<=$AY$5,\"C\",$AF8<=$AY$7,\"N\",TRUE,\"S\")","v":"C"},{"$f":"IF(AND(AX8=\"C\", AY8= \"C\"),\"F2\",\"F3\")","v":"F2"},{"$f":"1.76*AO8*sqrtefy/12","v":12.574635832146834},{"$f":"+$BG8*$BF8/12","v":43.019497989790743},{"$f":"+($AP8*$BD$5)/($AJ8*$AS8)","v":1.8182311595972753E-3},{"$f":"+$BC8^2","v":3.3059645497304522E-6},{"$f":"SQRT($BD$8+$BC$5)","v":3.6266480015160682E-3},{"$f":"SQRT(($BC8+$BE8))","v":7.3789424453056571E-2},{"$f":"1.95*AR8*E/(0.7*Fy)","v":6996.0428571428574},{"$f":"1.1*AT8*SQRT(E/Fy)","v":111.17513649984161},{"$f":"$BO8*$BN8","v":500.33360950005249},{"$f":"(AG8*AB8)/(AA8*AC8)","v":1.3590165154420812},{"$f":"+($AP8)/($AJ8*$AS8)","v":1.8182311595972753E-3},{"$f":"+$BC8^2","v":3.3059645497304522E-6},{"$f":"SQRT($BL8+$BK$5)","v":3.6266480015160682E-3},{"$f":"+SQRT($BK8+$BM8)","v":7.3789424453056571E-2},{"$f":"1.95*$AT8*E/$BJ$5","v":6780.5598594735648},{"$f":"+$BH8","v":111.17513649984161},{"$f":"pi*$AT8*SQRT(E/Fy)","v":317.51517916048851}]
["W44X368",{"$f":"RIGHT(A9,LEN(A9)-1)","v":"44X368"},{"$f":"LEFT(B9,(FIND(\"X\",B9)-1))","v":"44"},"40",null,"357","368","593 - 16.75","853","354","357","368","335 - 13.5","248","283","89","808 - 18.625","305","100","58","20","16 - 5"," ",368,108,44.4,16,1.1000000000000001,1.97,2.76,4.0599999999999996,35.4,{"$f":"+AF9*AB9","v":38.940000000000005},34700,1800,1560,17.899999999999999,1350,265,169,3.54,100,608000,4.28,42.4,4.1705867209550149,null,"N","N",{"$f":"_xlfn.IFS($AE9<=$AX$5,\"C\",$AE9<=$AX$7,\"N\",TRUE,\"S\")","v":"C"},{"$f":"_xlfn.IFS($AF9<=$AY$5,\"C\",$AF9<=$AY$7,\"N\",TRUE,\"S\")","v":"C"},{"$f":"IF(AND(AX9=\"C\", AY9= \"C\"),\"F2\",\"F3\")","v":"F2"},{"$f":"1.76*AO9*sqrtefy/12","v":12.50399181061792},{"$f":"+$BG9*$BF9/12","v":41.309059520233774},{"$f":"+($AP9*$BD$5)/($AJ9*$AS9)","v":1.5118529269472665E-3},{"$f":"+$BC9^2","v":2.2856992727190169E-6},3.6266480015160682E-3,{"$f":"SQRT(($BC9+$BE9))","v":7.1683337871944378E-2},{"$f":"1.95*AR9*E/(0.7*Fy)","v":6915.2571428571428},{"$f":"1.1*AT9*SQRT(E/Fy)","v":110.4851317887571},{"$f":"$BO9*$BN9","v":476.2439241652682},{"$f":"(AG9*AB9)/(AA9*AC9)","v":1.3589467005076146},{"$f":"+($AP9)/($AJ9*$AS9)","v":1.5118529269472665E-3},{"$f":"+$BC9^2","v":2.2856992727190169E-6},{"$f":"SQRT($BL9+$BK$5)","v":3.4831466305467323E-3},{"$f":"+SQRT($BK9+$BM9)","v":7.0675310805782793E-2},6738.4765448573162,{"$f":"+$BH9","v":110.4851317887571},315.54453197840127]
["W44X335","44X335","44","36",null,"326","335","503","802 - 18","318 - 16","326","336","306","223","258","77","730","279","88","48","15 - 6"," "," ",335,98.5,44,15.9,1.03,1.77,2.56,4.5,38,39.14,31100,1620,1410,17.8,1200,236,150,3.49,74.7,535000,4.24,42.2,4.1239685035316125,null,"N","S",{"$f":"_xlfn.IFS($AE10<=$AX$5,\"C\",$AE10<=$AX$7,\"N\",TRUE,\"S\")","v":"C"},{"$f":"_xlfn.IFS($AF10<=$AY$5,\"C\",$AF10<=$AY$7,\"N\",TRUE,\"S\")","v":"C"},"F2",12.327381756795633,39.888810621891523,1.2554199858828274E-3,1.5760793409540387E-6,3.6266480015160682E-3,6.9871796795265659E-2,6850.6285714285723,109.25014490552017,453.64131640285376,1.432476992502576,1.2554199858828274E-3,1.5760793409540387E-6,3.3797471086050323E-3,6.8082061473547201E-2,6663.1548249917914,109.25014490552017,312.01742066703014]
["W44X290","44X290","44","33",null,"292","290","431","723","291","292","307 - 14.5","279","201","234","67 - 10.25","665","252 - 13","77","40","16"," "," ",290,85.4,43.6,15.8,0.86499999999999999,1.58,2.36,5.0199999999999996,45,38.924999999999997,27000,1410,1240,17.8,1040,205,132,3.49,50.9,461000,4.2,42,4.1213114473284698,null,"N","S",{"$f":"_xlfn.IFS($AE11<=$AX$5,\"C\",$AE11<=$AX$7,\"N\",TRUE,\"S\")","v":"C"},{"$f":"_xlfn.IFS($AF11<=$AY$5,\"C\",$AF11<=$AY$7,\"N\",TRUE,\"S\")","v":"C"},"F2",12.327381756795633,38.370708743029489,9.7734254992319506E-4,9.5519845989037308E-7,3.6266480015160682E-3,6.7852712189265238E-2,6786,109.1797554796633,434.81669984283366,1.3487471959621853,9.7734254992319506E-4,9.5519845989037308E-7,3.2866106610093641E-3,6.5298952602109619E-2,6658.8617813264282,109.1797554796633,311.8163891066867]
["W44X262","44X262","44","30",null,"261","262","397","652 - 17.625","263","261","281","250","182","211","57","605","230","68","35","12"," "," ",262,77.2,43.3,15.8,0.78500000000000003,1.42,2.2000000000000002,5.57,49.6,38.936,24100,1270,1110,17.7,923,182,117,3.47,37.299999999999997,405000,4.17,41.9,4.1175139081137466,null,"N","S",{"$f":"_xlfn.IFS($AE12<=$AX$5,\"C\",$AE12<=$AX$7,\"N\",TRUE,\"S\")","v":"C"},{"$f":"_xlfn.IFS($AF12<=$AY$5,\"C\",$AF12<=$AY$7,\"N\",TRUE,\"S\")","v":"C"},"F2",12.25673773526672,37.364117186768048,8.0199531273516947E-4,6.4319648164918234E-7,3.6266480015160682E-3,6.6548052670617169E-2,6737.528571428571,109.07915293889762,422.89535801443924,1.3623087894455339,8.0199531273516947E-4,6.4319648164918234E-7,3.2387972549727806E-3,6.3567228724461078E-2,6652.7260429666394,109.07915293889762,311.52906916482851]
["W44X230","44X230","44","27",null,"235","230 - 15.75","372","529","241","235","258","229","166","192 - 11.5","50","550","210","60","31 - 8",9,{"$f":"IF($C13 = V$7,RIGHT($B13,3),\"\")","v":""},"",230,67.8,42.9,15.8,0.71,1.22,2.0099999999999998,6.45,54.8,38.907999999999994,20800,1100,971,17.5,796,157,101,3.43,24.9,346000,4.13,41.7,4.0978563572852282,null,"N","S",{"$f":"_xlfn.IFS($AE13<=$AX$5,\"C\",$AE13<=$AX$7,\"N\",TRUE,\"S\")","v":"C"},{"$f":"_xlfn.IFS($AF13<=$AY$5,\"C\",$AF13<=$AY$7,\"N\",TRUE,\"S\")","v":"C"},"F2",12.115449692208889,36.215829088613205,6.1495602693951935E-4,3.7817091506923884E-7,3.6266480015160682E-3,6.5127598055322047E-2,6672.9,108.55839477242178,408.81858177625219,1.4331126789790409,6.1495602693951935E-4,3.7817091506923884E-7,3.1976213178297515E-3,6.1746071492600002E-2,6620.965057270847,108.55839477242178,310.04178857553865]
["W40X655","40X655","40","24",null,"211",null,"362 - 16","487","221","211","235","207","147","175","45","500 - 17","190","54","28","8.5 - 4","","",655,193,43.6,16.899999999999999,1.97,3.54,4.72,2.39,17.3,34.081000000000003,56500,3080,2590,17.100000000000001,2870,542,340,3.86,589,1150000,4.71,40.1,4.477784416779345,null,"N","N",{"$f":"_xlfn.IFS($AE14<=$AX$5,\"C\",$AE14<=$AX$7,\"N\",TRUE,\"S\")","v":"C"},{"$f":"_xlfn.IFS($AF14<=$AY$5,\"C\",$AF14<=$AY$7,\"N\",TRUE,\"S\")","v":"C"},"F2",13.634296155080555,61.149693783838536,5.6711503095542995E-3,3.216194583355783E-5,3.6266480015160682E-3,9.6425091708903066E-2,7610.0142857142855,118.62326202779973,797.55652891570207,1.1222473506502193,5.6711503095542995E-3,3.216194583355783E-5,6.4814008524953825E-3,0.11023861012390206,7234.8202505391982,118.62326202779973,338.78695795810484]
["W40X593","40X593","40","21",null,"191",null,"324","441 - 17","201 - 15.75","191","217","192","132 - 12.5","158","40","455","170","49 - 10","24 - 6.5","","","",593,174,43,16.7,1.79,3.23,4.41,2.58,19.100000000000001,34.189,50400,2760,2340,17,2520,481,302,3.8,445,997000,4.63,39.799999999999997,4.4209788286877956,null,"N","N",{"$f":"_xlfn.IFS($AE15<=$AX$5,\"C\",$AE15<=$AX$7,\"N\",TRUE,\"S\")","v":"C"},{"$f":"_xlfn.IFS($AF15<=$AY$5,\"C\",$AF15<=$AY$7,\"N\",TRUE,\"S\")","v":"C"},"F2",13.422364090493813,57.151590369309922,4.7781643259030195E-3,2.2830854325332256E-5,3.6266480015160682E-3,9.1677763538488916E-2,7480.7571428571418,117.11839633226145,731.75489300246545,1.1345416288166701,4.7781643259030195E-3,2.2830854325332256E-5,5.7164206897762776E-3,0.1024430818341546,7143.0386503512809,117.11839633226145,334.4890752122447]
{"$rows_left_out":281}