{"text_format":"1","workbook":"xlsx","n_sheets":8,"sheets":["ReadMe","WF_Member","WF_Section_Properties","WF_Axial Calculations","WF Bending Calculations","WF Tension Calculations","WF Shear Calculations","WF16"],"not_rendered":{"charts":0,"images":2,"macros":1,"external_links":0,"defined_names":146,"comments":0,"pivot_tables":0},"unopened":[],"bounds":{"document_bytes":16777216,"sheet_cells":100000,"rows_first":2000,"rows_last":500,"rows_between":2000,"halvings":0,"cell_chars":16384,"cell_head_chars":4096},"cells_cut":0,"cells_raw":0,"read":"whole","date_system":"1900"}

{"sheet":"ReadMe","index":0,"n_rows":58,"n_cols":9,"rows_kept":58,"cut":false,"hidden":false,"merged":[]}
[null,"Wide Flange Analysis - LRFD"]
[null,"AISC 360-22"]
[null,"Norman R. Mahan, PE.                                                                                                          Ver. 1.2 - 2/21/2025"]
[null,"Overview"]
[]
[1,"This spreadsheet computes the available strength of WF sections, obtaining the values of ɸcPn, ɸbMnx,    ɸbMny, ɸtTyn, ɸtuTun, ɸvVx, and ɸvVy, in accordance with AISC 360-22.  All WF sections in the AISC Shapes Database, V16.0 are included.  Thus it provide the user with the values that are in the AISC Manual, Table 6-2.  Torsion effects are not included."]
[]
[{"$f":"+A6+1","v":2},"The spreadsheet consists of 7 sheets and this 'ReadMe' sheet.  'WF_Member' is the only sheet with which the user interacts.  All sheets are protected, with the necessary input cells on 'WF_Member' unprotected.  Almost all calculations are done on the other sheets.  WF16 is a subset of 'aisc-shapes-database-v16.0.'  Columns of this sheet haved been named within Excel to allow quick access to the data within the databases.   Two columns were added to this sheet, values for 'rt' and 'h'."]
[null,null,null,null,null,null,null,null," "]
[3,"The 'Heading' area on WF_Member is row 3.  There are two cells in which the user may enter heading information.  This information is copied to each sheet in the workbook.  Note, however, that the cell widths vary from sheet to sheet due to calculation formatting, and the entire information entered may not appear on each sheet."]
[]
[{"$f":"+A10+1","v":4},"The sheet 'WF_Section_Properties' retrieves the necessary section properties for the input section from the  WF16 database.   In the lower right had corner of the table of the properties there are three properties which have been calculated.  'rt' and 'h' values were computed and added to the WF16 sheet, and √(E/Fy) is calculated as it is required a number of times in the formulas.  Lp and Lr are calculated values, where Lp = Lp' for the few WF sections with noncompact flanges.  See Figure 3.1  in the AISC manual.",null,null,null," "]
[]
[{"$f":"+A12+1","v":5},"'WF Axial Calculations', 'WF Bending Calculations', 'WF Tension Calculations',and  'WF  Shear' sheets compute the values accordingly.  At the top of each page (take Axial for example) is the governing value (Pn and ɸcPn).  The latter value is copied to the 'WF Member' sheet so that the user needs to only view the 'WF Member' sheet to obtain all of the results."]
[]
[{"$f":"+A14+1","v":6},"Input                                                                                                                                                                                                                           'WF_Member' is the only sheet that has input.  The input cells are this color.                                                                   All other cells are protected.                                                                                                                                                                          Cells with totals are this color.                                                                                                                                                                    Cells with output values are this color."]
[null," "]
[{"$f":"+A16+1","v":7},"Note that all input forces and moments are to be factored values."]
[]
[{"$f":"+A18+1","v":8},"There are two ways to enter the WF section to be checked.                                                                                                   (1)  Enter the WF section without the 'W' or 'WF' prefix in Cell B6.  No blanks are to be entered.  (Examples: 8x31, 10x40, 6x8.5).  Entering a new section sets the crane eccentricity option to 'No'.                                                 (2)  In cell A5 is a drop down list of the WF depths.  In cell A6 is a drop down list of the avaiable weights for the selected depth. (You may need to scroll to see all of the weights.)  In cell A7 is an 'Insert' button.  Clicking on the latter  inserts the selected depth and weight into cell B6.  Some of the weights have a '- 8' or some such following them.  The value given here is an approximate value of the flange width of the selected section.  This can be helpful when a particular section does not quite work in flexure with the required unbraced length.  You can immedately determine the next higher flange width from this information."]
[]
[{"$f":"+A20+1","v":9},"There are three option selections.  One is for the ASTM grade of the section, a second is to compute the moment at the top of the column due to crane load eccentricity.  The crane load eccentricity options are 'Yes' and 'No'.  The eccentricity is taken to be  equal to the (column depth/2 - flange thickness/2), varying linearly to zero at the base of the column.  Only the crane 'Live Load' is used to compute the Mx moment.  The crane DL is assumed to be the weight of the crane beam and rail, generally symmetric on the column.  The third option is for P-delta effects.  See below."]
[]
[{"$f":"+A22+1","v":10},"The crane live load, or axial force on the column, is entered in cell B9, with the dead load in cell B10.  "]
[]
[{"$f":"+A24+1","v":11},"The k values for the member and the unbraced length about each axis are in cells B17 thru D17.  Note that the unbraced length for torsion (Lz) must be equal to or less than Ly.  It need be entered only if torsion effects are to be included in the analysis."]
[]
[{"$f":"+A26+1","v":12},"P-Delta effects.  This workbook assumes that the member being analyzed is braced against lateral movement at each end.  Therefore P-Δ effects are not included.  However, first-order P-δ effects may be included at the user's option.  For example,  the slight deflection of a crane column due to the eccentricity of the load source (assumed to be 1/2 of the column depth minus 1/2 of the flange thickness) induces a small additional moment.                                                                                                                                                                                       Cell E11 of the WF_Member sheet contains a Yes/No option for such.  If 'Yes' is selected, cell F11 asks if the moment is due to a transverse load.  If 'Yes', the user is to input a ψ  value selected from Table C-A.8.1 which is reproduced lower in the WF_Member sheet (Scroll down to find it.)  The input value may be either positive or negative, the worksheet accounts for such.                                                                                                              If 'No' is selected, cells G11 and H11 are to be used to input the moment values (both positive for single curvature) at each end of the unbraced length (Note that the ratio of the moments is what matters, not their particular value.)  The worksheet determines which is the smaller moment for correct computation of Cm.  The worksheet assumes that the member will be bent in single curvature.  If it is bent in double curvature enter one of the moments as negative.  The B1 value (See Appendix 8 of the Specification) is computed; if greater than 1.0 the major axis bending moment is amplyfied by the B1 value.  If less than 1.0 no moment reduction occurs.                                                                                                                                                                                                             When a member is contributing to the stability of the structure reduced stiffnesses are required.  This worksheet assumes that the member does not participate in providing any stability and the stiffness is not reduced.  "]
[]
[{"$f":"+A28+1","v":13},"Additional Mx and My moments may be entered in cells F11 and F17 as needed.  The unbraced length in bending, Lb, is entered in cell F18. "]
[]
[{"$f":"+A30+1","v":14},"If the crane eccentricity option is selected, values for Cb are automatically entered in cells H27 through H30, assuming a linear distribution of moment with Mmax at the top of the member and a zero value for the moment at the bottom.  The user may adjust these values if desired.  Alternatively, the user may enter a Cb value in cell H32 which will override any value computed in cell H31."]
[]
[{"$f":"+A32+1","v":15},"The only other values the user may wish to enter is for shear, in cells C50 and C51, and the U value for tensile rupture, cell B41. "]
[]
[{"$f":"+A34+1","v":16},"Ensure that all numeric entries have a value - zero if necessary.  Blank value may cause strange results and lead to confusion."]
[]
[{"$f":"+A36+1","v":17},"There are no WF shapes that have a noncompact web, at least up through sections with an Fy = 70.0 ksi.  Therefore, for flexural calculations only sections F2 and F3 are applicable."]
[]
[{"$f":"+A38+1","v":18},"Cells H18:I21 contain buttons for your use.  Some of both the flexural and axial calculations will not apply for any particular section.  These buttons give the user the option of seeing and printing only the applicable calculations. "]
[]
[{"$f":"+A40+1","v":19},"When the calculations extend beyond the screen size the top rows of the selected sheet are frozen.  The user can always see the selected member size and yield stress."]
[]
[18,"The lookup of WF section properties is done using Index and Match rather than Xlookup, allowing this workbook to be used on earlier versions of Excel."]
[]
[19,"The WF section being checked is on row 6.  The last row of the unity checks is 48.  It is unlikely that both rows are visible on the screen at the same time, thus requiring the user to scroll down, check the result, and then scroll back up to change the section if necessary.  To eliminate this minor inconvenience, two buttons are located on rows 44-46.  When the \"Hide rows 8-32\" button is clicked the specified rows are hidden.  This allows both the input WF section and all of the stress checks to be viewed simultaneously, eliminating the annoyance.  "]
[]
[{"$f":"+A46+1","v":20},"From time to time you may have strange movement of the active cell selector on WF_Member.  Select another sheet and then go back to WF_Member.  This seems to alleviate the problem."]
[]
[{"$f":"+A48+1","v":21},"The sheets of this workbook are protected, the workbook is not.  So the user can add sheets of their own, such as developing a worksheet which computes crane forces to a column, and then copying such forces directly to WF_Member."]
[]
[50,"Print any or all sheets as you desire using normal Excel printing procedures.  Print areas are pre-selected.  "]
[]
[51,"Rev. 1.2  - 2/21/2025"]
[null,"1. Increased width of input list boxes to allow viewing of flange width in weight box."]
[null,"2. Corrected print area of some of the tabs."]
[]
[100,"Address any questions or comments to nrmahan@att.net.  I will reply as soon as I can.  Suggestions are welcome.  Norman R. Mahan, P.E."]

{"sheet":"WF_Member","index":1,"n_rows":92,"n_cols":22,"rows_kept":92,"cut":false,"hidden":false,"merged":[]}
["Wide Flange Analysis - LRFD",null,null,null,null,null,null,null,"Ver. 1.2",null,null,null,null,null,null,null,null," "," "]
["AISC 360-22"]
["Heading 1",null,null,null,"Heading 2",null,null," ",{"$f":"TODAY()","v":"2025-03-25"},null," "," "]
["Select depth, weight:",null," "," ",null," ",null,null,null,null,"For WF size insertion:",null,"Wt  + bf","Wt"]
[null,"WF Section","Fy - ksi","Fu - ksi",null,"A36","A992","A913-65","A913-70",null,5,{"$f":"INDEX(_xlfn.ANCHORARRAY(wf_depths),WF_Member!K5)","v":"30"}]
[null,"30x116",50,65,"<= ksi =>","       36, 58","        50, 65","        65, 80","        70, 90"," ",13,{"$f":"IFERROR(+N6,M6)","v":"116"},{"$f":"INDEX(_xlfn.ANCHORARRAY(SelWeights),$K$6)","v":"116"},{"$f":"TRIM(LEFT(M6, (SEARCH(\"-\",M6)-2)))","v":{"$error":"#VALUE!"}}," "]
[null,{"$f":"_xlfn.XLOOKUP(\"W\" & B6,wf_section,wf_blank_col,\"Invalid section\")","v":0},null,null,null,null,null,null,null,null,null," "]
["Compression    ",null,null,null,"Flexure",null,null,null,null,null,null,null,null,null,null," "]
["All input forces to be factored forces."]
[null,"(- for Tension)",null,null," Pδx ","Trans. Load?","M1 - kip-ft","M2 - kip-ft","ψ- Scroll down",null,null,null,null,null," "]
["LL",0,"kips",null,"      Y   N","      Y   N",0,0,0.4,null,null,null,null,null," ",null,null,null," "]
["DL",0,"kips",null,null,null,null,null,"Crane force eccentricity?",null,null,"Crane Y, N",null,null," "]
["Total - Pr",{"$f":"SUM(B11:B12)","v":0},"kips",null,"Mrx  ",0,"kip-ft"," ","     Y      N",null," ",2]
[" ",null,null,null,null,null,null,null,null,null,null,null,null,null," "]
[null,{"$f":"IF(B19>200, \"kL/r > 200\", \"\")","v":""},{"$f":"IF(C19>200, \"kL/r > 200\", \"\")","v":""}]
[null,"X-axis","Y-axis","Z-axis","Total - Mrx",{"$f":"+F13+F15","v":0},"kip-ft",null,null,null,null,0,null,null," "]
["k",1,1,1,"Mry",0,"kip-ft","Show/print formulas",null,null," ",null,null,null,null,null,null,null,null,null,null," "]
["Lc",30,30,30,"ft              Lb",30,"ft","Axial","Bending"]
["kLc/r",{"$f":"B17*B18*12/rx","v":30},{"$f":"C17*C18*12/ry","v":164.38356164383563}," ",null,null,null,null,null,null,null,null,null,null," "]
[]
[null,null,null,null,null,null," "]
[null,null," ",null,null,null,null,null,null,null," "]
["For uniform compression section is:",null,null,null,null,null,"For bending:","Flanges:","Web:"]
[null,null,{"$f":"+'WF_Axial Calculations'!B8","v":"Slender"},null," ",null,null,{"$f":"+WF_Section_Properties!$H$27","v":"Compact"},{"$f":"+WF_Section_Properties!$H$34","v":"Compact"}]
[null,null,null,null,null,null,null,"For bending the applicable AISC section is:",{"$f":"+BC_applicable","v":"F2"}]
[null,null,null,null,null,"Compute Cb",null,0,null,null,null," "]
[null,null,null,null,null,"Optional calculation - absolute values","Mmax",0,"kip-ft"]
[null,null,null,null,null,"Ma - 1/4 pt of unbraced segment","Ma",0,"kip-ft"]
[null,null,null,null,null,"Mb - 1/2 pt of unbraced segment","Mb",0,"kip-ft"]
[null," ",null,null,null,"Mc - 3/4 pt of unbraced segment","Mc",0,"kip-ft"]
[null,null,null,null,null,"Cb = 12.5Mmax/(2.5Mmax + 3Ma + 4Mb+3Mc)","Cb  ",{"$f":"IFERROR(12.5*H27/(2.5*H27+3*H28+4*H29+3*H30),0)","v":0},"F1-1"]
[null,null,null,"Optional direct entry",null,null,"Cb  (enter)",1]
[null,null,null,null,null,null,null," ",null,null,null,"Compression/Tension switch for axial"]
["Axial",null,"ɸcPn = Pc",{"$f":"+'WF_Axial Calculations'!D6","v":285.92257514582678},"kips","Pr",{"$f":"+B13","v":0},"kips",{"$f":"IF(G34<0, \"Tension\",\"\")","v":""},null,null,{"$f":"IF(Tension<0,B39,D34)","v":285.92257514582678},"ɸcPn = Pc","or","ɸtTYn"]
["X Bending",null,"ɸbMn = Mcx",{"$f":"+'WF Bending Calculations'!$F$8","v":551.62478089011529},"kip-ft","Mrx",{"$f":"IFERROR(F16,IF('WF Bending Calculations'!H108= \"Yes\", F16*p_del_B1, F16))","v":0},"kip-ft",{"$f":"IFERROR(p_del_B1,1)","v":1}," "," "]
["Y Bending",null,"ɸbMn = Mcy",{"$f":"+'WF Bending Calculations'!F10","v":184.5},"kip-ft","Mry",{"$f":"+F17","v":0},"kip-ft    ","Pδx amp. factor"]
[null,null,null,null,null,null,null,null,null,null,null," "," "," "]
["Tension",null,null,"Shear",null,null,null,"Shear force"]
["ɸtTYn",{"$f":"+'WF Tension Calculations'!G6","v":1539.0000000000002},"kips","ɸvVnx",{"$f":"+'WF Shear Calculations'!E6","v":508.5},"kips","Vx",0,"kips"]
["ɸtuTUn",{"$f":"+'WF Tension Calculations'!G8","v":1250.4375000000002},"kips","ɸvVny",{"$f":"+'WF Shear Calculations'!E8","v":481.95},"kips","Vy",0,"kips"]
["U",0.75,"Table D3.1",null," "]
[]
[null,"Pr/Pc",{"$f":"IFERROR(ABS(G34/L34),0)","v":0},{"$f":"IF(C43<0.2, \"< 0.2, H1-1b applies\", \"=> 0.2, H1-1a applies\")","v":"< 0.2, H1-1b applies"},null,null,null,null," "]
[null,"H1-1a",null,"H1-1b"]
[null,"Pr/Pc",{"$f":"IFERROR(ABS(G34/L34),0)","v":0},"Pr/(2*Pc)",{"$f":"+ABS(Tension/(2*L34))","v":0},null," "]
[null,"(8/9)(Mrx/Mcx)",{"$f":"IFERROR((8/9)*($G$35/$D$35),0)","v":0},"Mrx/Mcx",{"$f":"IFERROR(($G$35/$D$35),0)","v":0}]
[null,"(8/9)(Mry/Mcy)",{"$f":"IFERROR((8/9)*($G$36/$D$36),0)","v":0},"Mry/Mcy",{"$f":"IFERROR(($G$36/$D$36),0)","v":0},null,null,null," "]
[null,"Total",{"$f":"SUM(C45:C47)","v":0},null,{"$f":"E45+E46+E47","v":0}]
[]
["Residual str",10,"ksi",null,null,null,null," "]
["E",29000,"ksi"]
["G",11200,"ksi"]
["π",3.1415899999999999]
["ɸb",0.9,null,null," "]
["ɸc",0.9]
["ɸv",0.9]
["ɸt_yield",0.9]
["ɸt_rupture",0.75,null,null,null,null,null,null,null,{"$f":"ROW()","v":58},"no_table"]
[null,null,null,null,null,null,null,null,null,{"$f":"ROW()","v":59},"table_start"]
[]
[]
[null,null,null,null,null,null,"If there is no transverse loading"]
[null,null,null,null,null,null,"   between the end points of the"]
[null,null,null,null,null,null,"   member, enter ψ as 0."]
[]
[]
[]
[]
[]
[]
[]
[]
[]
[]
[]
[]
[]
[]
[]
[]
[]
[]
[]
[]
[]
[]
[]
[]
[]
[]
[]
[null,null,null,null,null,null,null,null,null,{"$f":"ROW()","v":92},"table_end"]

{"sheet":"WF_Section_Properties","index":2,"n_rows":84,"n_cols":12,"rows_kept":84,"cut":false,"hidden":false,"merged":[]}
[{"$f":"+WF_Member!A1","v":"Wide Flange Analysis - LRFD"},null,null,null,null,null,null,null,null,{"$f":"+WF_Member!I1","v":"Ver. 1.2"}]
[{"$f":"+WF_Member!A2 & \" - Section Properties\"","v":"AISC 360-22 - Section Properties"}]
[{"$f":"+WF_Member!A3","v":"Heading 1"},null,null,null,{"$f":"+WF_Member!E3","v":"Heading 2"},null,null,null,{"$f":"TODAY()","v":"2025-03-25"}]
[null,null,null,null,null,null,null,null," "]
["WF Section","Fy - ksi",null," "]
[{"$f":"\"W\" & Member","v":"W30x116"},{"$f":"+Fy","v":50}]
[null," "]
[{"$f":"$A$6 & \" section properties\"","v":"W30x116 section properties"}]
["Area","Depth","bf","tf","tw","h/tw","bf/2tf","ho","J","Cw"]
["in2","in","in","in","in"," ",null,"in","in4","in6"]
[{"$f":"INDEX('WF16'!$X$7:$AT$296,MATCH($A$6,'WF16'!$A$7:$A$296,0),MATCH(A$9,'WF16'!$X$6:$AT$6,0))","v":34.200000000000003},{"$f":"INDEX('WF16'!$X$7:$AT$296,MATCH($A$6,'WF16'!$A$7:$A$296,0),MATCH(B$9,'WF16'!$X$6:$AT$6,0))","v":30},{"$f":"INDEX('WF16'!$X$7:$AT$296,MATCH($A$6,'WF16'!$A$7:$A$296,0),MATCH(C$9,'WF16'!$X$6:$AT$6,0))","v":10.5},{"$f":"INDEX('WF16'!$X$7:$AT$296,MATCH($A$6,'WF16'!$A$7:$A$296,0),MATCH(D$9,'WF16'!$X$6:$AT$6,0))","v":0.85},{"$f":"INDEX('WF16'!$X$7:$AT$296,MATCH($A$6,'WF16'!$A$7:$A$296,0),MATCH(E$9,'WF16'!$X$6:$AT$6,0))","v":0.56499999999999995},{"$f":"INDEX('WF16'!$X$7:$AT$296,MATCH($A$6,'WF16'!$A$7:$A$296,0),MATCH(F$9,'WF16'!$X$6:$AT$6,0))","v":47.8},{"$f":"INDEX('WF16'!$X$7:$AT$296,MATCH($A$6,'WF16'!$A$7:$A$296,0),MATCH(G$9,'WF16'!$X$6:$AT$6,0))","v":6.17},{"$f":"INDEX('WF16'!$X$7:$AT$296,MATCH($A$6,'WF16'!$A$7:$A$296,0),MATCH(H$9,'WF16'!$X$6:$AT$6,0))","v":29.2},{"$f":"INDEX('WF16'!$X$7:$AT$296,MATCH($A$6,'WF16'!$A$7:$A$296,0),MATCH(I$9,'WF16'!$X$6:$AT$6,0))","v":6.43},{"$f":"INDEX('WF16'!$X$7:$AT$296,MATCH($A$6,'WF16'!$A$7:$A$296,0),MATCH(J9,'WF16'!$X$6:$AT$6,0))","v":34900}]
[]
["Ix","Sx","rx","Zx","Iy","Sy","ry","Zy","rts","Cb"]
["in4","in3","in","in3","in4","in3","in","in3","in"]
[{"$f":"INDEX('WF16'!$X$7:$AT$296,MATCH($A$6,'WF16'!$A$7:$A$296,0),MATCH(A$13,'WF16'!$X$6:$AT$6,0))","v":4930},{"$f":"INDEX('WF16'!$X$7:$AT$296,MATCH($A$6,'WF16'!$A$7:$A$296,0),MATCH(B$13,'WF16'!$X$6:$AT$6,0))","v":329},{"$f":"INDEX('WF16'!$X$7:$AT$296,MATCH($A$6,'WF16'!$A$7:$A$296,0),MATCH(C$13,'WF16'!$X$6:$AT$6,0))","v":12},{"$f":"INDEX('WF16'!$X$7:$AT$296,MATCH($A$6,'WF16'!$A$7:$A$296,0),MATCH(D$13,'WF16'!$X$6:$AT$6,0))","v":378},{"$f":"INDEX('WF16'!$X$7:$AT$296,MATCH($A$6,'WF16'!$A$7:$A$296,0),MATCH(E$13,'WF16'!$X$6:$AT$6,0))","v":164},{"$f":"INDEX('WF16'!$X$7:$AT$296,MATCH($A$6,'WF16'!$A$7:$A$296,0),MATCH(F$13,'WF16'!$X$6:$AT$6,0))","v":31.3},{"$f":"INDEX('WF16'!$X$7:$AT$296,MATCH($A$6,'WF16'!$A$7:$A$296,0),MATCH(G$13,'WF16'!$X$6:$AT$6,0))","v":2.19},{"$f":"INDEX('WF16'!$X$7:$AT$296,MATCH($A$6,'WF16'!$A$7:$A$296,0),MATCH(H$13,'WF16'!$X$6:$AT$6,0))","v":49.2},{"$f":"INDEX('WF16'!$X$7:$AT$296,MATCH($A$6,'WF16'!$A$7:$A$296,0),MATCH(I13,'WF16'!$X$6:$AT$6,0))","v":2.7},{"$f":"IF(WF_Member!H31=0, WF_Member!H32,WF_Member!H31)","v":1},null," "]
[null,null,null,null,null,null,null,null,null,null,null," "]
["Lp","Lr","Weight","Iyc"," "," ",null,"rt","h","√(E/Fy)"]
["ft","ft","lbs/ft","in4"," "," ",null,"in","in",null," "]
[{"$f":"+'WF Bending Calculations'!C14","v":7.7355203574161706},{"$f":"+'WF Bending Calculations'!E14","v":22.638198313137021},{"$f":"INDEX('WF16'!$X$7:$AT$296,MATCH($A$6,'WF16'!$A$7:$A$296,0),MATCH(C$17,'WF16'!$X$6:$AT$6,0))","v":116},{"$f":"+tf*bf^3/12","v":81.998437499999994},null,null,null,{"$f":"INDEX('WF16'!$X$7:$AT$296,MATCH($A$6,'WF16'!$A$7:$A$296,0),MATCH(H$17,'WF16'!$X$6:$AT$6,0))","v":2.6739663181341107},{"$f":"INDEX('WF16'!$X$7:$AT$296,MATCH($A$6,'WF16'!$A$7:$A$296,0),MATCH(I$17,'WF16'!$X$6:$AT$6,0))","v":27.006999999999994},{"$f":"SQRT(E/Fy)","v":24.083189157584592}]
[{"$f":"IF(H27=\"Noncompact\",\"15 ed, p.3-5\",\"F2-5\")","v":"F2-5"},{"$f":"_xlfn.IFS(OR(BC_applicable = \"F2\",BC_applicable = \"F3\"),\"F2-6\",BC_applicable = \"F4\",\"F4-8\",BC_applicable = \"F5\",\"F5-5\")","v":"F2-6"},null,null,null,null,null,null,null," "]
[]
["Uniform compression - Table B4.1a",null,null,null,null,null,"Bending compression - Table B4.1b",null,null,null,null," "]
[null,null,"Flange",null,null,null,null,"Flange"]
[null,null," bf/2tf =  λ",{"$f":"+bf_over_2tf","v":6.17},null,"flg lambda",null," bf/2tf =  λ",{"$f":"bf_over_2tf","v":6.17}]
[null,null,"λr = 0.56*√(E/Fy)",{"$f":"0.56*sqrtefy","v":13.486585928247372},null,"   ratio",null,"λp = 0.38*√(E/Fy)",{"$f":"0.38*sqrtefy","v":9.1516118798821449}]
[null,null,null,null,null,{"$f":"(b_flange_lambda - b_flange_lambda_p)/(b_flange_lambda_r-b_flange_lambda_p)","v":-0.19968499137292292},null,"λr = 1.0*√(E/Fy)",{"$f":"sqrtefy","v":24.083189157584592}]
[null," ",{"$f":"IF(D24<=D25,\"Nonslender\",\"Slender\")","v":"Nonslender"},null,null,null,null,{"$f":"IF(I24<=I25,\"Compact\", IF(I24<=I26, \"Noncompact\",\"Slender\"))","v":"Compact"}]
[null,null,null,null,null,null,null,null,"For bending the applicable AISC section is:",{"$f":"'WF Bending Calculations'!B14","v":"F2"}]
[]
[null,null,"Web",null,null,null,null,"Web"]
[null,null," h/tw =  λ",{"$f":"h_over_tw","v":47.8},null,"web lambda",null," h/tw =  λ",{"$f":"h_over_tw","v":47.8}]
[null,null,"λr = 1.49*√(E/Fy)",{"$f":"1.49*sqrtefy","v":35.883951844801039},null,"   ratio",null,"λp = 3.76*√(E/Fy)",{"$f":"3.76*sqrtefy","v":90.552791232518061}]
[null,null,null,null,null,{"$f":"(b_web_lambda - b_web_lambda_p)/(b_web_lambda_r - b_web_lambda_p)","v":-0.91505826365753351},null,"λr = 5.70*√(E/Fy)",{"$f":"5.7*sqrtefy","v":137.27417819823216}]
[null," ",{"$f":"IF(D31<=D32,\"Nonslender\",\"Slender\")","v":"Slender"},null,null,null,null,{"$f":"IF(I31<=I32,\"Compact\", IF(I31<=I33, \"Noncompact\",\"Slender\"))","v":"Compact"}]
[]
["F2.2 Lateral-torsional buckling"]
[null,"Lb",{"$f":"+Lb","v":30},"ft",{"$f":"_xlfn.IFS($C$37<=$C$38,$A$42,$C$37<=$C$39,$A$43,$C$37>$C$39,$A$44)","v":"Lb > Lr  - Lateral-torsional buckling applies - F2-3 (c)"}]
[null,"Lp",{"$f":"+C48","v":7.7355203574161706},"ft"," "]
[null,"Lr",{"$f":"+Lr","v":22.638198313137021},"ft"," "]
[null,"L'p",{"$f":"+C50","v":4.7596792383946029},"ft","If flanges are noncompact - See p. 3-5 & 3-6, AISC Manual, "]
[null,null,null,null,null,null,null,null,null,"15th Edition."]
["Lb <= Lp - Lateral-torsional buckling does not apply (a)"]
["Lp < Lb <= Lr - Lateral-torsional buckling applies - F2-2 (b)"]
["Lb > Lr  - Lateral-torsional buckling applies - F2-3 (c)"]
[]
[]
["Compute Lp, L'p"]
[null,"Lp = 1.76ry*√(E/Fy)",{"$f":"1.76*ry*sqrtefy/12","v":7.7355203574161706},"ft",null,null,null,null,"F2-5"]
["   For noncompact flanges"]
[null,"L'p = Lp",{"$f":"C48+(Lr-C48)*C57","v":4.7596792383946029},"ft",null,null,null,null,null,"3-2 (AISC Manual, 15th ed, p. 3-5)"]
["L'p = Lp + (Lr-Lp)[(Mp - M'p)/(Mp - Mr)]"]
["M'p = Mn = Mp - (Mp - 0.7FySx)[(λ - λpf)/(λrt - λpf)]",null,null,null,null,null,null,null,"F3-1"]
[null,"(λ - λpf)/(λrt - λpf)",{"$f":"b_flange_lambda_ratio","v":-0.19968499137292292}]
[null,"(Mp - 0.7FySx)",{"$f":"Mp-0.7*Fy*sx/12","v":615.41666666666663},"kip-ft"," "]
[null,"M'p",{"$f":"Mp-C54*C53","v":1697.8894717740864},"kip-ft"]
[null,"Mr",{"$f":"0.7*Fy*sx/12","v":959.58333333333337},"kip-ft"]
[null,"(Mp - M'p)/(Mp - Mr)",{"$f":"+(Mp - C55)/(Mp - C56)","v":-0.199684991372923}]
[]
["Compute Lr  - F2 & F3 -  Eq. F2-6"]
[null,"Lr",{"$f":"+C67*C66/12","v":22.638198313137021},"ft",null,null,null,null,"F2-6"]
[null,"6.76*(0.7Fy/E)^2",{"$f":"6.76*(0.7*Fy/E)^2","v":9.8466111771700377E-6},null," "]
[null,"c",1,null,null,null,null,null,"F2-8a"]
[null,"(Jc)/(Sxho)",{"$f":"+(j*C62)/(sx*ho)","v":6.6931756672357085E-4},null,5.9842862067029465E-3]
[null,"((Jc)/(Sxho))2",{"$f":"+C63^2","v":4.479860051247617E-7},null,5.0837266414010761E-5]
[null,"Inner sqrt",{"$f":"SQRT(C64+C61)","v":3.2085194688975783E-3},null,4.5107507801301801E-3]
[null,"Outer sqrt",{"$f":"SQRT((C63+C65))","v":6.2272281439025093E-2},null,5.4922833068584684E-2]
[null,"1.95rtsE/0.7Fy",{"$f":"1.95*rts*E/(0.7*Fy)","v":4362.4285714285725},null,-4976.4000000000005]
[]
["Compute Lr - F4 - Eq. F4-8"]
[null,"Lr",{"$f":"+C77*C76/12","v":22.41991844169215},"ft",null,null,null,null,"F4-8"]
[null,"FL = 0.7Fy",{"$f":"0.7*Fy","v":35},"ksi","Sxt/Sxc = 1.0 >= 0.7 for any WF section",null,null,null,"F4-6a"]
[null,"6.76*(FL/E)^2",{"$f":"6.76*(C71/E)^2","v":9.8466111771700377E-6}]
[null,"(J)/(Sxcho)",{"$f":"+(j)/(sx*ho)","v":6.6931756672357085E-4}]
[null,"((J)/(Sxho))2",{"$f":"+C73^2","v":4.479860051247617E-7}]
[null,"Inner sqrt",{"$f":"SQRT(C74+C72)","v":3.2085194688975783E-3}]
[null,"Outer sqrt",{"$f":"SQRT((C73+C75))","v":6.2272281439025093E-2}]
[null,"1.95rtE/FL",{"$f":"1.95*rt*E/(C71)","v":4320.3655797281126}]
[]
[" "," "]
[]
[]
[]
[]
[" "]

{"sheet":"WF_Axial Calculations","index":3,"n_rows":63,"n_cols":10,"rows_kept":63,"cut":false,"hidden":false,"merged":[]}
["Wide Flange Analysis - LRFD",null,null,null,null,null,null,{"$f":"+WF_Member!I1","v":"Ver. 1.2"},{"$f":"ROW()","v":1},"axial_heading_start"]
["AISC 360-22 - Compression"]
[{"$f":"+WF_Member!A3","v":"Heading 1"},null,null,null,{"$f":"+WF_Member!E3","v":"Heading 2"},null,null,{"$f":"TODAY()","v":"2025-03-25"}]
[]
["WF Section","Fy - ksi","Pn",{"$f":"IF(B8= \"Slender\",D45, D13)","v":317.69175016202973},"kips"]
[{"$f":"\"W\" & Member","v":"W30x116"},{"$f":"+WF_Section_Properties!B6","v":50},"ɸcPn",{"$f":"+phi_c*D5","v":285.92257514582678},"kips"]
[]
["Section is:",{"$f":"IF(AND(B9=\"Nonslender\", B10 = \"Nonslender\"), \"Nonslender\",\"Slender\")","v":"Slender"}]
["Flanges:",{"$f":"+WF_Section_Properties!C27","v":"Nonslender"}]
["Web:",{"$f":"+WF_Section_Properties!C34","v":"Slender"}]
["Section has:","Both stiffened (web) and nonstiffened (flanges) elements",null,null,null,null,null,null,{"$f":"ROW()","v":11},"axial_heading_end"]
["E3 - Flexural buckling of members without slender elements",null,null,null,null,null,null,null,{"$f":"ROW()","v":12},"wo_slender_start"]
[null,null,"Pn = FnAg",{"$f":"+$D$19*area","v":317.69175016202973},"kips",null,null,"E3-1"]
[null,null,"Max Lc/r",{"$f":"MAX(WF_Member!$B$19,WF_Member!$C$19)","v":164.38356164383563}]
[null,null,"4.71*√(E/Fy)",{"$f":"4.71*sqrtefy","v":113.43182093222343}]
[null,null,"Fn = [0.658(Fy/Fe)]Fy",{"$f":"(0.658^(Fy/_Fe3))*Fy","v":6.9326910829091677},"ksi","Lc/r <= 4.71*√(E/Fy)",null,"E3-2"]
[null,null,"Fn = 0.877Fe",{"$f":"0.877*_Fe3","v":9.2892324608780612},"ksi","Lc/r > 4.71*√(E/Fy)",null,"E3-3"]
[null,null,"Fe = pi2*E/(Lc/r)2",{"$f":"pi^2*E/($D$14^2)","v":10.592055257557652},"ksi",null,null,"E3-4"]
[null,null,"Fn use  ==>",{"$f":"IF(D14<=D15,D16,D17)","v":9.2892324608780612},"ksi"]
[]
["E4 - Torsional and flexural-torsional buckling of single angles and members without slender elements"]
[null,null,"Pn = FnAg",{"$f":"IF(D14<=D15,D23,D24)","v":25.668122156600933},"kips",null,null,"E4-1"]
[null,null,"Fn = [0.658(Fy/Fe)]Fy",{"$f":"(0.658^(Fy/_Fe4))*Fy","v":24.458914350499743},"ksi","Fe from below"]
[null,null,"Fn = 0.877Fe",{"$f":"0.877*_Fe4","v":25.668122156600933},"ksi","Fe from below"]
[]
["   (a) For double symmetric members twisting about the shear center"]
[null,null,"π2ECw/Lcz2",{"$f":"+pi^2*E*Cw/(WF_Member!D18*12)^2","v":77075.692435262419}]
[null,null,"GJ",{"$f":"+j*g","v":72016}]
[null,null,"1/(Ix+Iy)",{"$f":"1/(Ix+Iy)","v":1.9630938358853554E-4}]
[null,null,"Fe = (π2ECw/Lcz2 + GJ)*(1/(Ix + Iy))",{"$f":"+(D27+D28)*D29","v":29.268098240137896},"ksi",null,null,"E4-2"]
[]
["   (b) For doubly symmetric I-shaped members with minor-axis lateral bracing offset from the shear center"]
[null,null,"ro2 = rx2 + ry2 + ya2 + xa2",{"$f":"rx^2 + ry^2 + ya^2 + xa^2","v":148.7961},"in2"," ",null,"E4-11"]
[null,null,"π2EIy/Lcz2",{"$f":"+pi^2*E*Iy/(WF_Member!D18*12)^2","v":362.18950026885489},"k/in"]
[null,null,"ho2/4 + ya2",{"$f":"ho^2/4 + ya^2","v":213.16},"in2"]
[null,null,"ho2/4 + (Ix/Iy)xa2",{"$f":"ho^2/4 +(Ix/Iy)* xa^2","v":213.16},"in2"]
[null,null,"1/(Ag*(ro)2)",{"$f":"1/(area*ro_squared)","v":1.9650895474996553E-4},"1/in4"]
[null,null,"Fe = [π2EIy/Lcz2*(ho2/4 + ya2) + GJ]*1/(Ag*(ro)2)",{"$f":"(D34*D35+D28)*D37","v":29.323127907491784},"ksi",null,null,"E4-10"]
[]
["   (c) For doubly symmetric I-shaped members with major-axis lateral bracing offset from the shear center"]
[null,null,"Fe = [π2EIy/Lcz2*(ho2/4 + (Ix/Iy)ya2) + GJ]*",{"$f":"+(D34*D36 + D28)*D37","v":29.323127907491784},"ksi",null,null,"E4-12"]
[null,null,"1/(Ag*(ro)2)"]
[null,null,"Fe Use ==>",{"$f":"IF(AND(xa=0,ya=0),D30,MIN(D38,D41))","v":29.268098240137896},"ksi",null,null,null,{"$f":"ROW()","v":43},"wo_slender_end"]
["E7 - Members with slender elements:",null,null,null,null,null,null,null,{"$f":"ROW()","v":44},"w_slender_start"]
[null,null,"Pn = FnAe",{"$f":"Fn*Aeff","v":317.69175016202973},"kips",null,null,"E7-1"]
[null,null,null,"Effective area "]
[null,null,null,"Flanges",null,"Web"]
[null,null,null,{"$f":"+B9","v":"Nonslender"},null,{"$f":"+B10","v":"Slender"}]
[null,null,"bf or h",{"$f":"bf","v":10.5},"in",{"$f":"tw*h_over_tw","v":27.006999999999994},"in"]
[null,null,"λ",{"$f":"+WF_Section_Properties!D24","v":6.17},null,{"$f":"+WF_Section_Properties!D31","v":47.8}]
[null,null,"λr",{"$f":"+WF_Section_Properties!D25","v":13.486585928247372},null,{"$f":"+WF_Section_Properties!D32","v":35.883951844801039}]
[null,null,"λr*sqrt(Fy/Fn)",{"$f":"D51*SQRT(Fy/Fn)","v":31.289391002642976},null,{"$f":"F51*SQRT(Fy/Fn)","v":83.252129632032194},null," "]
[null,null,"Fel = [c2*( λr/λ)]^2*Fy",{"$f":"($F$63*($D$51/$D$50))^2*Fy","v":409.96456004770306},"ksi",{"$f":"($F$63*$F$51/F50)^2*Fy","v":48.35677539346301},"ksi","E7-5",null," "]
[null,null,"sqrt(Fel/Fn)",{"$f":"SQRT(D53/Fn)","v":6.6432904721981032},null,{"$f":"SQRT(F53/Fn)","v":2.2815960212962803}]
[null,null,"λr*sqrt(Fel/Fn)",{"$f":"+D51*D54","v":89.595307799606772},null,{"$f":"+F51*F54","v":81.872681757485367}]
[null,null,"1 - c1*sqrt(Fel/Fn)",{"$f":"1-E63*D54","v":-0.19579228499565859},null,{"$f":"1-(E63*F54)","v":0.58931271616666958}]
[null,null,"be = b*[1 - c1*sqrt(Fel/Fn}]*sqrt(Fel/Fn)",{"$f":"(D49/2)*D56*D54","v":-6.8287013625681601},"in",{"$f":"F49*F56*F54","v":36.312897824479322},"in",null,null," "]
[null,null,"be Use ==>",{"$f":"IF(D48 = \"Nonslender\", D49,D57)","v":10.5},"in",{"$f":"IF(F57<=F49,F57,F49)","v":27.006999999999994},"in","E7-2, E7-3"]
[null,null,"Lost length",{"$f":"MAX(0,+D49-D58)","v":0},"in",{"$f":"MAX(0,+F49-F58)","v":0},"in"]
[null,null,"Aeff = Ag - t*Lost length",{"$f":"+area- tf*2*'WF_Axial Calculations'!D59-tw*F59","v":34.200000000000003},"in2"," "]
[]
[null,null,null,"Table E7.1","c1","c2"]
[null,null,null,"(a)",0.18,1.31,null,null,{"$f":"ROW()","v":63},"w_slender_end"]

{"sheet":"WF Bending Calculations","index":4,"n_rows":264,"n_cols":15,"rows_kept":264,"cut":false,"hidden":false,"merged":[]}
["Wide Flange Analysis - LRFD",null,null,null,null,null,null,null,null,null,{"$f":"+WF_Member!I1","v":"Ver. 1.2"}]
["AISC 360-22 - Flexure"]
[{"$f":"+WF_Member!A3","v":"Heading 1"},null,null,null,{"$f":"+WF_Member!E3","v":"Heading 2"},null,null,null,null,null,{"$f":"TODAY()","v":"2025-03-25"}]
[]
["WF Section",null,"Fy - ksi",null,null,null,null,null,null,null,null,null,null,null," "]
[{"$f":"\"W\" & Member","v":"W30x116"},null,{"$f":"+WF_Section_Properties!B6","v":50}]
[null,null,null,null,"Mnx",{"$f":"_xlfn.IFS(BC_applicable=\"F2\",$H$30,BC_applicable = \"F3\",$H$63,BC_applicable = \"F4\",#REF!,BC_applicable= \"F5\",#REF!)","v":612.91642321123925},"kip-ft"]
["For bending:",null,null,null,"ɸbMnx",{"$f":"+phi_b*F7","v":551.62478089011529},"kip-ft"," "]
[null,"Flanges:",{"$f":"+WF_Section_Properties!H27","v":"Compact"},null,"Mny",{"$f":"+H85","v":205},"kip-ft"]
[null,"Web:",{"$f":"+WF_Section_Properties!H34","v":"Compact"},null,"ɸbMny",{"$f":"+phi_b*F9","v":184.5},"kip-ft"]
[]
[null,"Governs"]
[null,null,"Lp - ft","AISC Eq.","Lr - ft","AISC Eq.","User Note: Lp for WF sections which have compact"]
[null,{"$f":"_xlfn.IFS(B15<>\"*\",B15,B16<>\"*\",B16,B17<>\"*\",B17,B18<>\"*\",B18)","v":"F2"},{"$f":"_xlfn.IFS($B$14=\"F2\",C15,$B$14=\"F3\",C16,$B$14=\"F4\",C17,$B$14=\"F5\",C18)","v":7.7355203574161706},null,{"$f":"_xlfn.IFS($B$14=\"F2\",E15,$B$14=\"F3\",E16,$B$14=\"F4\",E17,$B$14=\"F5\",E18)","v":22.638198313137021},null,"webs and noncompact or slender flanges (Section F3) "]
["F2",{"$f":"IF(AND(C9=\"Compact\", C10=\"Compact\"),\"F2\",\"*\")","v":"F2"},{"$f":"1.76*ry*sqrtefy/12","v":7.7355203574161706},"F2-5",{"$f":"+WF_Section_Properties!C60","v":22.638198313137021},"F2-6","is computed using Formula 3-2 on page 3-5 of the"]
["F3",{"$f":"IF(AND(C9<>\"Compact\",C10 = \"Compact\"),\"F3\",\"*\")","v":"*"},{"$f":"+WF_Section_Properties!C50","v":4.7596792383946029},"3-2",{"$f":"+E15","v":22.638198313137021},"F2-6"," AISC Manual, 15th edition.  The manual refers to "]
["F4"," "," "," "," "," ","this value as L'p; in this workbook it is generally refered"]
["F5"," "," "," "," "," "," to as Lp as there is really no need to distinguish it."]
[null,null,null,null,null,null,null,null,null,null,"AISC Eq."]
[null,null,"Lp","1.76ry√(E/Fy)",null,null,null,null,null,null,"F2-5"]
[null,null,"Lp = L'p","Lp+(Lr-Lp)[(Mp-M'p)/(Mp-Mr)]",null,null,null,null,null,null,"3-2"]
[null,null,"Lp = L'p","M'p = Mp-(Mp-0.7FySx)[(λ - λpf)/(λrf - λpf)]",null,null,null," ",null,null,"F3-1"]
[null,null,"Lp","1.1rt√(E/Fy)",null,null,null,null,null,null,"F4-7"]
[]
[null,null,"Lr","1.95rts(E/0.7Fy)√{[(Jc/Sxho)+√[(Jc/sxho)2 + 6.76(0.7Fy/E)2]}",null,null,null,null,null,null,"F2-6"]
[null,null,"Lr","1.95rt(E/0.7FL)√{[(J/Sxcho)+√[(J/sxcho)2 + 6.76(0.7FL/E)2]}",null,null,null,null,null,null,"F4-8"]
[null,null,"Lr","πrt√(E/0.7Fy)",null,null,null,null,null,null,"F5-5"]
[]
["F2. Double symmetric compact I-shaped members and channels bent about their major axis",null,null,null,null,null,null,null,null,null,null,{"$f":"ROW()","v":29},"F2_Start"]
[null,null,null,null,null,null,"Mn  Use ==>",{"$f":"MIN(H33,H36)","v":612.91642321123925},"kip-ft"]
[]
[null,"1. Yielding"]
[null,null,null,null,null,null,"Mn = Mp = FyZx ",{"$f":"Fy*Zx/12","v":1575},"kip-ft",{"$f":"12*Mp","v":18900},"F2-1"]
[null,null,null,null,null,null,null," "]
[null,"2. Lateral-Torsional Buckling"]
[null,null,null,null,null,null,"Mn",{"$f":"IF(Lb<=Lp,IF($B$14=\"F3\",\"N/A   Lb<= L'p\",\" N/A  Lb <= Lp\"),IF(Lb<=Lr,$H$42,$H$54))","v":612.91642321123925},"kip-ft"]
[null,null,null,null,null,null,{"$f":"\"Lb =  \" & ROUND(Lb,1)  &   \" ft   \" & IF($B$14 = \"F3\", \"L'p\",\"Lp\") & \"  =  \" & ROUND(Lp,1)  &    \" ft   Lr = \" & ROUND(Lr,1) & \" ft\"","v":"Lb =  30 ft   Lp  =  7.7 ft   Lr = 22.6 ft"},null," "]
[]
[null,"   (a) When Lb <= Lp, the limit state of lateral-torsional buckling does not apply."]
[]
[null,"   (b) When Lp < Lb <= Lr"]
[null,null,null,null,null,null,"Mn = Cb[Mp - (Mp - 0.7FySx)((Lb-Lp)/(Lr-Lp))] <= Mp",{"$f":"+$H$45*$H$51","v":655.57250600071586},"kip-ft",null,"F2-2"]
[null,null,null,null,"For tension",null,"Pey = π2EIy/Lb2",{"$f":"pi^2*E*Iy/(12*Lb)^2","v":362.18950026885489},null,null,"H1-2"]
[null,null,null,null,"For tension",null,"Pr/Pey",{"$f":"ABS(WF_Member!G34)/'WF Bending Calculations'!H43","v":0}]
[null,null,null,null,null,null,"Cb",{"$f":"+IF(WF_Member!H31= 0, WF_Member!H32,WF_Member!H31)","v":1}," ",null," "]
[null,null,null,null,null,null,"c ",1,null,null,"F2-8a"]
[null,null,null,null,null,null,"(Lb-Lp)/(Lr-Lp)",{"$f":"(Lb-Lp)/(Lr-Lp)","v":1.4939918656724998}]
[null,null,null,null,null,null,"0.7FySx",{"$f":"0.7*Fy*sx/12","v":959.58333333333337},"kip-ft",null,null,null," "]
[null,null,null,null,null,null,"Mp - 0.7FySx",{"$f":"Mp-H48","v":615.41666666666663}]
[null,null,null,null,null,null,"(Mp - 0.7FySx)[(Lb-Lp)/(Lr-Lp)]",{"$f":"+H49*H47","v":919.42749399928414},"kip-ft"]
[null,null,null,null,null,null,"Mp-[Mp - 0.7FySx[(Lb-Lp)/(Lr-Lp)]",{"$f":"+Mp-H50","v":655.57250600071586},"kip-ft"]
[]
[null,"   (c) When Lb > Lr"]
[null,null,null,null,null,null,"Mn = FcrSx <=Mp",{"$f":"$H$59*sx/12","v":612.91642321123925},"kip-ft",null,"F2-3"]
[null,null,null,null,null,null,"(Lb/rts)2",{"$f":"(12*Lb/rts)^2","v":17777.777777777774}]
[null,null,null,null,null,null,"Cbπ^2E/(Lb/rts)2",{"$f":"+H45*pi^2*E/H55","v":16.099764981463128}]
[null,null,null,null,null,null,"0.078(Jc)/(Sxho)",{"$f":"0.078*(j*H46)/(sx*ho)","v":5.2206770204438525E-5}]
[null,null,null,null,null,null,"Sqrt term",{"$f":"SQRT(1+H57*H55)","v":1.3885677366228908}]
[null,null,null,null,null,null,"Fcr",{"$f":"H56*H58","v":22.355614220470734},"ksi",null,"F2-4"]
[null,null,null,null,null,null,null,null,null,null,null,{"$f":"ROW()","v":60},"F2_End"]
["F3. Doubly symmetric I-shaped members with compact webs ",null,null,null,null,null,null,null,null,null,null,{"$f":"ROW()","v":61},"F3_Start"]
["     and noncompact or slender flanges bent about their major axis."]
[null,null,null,null,null,null,"Mn",{"$f":"IF(C9 = \"Compact\",\"NA\",MIN($H$67,_xlfn.IFS(C9=\"Noncompact\",$H$73,C9=\"Slender\",$H$78)))","v":"NA"},"kip-ft",null,null,null," "," "]
[]
[null,"1. Lateral-Torsional Buckling"]
[null,"   The provisions of Section F2.2 shall apply.",null,null,null,null,null,null," "]
[null,null,null,null,null,null,{"$f":"+G36","v":"Mn"},{"$f":"IF(Lb<=Lp,IF($B$14=\"F3\",\"N/A   Lb<= L'p\",\"N/A     Lb<=Lp\"),IF(Lb<=Lr,$H$42,$H$54))","v":612.91642321123925},{"$f":"+I36","v":"kip-ft"},null,null,null,null,null," "]
[null,null,null,null,null,null,{"$f":"\"Lb =  \" & ROUND(Lb,1)  &   \" ft   \" & IF($B$14 = \"F3\", \"L'p\",\"Lp\") & \"  =  \" & ROUND(Lp,1)  &    \" ft   Lr = \" & ROUND(Lr,1) & \" ft\"","v":"Lb =  30 ft   Lp  =  7.7 ft   Lr = 22.6 ft"},null," "]
[]
[null,"2. Compression Flange Local Buckling",null,null,null,null,null," "]
[null,"   (a) For sections with noncompact flanges"]
[]
[null,null,null,null,null,null,"Mn = Mp -(Mp - 0.70FySx)[(λ - λpf)/(λrf - λpf)]",{"$f":"$H$33-$H$75*H74","v":1697.8894717740864},"kip-ft",null,"F3-1"]
[null,null,null,null,null,null,"(λ - λpf)/(λrf - λpf)",{"$f":"b_flange_lambda_ratio","v":-0.19968499137292292}]
[null,null,null,null,null,null,"Mp - 0.70FySx",{"$f":"+H33-0.7*Fy*sx/12","v":615.41666666666663},"kip-ft"]
[]
[null,"   (b) For sections with slender flanges"]
[null,null,null,null,null,null,"Mn = 0.9EkcSxc/λ2",{"$f":"0.9*E*H80*sx/WF_Section_Properties!$I$24^2/12","v":10875.040279637617},"kip-ft",null,"F3-2"]
[null,null,null,null,null,null,"kc = 4/(√(h/tw))",{"$f":"4/(SQRT(h_over_tw))","v":0.57855685414037172}]
[null,null,null,null,null,null,"kc  ",{"$f":"MIN(MAX(0.35,H79),0.76)","v":0.57855685414037172},">=0.35,= < 0.76"]
[null,null,null,null,null,null,null,null,null,null,null,{"$f":"ROW()","v":81},"F3_End"]
[null,null,null,null,null,null,null,null,null,null,null,{"$f":"ROW()","v":82},"F6_Start"]
["F6. I-shaped members and channels bent about their minor axis"]
[null,null,null,null,null,null," "," "]
[null,null,null,null,null,null,"Mn =",{"$f":"IF($H$88<=$H$93,$H$88,$H$93)","v":205},"kip-ft"]
[]
[null,"1. Yielding"]
[null,null,null,null,null,null,"Mn = Mp = FyZy <= 1.6FySy",{"$f":"MIN(H89:H90)","v":205},"kip-ft","F6-1"]
[null,null,null,null,null,null,"FyZy",{"$f":"Fy*Zy/12","v":205},"kip-ft"]
[null,null,null,null,null,null,"1.6FySy",{"$f":"1.6*Fy*Sy/12","v":208.66666666666666},"kip-ft"]
[]
[null,"2. Flange Local Buckling"]
[null,null,null,null,null,null,"Mn =",{"$f":"_xlfn.IFS($C$9=\"Compact\",\"NA\",$C$9=\"Noncompact\",H98,$C$9=\"Slender\",H106)","v":"NA"},"kip-ft"]
[]
[null,"   (a) For section with compact flanges, the limit state of flange local buckling does not apply"]
[]
[null,"   (b) For sections with noncompact flanges       "]
[null,null,null,null,null,null,"Mn = Mp -(Mp - 0.70FySy)[(λ - λpf)/(λrf - λpf)] <=FyZy",{"$f":"H88-H100*H99","v":227.7058475606961},"kip-ft"]
[null,null,null,null,null,null,"(λ - λpf)/(λrf - λpf)",{"$f":"b_flange_lambda_ratio","v":-0.19968499137292292}]
[null,null,null,null,null,null,"Mp-0.70FySy",{"$f":"H88-0.7*Fy*Sy/12","v":113.70833333333333},"kip-ft"]
[null,null,null,null,null,null," "," "," ","F6-2"]
[]
[null,"   (c) For sections with slender flanges                 "]
[null,null,null,null,null,null,"Mn = FcrSy",{"$f":"H105*Sy/12","v":1387.9645502645501},"kip-ft"]
[null,null,null,null,null,null,"Fcr = 0.70E/(b/tf)2",{"$f":"(0.7*E)/((bf/2)/tf)^2","v":532.1269841269841},"ksi","F6-4"]
[null,null,null,null,null,null,null,null,null,"F6-3",null,{"$f":"ROW()","v":106},"F6_End"]
["Appendix 8 - Approximate Analysis",null,null,null,null,null,null,null,null,null,null,{"$f":"ROW()","v":107},"F8_AppStart"]
[null,null,null,null,null,null,"Applicable?","No"]
[null,null,null,null,null,null,"Transverse loading?","No"]
[null,null,null,null,null,null,"Mr = B1Mnt + B2Mlt",1,null,"A-8-1"]
[null,null,null,null,null,null,"Pr = Pnt + Plt"]
[null,null,null,null,null,null,"Pr = Pnt + B2Plt",{"$f":"+WF_Member!B11","v":0},"kips","A-8-2"]
[null,null,null,null,null,null,"B2",0,null,"Δ not applicable."]
[null,null,null,null,null,null,"1-α(Pr/Pel",{"$f":"1-H120*(H112/H121)","v":1}]
[null,null,null,null,null,null,"B1 = Cm/(1-α(Pr/Pel)) => 1",{"$f":"H126/H114","v":{"$error":"#DIV/0!"}},null,"A-8-3",null,null,null,"   "]
[null,null,null,null,null,null,"B1 ==> Use",{"$f":"MAX(H115,1)","v":{"$error":"#DIV/0!"}}]
[null,null,null,null,null,null,"Smaller M",{"$f":"MIN(WF_Member!$G$11,WF_Member!$H$11)","v":0}]
[null,null,null,null,null,null,"Larger M",{"$f":"MAX(WF_Member!$G$11,WF_Member!$H$11)","v":0}]
[null,null,null,null,null,null,"Cm = 0.6 - 0.4(M1/M2)",{"$f":"0.6-0.4*-(H117/H118)","v":{"$error":"#DIV/0!"}},null,"A-8-4","No trans.load",null,null," "]
[null,null,null,null,null,null,"α",1]
[null,null,null,null,null,null,"Pel = π2EI*/(Lcl)2",{"$f":"pi^2*H122/(H123*12)^2","v":10887.769733691797},"kips","A-8-5",null," "," "]
[null,null,null,null,null,null,"EI* = EI",{"$f":"E*Ix","v":142970000},"kip-in2","Direct analysis method"]
[null,null,null,null,null,null,"Lcl",{"$f":"Lb","v":30},"ft"]
[null,null,null,null,null,null,"ψ",{"$f":"ABS(+omega)","v":0.4}]
[null,null,null,null,null,null,"Cm",{"$f":"IF(H124<>0,1-H124*H120*(H112/H121),1)","v":1},null,"Table C-A-8.1","Trans. Load"]
[null,null,null,null,null,null,"Cm ==> Use",{"$f":"IF(H109=\"No\",H119,H125)","v":{"$error":"#DIV/0!"}}]
[]
[]
[]
[null,null,null,null,null,null,null,null,null,null,null,{"$f":"ROW()","v":130},"F8_AppEnd"]
[]
[]
[]
[]
[]
[]
[]
[]
[]
[]
[]
[]
[]
[]
[]
[]
[]
[]
[]
[]
[]
[]
[]
[]
[]
[]
[]
[]
[]
[]
[]
[]
[]
[]
[]
[]
[]
[]
[]
[]
[]
[]
[]
[]
[]
[]
[]
[]
[]
[]
[]
[]
[]
[]
[]
[]
[]
[]
[]
[]
[]
[]
[]
[]
[]
[]
[]
[]
[]
[]
[]
[]
[]
[]
[]
[]
[]
[]
[]
[]
[]
[]
[]
[]
[]
[]
[]
[]
[]
[]
[]
[]
[]
[]
[]
[]
[]
[]
[]
[]
[]
[]
[]
[]
[]
[]
[]
[]
[]
[]
[]
[]
[]
[]
[]
[]
[]
[]
[]
[]
[]
[]
[]
[]
[]
[]
[]
[]
[]
[]
[]
[]
[null,null,null,null,null,null,null,"No"]
[null,null,null,null,null,null,null,"No"]

{"sheet":"WF Tension Calculations","index":5,"n_rows":18,"n_cols":10,"rows_kept":18,"cut":false,"hidden":false,"merged":[]}
["Wide Flange Analysis - LRFD",null,null,null,null,null,null,null,{"$f":"+WF_Member!I1","v":"Ver. 1.2"}," "]
["AISC 360-22 - Tension"]
[{"$f":"+WF_Member!A3","v":"Heading 1"},null,null,null,{"$f":"+WF_Member!E3","v":"Heading 2"},null,null,null,{"$f":"TODAY()","v":"2025-03-25"}]
[]
["WF Section","Fy - ksi","Fu - ksi",null,null,"Pn",{"$f":"+D13","v":1710.0000000000002},"kips"]
[{"$f":"\"W\" & Member","v":"W30x116"},{"$f":"+Fy","v":50},{"$f":"+Fu","v":65},"ɸt_yield",{"$f":"+phi_t_yield","v":0.9},"ɸt_yield*Pn",{"$f":"+phi_t_yield*G5","v":1539.0000000000002},"kips"]
[null,null,null,null,null,"Pn",{"$f":"+D16","v":1667.2500000000002},"kips"]
[null,null,null,"ɸt_rupture",{"$f":"phi_t_rupture","v":0.75},"ɸt_rupture*Pn",{"$f":"+phi_t_rupture*G7","v":1250.4375000000002},"kips"]
[]
[]
["D2. Tensile Strength"]
["   (a) Tensile yielding"]
[null,null,"Pn = FyAg",{"$f":"+Fy*area","v":1710.0000000000002},"kips",null,null,null,"D2-1"]
[]
["   (b) Tensile rupture"]
[null,null,"Pn = FuAe",{"$f":"Fu*D18","v":1667.2500000000002},"kips",null,null,null,"D2-2"]
[null,null,"U",{"$f":"+U","v":0.75}]
[null,null,"Ae = AgU",{"$f":"+area*D17","v":25.650000000000002},"in2"]

{"sheet":"WF Shear Calculations","index":6,"n_rows":44,"n_cols":9,"rows_kept":44,"cut":false,"hidden":false,"merged":[]}
["Wide Flange Analysis - LRFD",null,null,null,null,null,null,null,{"$f":"+WF_Member!I1","v":"Ver. 1.2"}]
["AISC 360-22 - Shear"]
[{"$f":"+WF_Member!A3","v":"Heading 1"},null,null,null,{"$f":"+WF_Member!E3","v":"Heading 2"},null,null,null,{"$f":"TODAY()","v":"2025-03-25"}]
[null," "]
["WF Section","Fy - ksi",null,"Vnx",{"$f":"+E12","v":508.5},"kips"," "]
[{"$f":"\"W\" & Member","v":"W30x116"},{"$f":"+WF_Section_Properties!B6","v":50},null,"ɸvVnx",{"$f":"H6*E5","v":508.5},"kips","ɸv",{"$f":"IF(E16<=E17,1,phi_v)","v":1}," "]
[null,null,null,"Vny",{"$f":"+E32","v":535.5},"kips"]
[null,null,null,"ɸvVny",{"$f":"E7*H8","v":481.95},"kips","ɸv",0.9]
[]
["G2. I-Shaped members and channels"]
["1. Shear Strength of Webs"]
[null,null,null,"Vn = 0.6FyAwCv1",{"$f":"0.6*Fy*E13*E27","v":508.5},"kips",null,null,"G2-1"]
[null,null,null,"Aw",{"$f":"+depth*tw","v":16.95},"in2"]
[]
["   (a) For webs of rolled I-shaped members with h/tw <=2.24√(E/Fy)"]
[null,null,null,"h/tw",{"$f":"h_over_tw","v":47.8}]
[null,null,null," 2.24√(E/Fy)",{"$f":"2.24*sqrtefy","v":53.946343712989488}]
[null,null,null,"Cv1",1,null,null,null,"G2-2"]
[null,null,null," "," "]
["   (b) For all other I-shaped members and channels"]
[" ",null,null,"kv",5.34,"No transverse stiffeners"]
[null,null,null,"1.10√(kvE/Fy)",{"$f":"1.1*SQRT(E21*E/Fy)","v":61.217742526166383}]
[null,null,null,"Cv1",1,null,null,null,"G2-3"]
[]
[null,null,null,"Cv1 = 1.10[√(kvE/Fy)]/(h/tw)",{"$f":"1.1*SQRT(E21*E/Fy)/E16","v":1.2807059105892549},null,null,null,"G2-4"]
[]
[null,null,null,"Cv1  Use ==>",{"$f":"_xlfn.IFS(E16<=E17,E18,E16<=E22,E23,TRUE,E25)","v":1},null,null,null," "]
[]
[]
["G6. Doubly Symmetric and Singly Symmetric Members Subjected to Minor-Axis Shear"]
[]
[null,null,null,"Vn = 0.6FybftfCv2",{"$f":"0.6*Fy*bf*tf*E44*2","v":535.5},"kips",null,null,"G6-1"]
[null,null,null,"kv",1.2]
[null,null,null,"bf/2tf",{"$f":"+bf_over_2tf","v":6.17}]
[null,null,null,"1.10√(kvE/Fy)",{"$f":"1.1*SQRT(E33*E/Fy)","v":29.019993108200424}]
[null,null,null,"1.37√(kvE/Fy)",{"$f":"1.37*SQRT(E33*E/Fy)","v":36.143082325667805}," "]
[]
["      (i) When bf/2tf <= 1.10√(kvE/Fy)"]
[null,null,null,"Cv2 ",1,null,null,null,"G2-9"]
["      (ii) When 1.10√(kvE/Fy) < bf/2tf <= 1.37√(kvE/Fy)"]
[null,null,null,"Cv2 = 1.10[√(kvE/Fy)]/(bf/2tf)",{"$f":"E25/E34","v":0.20756983964169448},null,null,null,"G2-10"]
["      (iii) When bf/2tf > 1.37√(kvE/Fy)"]
[null,null,null,"Cv2 = 1.5kvE/[(bf/2tf)2Fy]",{"$f":"1.5*E33*E/(E34^2*Fy)","v":27.423960240511281}," ",null,null,"G2-11"]
[null,null,null,"Cv2 Use ==>",{"$f":"_xlfn.IFS(E34<=E35,E39,E34<=E36,E41,TRUE,E43)","v":1}]

{"sheet":"WF16","index":7,"n_rows":296,"n_cols":69,"rows_kept":296,"cut":false,"hidden":false,"merged":[]}
[null,null,null,null,null,null,null,null,null,null,null,null,null,null,null,null,null,null,null,null,null,null,null,null,null,null,null,null,null,null,null,null,null,null,null,null,null,null,null,null,null,null,null,null,null,null,null,null,{"$f":"\"Fy =  \" & Fy","v":"Fy =  50"}," ksi"]
[null,null,null," ",null,null,null,null,null,null,null,null,null,null,null,null,null,null,null,null,null,null,null,null,null,null,null,null,null,null,null,null,null,null,null,null,null,null,null,null,null,null,null,null,null,null,null,"Axial compression",null,"Flexural compression"]
[null,null,null,null," ",null,null,null,null,null,null,null,null,null,null,null,null,null,null,null,null,null,null,null," ",null,null,null,null,null,null,null,"This column "," ",null,null,null,null,null,null,null,null,null,null,null,"This column ",null,"Flanges","Web","Flanges","Web",null,"Lp - F2-5","Lr - F2-6",null,null,null,null,null,"Lp - F4-7","Lr - F4-8",null,null,null,null,null,null,"Lp (F5 = F4-7)","Lr - F5-5"]
[null,null,null," "," ",null,null,null,null,null,null,null,null,null,null,null,null,null,null,null,null,null,null,null,null,null,null,null,null,null,null,null,"inserted by me",null,null,null,null,null,null,null,null,null,null,null,null,"inserted by me","λp",null,null," 0.38*√(E/Fy)","3.76*√(E/Fy)",null,"ft","ft","6.76*(0.7Fy/E)2","c",null,null,null,"ft","ft","FL = 0.7Fy ","6.76(FL/E)2",null,null,null,null,"ft","ft"]
[null,null,null,"Column number for Index/Match ==>",null,null,null,null,null,null,null,null,null,null,null,null,null,null,null,null,null,null,null,null,null,null,null,null,null,null,null,null,null,11,12,13,14,15,16,17,18,19,20,21,22,23,"λp",null,null,{"$f":"0.38*sqrtefy","v":9.1516118798821449},{"$f":"3.76*sqrtefy","v":90.552791232518061},null,null,null,{"$f":"6.76*(0.7*Fy/E)^2","v":9.8466111771700377E-6},1,null,null,null,null,null,{"$f":"0.7*Fy","v":35},{"$f":"6.76*(BJ5/E)^2","v":9.8466111771700377E-6}]
["AISC_Manual_Label",null,null,"Depths","wf_blank_col","SelWeights",null,null,null,null,null,null,null,null,null,null,null,null,null,null,null,null,null,"Weight","Area","depth","bf","tw","tf","kdes","bf/2tf","h/tw","h","Ix","Zx","Sx","rx","Iy","Zy","Sy","ry","J","Cw","rts","ho","rt","λr "," 0.56*√(E/Fy)"," 1.49*√(E/Fy)","1.0*√(E/Fy)"," 5.70*√(E/Fy)",null," 1.76ry*√(E/Fy)",null,"(Jc)/(Sxho)","((Jc)/(Sxho))2","Inner sqrt","Outer sqrt","1.95rtsE/0.7Fy","1.1rt√(E/Fy)",null,"aw = hctw/bftf","(J)/(Sxho)","((J)/(Sxho))2","Inner sqrt","Outer sqrt","1.95rsE/FL","1.1rt√(E/Fy)","πrt√(E/Fy)"]
["wf_section",null,null,null,null,null,44,40,36,33,30,27,24,21,18,16,14,12,10,8,6,5,4,null,null,null,null,null,null,null,null,null,null,null,null,null,null,null,null,"wf_Sy","wf_ry","wf_J","wf_Cw","wf_rts","wf_ho","wf_rt","λr ",{"$f":"0.56*sqrtefy","v":13.486585928247372},{"$f":"1.49*sqrtefy","v":35.883951844801039},{"$f":"1*sqrtefy","v":24.083189157584592},{"$f":"5.7*sqrtefy","v":137.27417819823216},null," ",null,null,null,null,null,null," ",null," "]
["W44X408",{"$f":"RIGHT(A8,LEN(A8)-1)","v":"44X408"},{"$f":"LEFT(B8,(FIND(\"X\",B8)-1))","v":"44"},{"$f":"_xlfn.UNIQUE(C8:C296)","v":"44"},null,{"$f":"INDEX('WF16'!$G$8:$W$45,,WF_Member!$K$5)","v":391},"408 - 16.125","655","925","387",391,"539 - 15.25","370","275","311 - 12","100","873","336","112","67","25",19,"13 - 4",408,120,44.8,16.100000000000001,1.22,2.17,2.96,3.71,31.9,{"$f":"+AF8*AB8","v":38.917999999999999},38700,2000,1730,18,1520,297,189,3.56,134,691000,4.33,42.6,{"$f":"$AA8/(SQRT(12*(1+$BJ8/6)))","v":4.1966329811065393},null,{"$f":"IF($AE8<=$AV$7,\"N\",\"S\")","v":"N"},{"$f":"IF($AF8<=$AW$7,\"N\",\"S\")","v":"N"},{"$f":"_xlfn.IFS($AE8<=$AX$5,\"C\",$AE8<=$AX$7,\"N\",TRUE,\"S\")","v":"C"},{"$f":"_xlfn.IFS($AF8<=$AY$5,\"C\",$AF8<=$AY$7,\"N\",TRUE,\"S\")","v":"C"},{"$f":"IF(AND(AX8=\"C\", AY8= \"C\"),\"F2\",\"F3\")","v":"F2"},{"$f":"1.76*AO8*sqrtefy/12","v":12.574635832146834},{"$f":"+$BG8*$BF8/12","v":43.019497989790743},{"$f":"+($AP8*$BD$5)/($AJ8*$AS8)","v":1.8182311595972753E-3},{"$f":"+$BC8^2","v":3.3059645497304522E-6},{"$f":"SQRT($BD$8+$BC$5)","v":3.6266480015160682E-3},{"$f":"SQRT(($BC8+$BE8))","v":7.3789424453056571E-2},{"$f":"1.95*AR8*E/(0.7*Fy)","v":6996.0428571428574},{"$f":"1.1*AT8*SQRT(E/Fy)","v":111.17513649984161},{"$f":"$BO8*$BN8","v":500.33360950005249},{"$f":"(AG8*AB8)/(AA8*AC8)","v":1.3590165154420812},{"$f":"+($AP8)/($AJ8*$AS8)","v":1.8182311595972753E-3},{"$f":"+$BC8^2","v":3.3059645497304522E-6},{"$f":"SQRT($BL8+$BK$5)","v":3.6266480015160682E-3},{"$f":"+SQRT($BK8+$BM8)","v":7.3789424453056571E-2},{"$f":"1.95*$AT8*E/$BJ$5","v":6780.5598594735648},{"$f":"+$BH8","v":111.17513649984161},{"$f":"pi*$AT8*SQRT(E/Fy)","v":317.51517916048851}]
["W44X368",{"$f":"RIGHT(A9,LEN(A9)-1)","v":"44X368"},{"$f":"LEFT(B9,(FIND(\"X\",B9)-1))","v":"44"},"40",null,"357","368","593 - 16.75","853","354","357","368","335 - 13.5","248","283","89","808 - 18.625","305","100","58","20","16 - 5"," ",368,108,44.4,16,1.1000000000000001,1.97,2.76,4.0599999999999996,35.4,{"$f":"+AF9*AB9","v":38.940000000000005},34700,1800,1560,17.899999999999999,1350,265,169,3.54,100,608000,4.28,42.4,4.1705867209550149,null,"N","N",{"$f":"_xlfn.IFS($AE9<=$AX$5,\"C\",$AE9<=$AX$7,\"N\",TRUE,\"S\")","v":"C"},{"$f":"_xlfn.IFS($AF9<=$AY$5,\"C\",$AF9<=$AY$7,\"N\",TRUE,\"S\")","v":"C"},{"$f":"IF(AND(AX9=\"C\", AY9= \"C\"),\"F2\",\"F3\")","v":"F2"},{"$f":"1.76*AO9*sqrtefy/12","v":12.50399181061792},{"$f":"+$BG9*$BF9/12","v":41.309059520233774},{"$f":"+($AP9*$BD$5)/($AJ9*$AS9)","v":1.5118529269472665E-3},{"$f":"+$BC9^2","v":2.2856992727190169E-6},3.6266480015160682E-3,{"$f":"SQRT(($BC9+$BE9))","v":7.1683337871944378E-2},{"$f":"1.95*AR9*E/(0.7*Fy)","v":6915.2571428571428},{"$f":"1.1*AT9*SQRT(E/Fy)","v":110.4851317887571},{"$f":"$BO9*$BN9","v":476.2439241652682},{"$f":"(AG9*AB9)/(AA9*AC9)","v":1.3589467005076146},{"$f":"+($AP9)/($AJ9*$AS9)","v":1.5118529269472665E-3},{"$f":"+$BC9^2","v":2.2856992727190169E-6},{"$f":"SQRT($BL9+$BK$5)","v":3.4831466305467323E-3},{"$f":"+SQRT($BK9+$BM9)","v":7.0675310805782793E-2},6738.4765448573162,{"$f":"+$BH9","v":110.4851317887571},315.54453197840127]
["W44X335","44X335","44","36",null,"326","335","503","802 - 18","318 - 16","326","336","306","223","258","77","730","279","88","48","15 - 6"," "," ",335,98.5,44,15.9,1.03,1.77,2.56,4.5,38,39.14,31100,1620,1410,17.8,1200,236,150,3.49,74.7,535000,4.24,42.2,4.1239685035316125,null,"N","S",{"$f":"_xlfn.IFS($AE10<=$AX$5,\"C\",$AE10<=$AX$7,\"N\",TRUE,\"S\")","v":"C"},{"$f":"_xlfn.IFS($AF10<=$AY$5,\"C\",$AF10<=$AY$7,\"N\",TRUE,\"S\")","v":"C"},"F2",12.327381756795633,39.888810621891523,1.2554199858828274E-3,1.5760793409540387E-6,3.6266480015160682E-3,6.9871796795265659E-2,6850.6285714285723,109.25014490552017,453.64131640285376,1.432476992502576,1.2554199858828274E-3,1.5760793409540387E-6,3.3797471086050323E-3,6.8082061473547201E-2,6663.1548249917914,109.25014490552017,312.01742066703014]
["W44X290","44X290","44","33",null,"292","290","431","723","291","292","307 - 14.5","279","201","234","67 - 10.25","665","252 - 13","77","40","16"," "," ",290,85.4,43.6,15.8,0.86499999999999999,1.58,2.36,5.0199999999999996,45,38.924999999999997,27000,1410,1240,17.8,1040,205,132,3.49,50.9,461000,4.2,42,4.1213114473284698,null,"N","S",{"$f":"_xlfn.IFS($AE11<=$AX$5,\"C\",$AE11<=$AX$7,\"N\",TRUE,\"S\")","v":"C"},{"$f":"_xlfn.IFS($AF11<=$AY$5,\"C\",$AF11<=$AY$7,\"N\",TRUE,\"S\")","v":"C"},"F2",12.327381756795633,38.370708743029489,9.7734254992319506E-4,9.5519845989037308E-7,3.6266480015160682E-3,6.7852712189265238E-2,6786,109.1797554796633,434.81669984283366,1.3487471959621853,9.7734254992319506E-4,9.5519845989037308E-7,3.2866106610093641E-3,6.5298952602109619E-2,6658.8617813264282,109.1797554796633,311.8163891066867]
["W44X262","44X262","44","30",null,"261","262","397","652 - 17.625","263","261","281","250","182","211","57","605","230","68","35","12"," "," ",262,77.2,43.3,15.8,0.78500000000000003,1.42,2.2000000000000002,5.57,49.6,38.936,24100,1270,1110,17.7,923,182,117,3.47,37.299999999999997,405000,4.17,41.9,4.1175139081137466,null,"N","S",{"$f":"_xlfn.IFS($AE12<=$AX$5,\"C\",$AE12<=$AX$7,\"N\",TRUE,\"S\")","v":"C"},{"$f":"_xlfn.IFS($AF12<=$AY$5,\"C\",$AF12<=$AY$7,\"N\",TRUE,\"S\")","v":"C"},"F2",12.25673773526672,37.364117186768048,8.0199531273516947E-4,6.4319648164918234E-7,3.6266480015160682E-3,6.6548052670617169E-2,6737.528571428571,109.07915293889762,422.89535801443924,1.3623087894455339,8.0199531273516947E-4,6.4319648164918234E-7,3.2387972549727806E-3,6.3567228724461078E-2,6652.7260429666394,109.07915293889762,311.52906916482851]
["W44X230","44X230","44","27",null,"235","230 - 15.75","372","529","241","235","258","229","166","192 - 11.5","50","550","210","60","31 - 8",9,{"$f":"IF($C13 = V$7,RIGHT($B13,3),\"\")","v":""},"",230,67.8,42.9,15.8,0.71,1.22,2.0099999999999998,6.45,54.8,38.907999999999994,20800,1100,971,17.5,796,157,101,3.43,24.9,346000,4.13,41.7,4.0978563572852282,null,"N","S",{"$f":"_xlfn.IFS($AE13<=$AX$5,\"C\",$AE13<=$AX$7,\"N\",TRUE,\"S\")","v":"C"},{"$f":"_xlfn.IFS($AF13<=$AY$5,\"C\",$AF13<=$AY$7,\"N\",TRUE,\"S\")","v":"C"},"F2",12.115449692208889,36.215829088613205,6.1495602693951935E-4,3.7817091506923884E-7,3.6266480015160682E-3,6.5127598055322047E-2,6672.9,108.55839477242178,408.81858177625219,1.4331126789790409,6.1495602693951935E-4,3.7817091506923884E-7,3.1976213178297515E-3,6.1746071492600002E-2,6620.965057270847,108.55839477242178,310.04178857553865]
["W40X655","40X655","40","24",null,"211",null,"362 - 16","487","221","211","235","207","147","175","45","500 - 17","190","54","28","8.5 - 4","","",655,193,43.6,16.899999999999999,1.97,3.54,4.72,2.39,17.3,34.081000000000003,56500,3080,2590,17.100000000000001,2870,542,340,3.86,589,1150000,4.71,40.1,4.477784416779345,null,"N","N",{"$f":"_xlfn.IFS($AE14<=$AX$5,\"C\",$AE14<=$AX$7,\"N\",TRUE,\"S\")","v":"C"},{"$f":"_xlfn.IFS($AF14<=$AY$5,\"C\",$AF14<=$AY$7,\"N\",TRUE,\"S\")","v":"C"},"F2",13.634296155080555,61.149693783838536,5.6711503095542995E-3,3.216194583355783E-5,3.6266480015160682E-3,9.6425091708903066E-2,7610.0142857142855,118.62326202779973,797.55652891570207,1.1222473506502193,5.6711503095542995E-3,3.216194583355783E-5,6.4814008524953825E-3,0.11023861012390206,7234.8202505391982,118.62326202779973,338.78695795810484]
["W40X593","40X593","40","21",null,"191",null,"324","441 - 17","201 - 15.75","191","217","192","132 - 12.5","158","40","455","170","49 - 10","24 - 6.5","","","",593,174,43,16.7,1.79,3.23,4.41,2.58,19.100000000000001,34.189,50400,2760,2340,17,2520,481,302,3.8,445,997000,4.63,39.799999999999997,4.4209788286877956,null,"N","N",{"$f":"_xlfn.IFS($AE15<=$AX$5,\"C\",$AE15<=$AX$7,\"N\",TRUE,\"S\")","v":"C"},{"$f":"_xlfn.IFS($AF15<=$AY$5,\"C\",$AF15<=$AY$7,\"N\",TRUE,\"S\")","v":"C"},"F2",13.422364090493813,57.151590369309922,4.7781643259030195E-3,2.2830854325332256E-5,3.6266480015160682E-3,9.1677763538488916E-2,7480.7571428571418,117.11839633226145,731.75489300246545,1.1345416288166701,4.7781643259030195E-3,2.2830854325332256E-5,5.7164206897762776E-3,0.1024430818341546,7143.0386503512809,117.11839633226145,334.4890752122447]
["W40X503","40X503","40","18",null,"173 - 15",null,"297","395","169","173 - 15","194","176","122","143","36 - 7","426","152 - 12.5","45","21","","","",503,148,42.1,16.399999999999999,1.54,2.76,3.94,2.98,22.3,34.341999999999999,41600,2320,1980,16.8,2040,394,249,3.72,277,789000,4.5,39.299999999999997,4.3312932219258329,null,"N","N",{"$f":"_xlfn.IFS($AE16<=$AX$5,\"C\",$AE16<=$AX$7,\"N\",TRUE,\"S\")","v":"C"},{"$f":"_xlfn.IFS($AF16<=$AY$5,\"C\",$AF16<=$AY$7,\"N\",TRUE,\"S\")","v":"C"},"F2",13.139788004378154,51.363202255524136,3.5597707353432545E-3,1.2671967688206255E-5,3.6266480015160682E-3,8.477274760711323E-2,7270.7142857142853,114.74248935666425,637.75778064010865,1.1684049133969601,3.5597707353432545E-3,1.2671967688206255E-5,4.7453744705108674E-3,9.1132569402240168E-2,6998.1323342830237,114.74248935666425,327.70350648909346]
["W40X431","40X431","40","16",null,"148",null,"277","361","152","148","178","162 - 13","111","130","31","398","136","39","18 - 5","","","",431,127,41.3,16.2,1.34,2.36,3.54,3.44,25.5,34.17,34800,1960,1690,16.600000000000001,1690,328,208,3.65,177,638000,4.41,38.9,4.2697775569611922,null,"N","N",{"$f":"_xlfn.IFS($AE17<=$AX$5,\"C\",$AE17<=$AX$7,\"N\",TRUE,\"S\")","v":"C"},{"$f":"_xlfn.IFS($AF17<=$AY$5,\"C\",$AF17<=$AY$7,\"N\",TRUE,\"S\")","v":"C"},"F2",12.892533929026952,47.200562806056666,2.6923837483457812E-3,7.2489302483564787E-6,3.6266480015160682E-3,7.9492337680193106E-2,7125.3000000000011,113.11284662161641,570.01548091000529,1.1976302573760202,2.6923837483457812E-3,7.2489302483564787E-6,4.1346754921670111E-3,8.2626020359889002E-2,6898.7405956044413,113.11284662161641,323.04926165273071]
["W40X397","40X397","40","14",null,"132",null,"249","330","141","132","161","146","101 - 12.25","119","26 - 5.5","370 - 16.5","120","33 - 8","15","","","",397,117,41,16.100000000000001,1.22,2.2000000000000002,3.38,3.66,28,34.159999999999997,32000,1800,1560,16.600000000000001,1540,300,191,3.64,142,579000,4.38,38.799999999999997,4.2496335682502107,null,"N","N",{"$f":"_xlfn.IFS($AE18<=$AX$5,\"C\",$AE18<=$AX$7,\"N\",TRUE,\"S\")","v":"C"},{"$f":"_xlfn.IFS($AF18<=$AY$5,\"C\",$AF18<=$AY$7,\"N\",TRUE,\"S\")","v":"C"},"F2",12.857211918262495,45.576574160272962,2.3460216759185835E-3,5.5038177038798395E-6,3.6266480015160682E-3,7.728304909509362E-2,7076.8285714285712,112.57920198205009,543.4271961444756,1.1766007905138336,2.3460216759185835E-3,5.5038177038798395E-6,3.9179623378804802E-3,7.91453347570093E-2,6866.1936652728409,112.57920198205009,321.52517741344428]
["W40X372","40X372","40","12",null,"124",null,"215","302","130","124","146 - 14","131","93","106","","342","106","30","13","","","",372,110,40.6,16.100000000000001,1.1599999999999999,2.0499999999999998,3.23,3.93,29.5,34.22,29600,1680,1460,16.5,1420,277,177,3.6,116,528000,4.33,38.6,4.2419264688405462,null,"N","N",{"$f":"_xlfn.IFS($AE19<=$AX$5,\"C\",$AE19<=$AX$7,\"N\",TRUE,\"S\")","v":"C"},{"$f":"_xlfn.IFS($AF19<=$AY$5,\"C\",$AF19<=$AY$7,\"N\",TRUE,\"S\")","v":"C"},"F2",12.715923875204664,43.957817422481384,2.0583433884590815E-3,4.2367775048132138E-6,3.6266480015160682E-3,7.5398881888096653E-2,6996.0428571428574,112.37502929581693,522.46584357632378,1.2027026208150278,2.0583433884590815E-3,4.2367775048132138E-6,3.7527841240848443E-3,7.6230751751139941E-2,6853.7411946552247,112.37502929581693,320.94206207767763]
["W40X362","40X362","40","10",null,"116",null,"199 - 15.75","282","118 - 11.5","116","129","117","83","97","","311","96","26"," 10 - 4","","","",362,106,40.6,16,1.1200000000000001,2.0099999999999998,3.19,3.99,30.5,34.160000000000004,28900,1640,1420,16.5,1380,270,173,3.6,109,513000,4.33,38.6,4.2194034898847645,null,"N","N",{"$f":"_xlfn.IFS($AE20<=$AX$5,\"C\",$AE20<=$AX$7,\"N\",TRUE,\"S\")","v":"C"},{"$f":"_xlfn.IFS($AF20<=$AY$5,\"C\",$AF20<=$AY$7,\"N\",TRUE,\"S\")","v":"C"},"F2",12.715923875204664,43.68740922319077,1.9886156316135154E-3,3.9545921302976205E-6,3.6266480015160682E-3,7.4935062775242839E-2,6996.0428571428574,111.77836161697408,514.86175982704458,1.1896517412935326,1.9886156316135154E-3,3.9545921302976205E-6,3.7149970804117275E-3,7.5522266332686563E-2,6817.3504957995265,111.77836161697408,319.23798461115416]
["W40X324","40X324","40","8",null,"108",null,"392","262","","108","114","104 - 12.75","73","86","","283","87","22 - 5.75","","","","",324,95.3,40.200000000000003,15.9,1,1.81,2.99,4.4000000000000004,34.200000000000003,34.200000000000003,25600,1460,1280,16.399999999999999,1220,239,153,3.58,79.400000000000006,448000,4.2699999999999996,38.4,4.1934070420990208,null,"N","N",{"$f":"_xlfn.IFS($AE21<=$AX$5,\"C\",$AE21<=$AX$7,\"N\",TRUE,\"S\")","v":"C"},{"$f":"_xlfn.IFS($AF21<=$AY$5,\"C\",$AF21<=$AY$7,\"N\",TRUE,\"S\")","v":"C"},"F2",12.645279853675747,41.62570211410047,1.6153971354166668E-3,2.6095079051123728E-6,3.6266480015160682E-3,7.2401969150933554E-2,6899.0999999999995,111.08967651057984,485.97334786916565,1.1883665172521631,1.6153971354166668E-3,2.6095079051123728E-6,3.5293227512204674E-3,7.1726702744773746E-2,6775.3476637342756,111.08967651057984,317.27110620806582]
["W40X297","40X297","40","6",null,99,null,"331","247","",99,"102","103","68","76 - 11","","257 - 16","79","19","","","","",297,87.3,39.799999999999997,15.8,0.93,1.65,2.83,4.8,36.799999999999997,34.223999999999997,23200,1330,1170,16.3,1090,215,138,3.54,61.2,399000,4.22,38.200000000000003,4.1576416088240071,null,"N","S",{"$f":"_xlfn.IFS($AE22<=$AX$5,\"C\",$AE22<=$AX$7,\"N\",TRUE,\"S\")","v":"C"},{"$f":"_xlfn.IFS($AF22<=$AY$5,\"C\",$AF22<=$AY$7,\"N\",TRUE,\"S\")","v":"C"},"F2",12.50399181061792,40.161064581226356,1.369311316955296E-3,1.8750134827418472E-6,3.6266480015160682E-3,7.0682100410721843E-2,6818.3142857142848,110.14219624622818,465.06665320601832,1.2208791714614498,1.369311316955296E-3,1.8750134827418472E-6,3.4236858296157789E-3,6.9231475114799296E-2,6717.5609422570742,110.14219624622818,314.56511118653452]
["W40X277","40X277","40","5",null,"90 - 10.375",null,"327","231 - 16.5","","90 - 10.375",94,"94","62","71","","233","72","17","","","","",277,81.5,39.700000000000003,15.8,0.83,1.58,2.76,5.03,41.2,34.195999999999998,21900,1250,1100,16.399999999999999,1040,204,132,3.58,51.5,379000,4.25,38.1,4.1820183337850096,null,"N","S",{"$f":"_xlfn.IFS($AE23<=$AX$5,\"C\",$AE23<=$AX$7,\"N\",TRUE,\"S\")","v":"C"},{"$f":"_xlfn.IFS($AF23<=$AY$5,\"C\",$AF23<=$AY$7,\"N\",TRUE,\"S\")","v":"C"},"F2",12.645279853675747,39.873830760394377,1.2288236697685516E-3,1.5100076113834502E-6,3.6266480015160682E-3,6.9681214622627094E-2,6866.7857142857147,110.78797245233424,458.21774763887601,1.1369443999359075,1.2288236697685516E-3,1.5100076113834502E-6,3.3699582769751747E-3,6.78143196289967E-2,6756.9467650154947,110.78797245233424,316.40944216048064]
["W40X249","40X249","40","4",null,"",null,"294","256","","","84 - 10","84","55","65","","211","65 - 12","15","","","","",249,73.5,39.4,15.8,0.75,1.42,2.6,5.55,45.6,34.200000000000003,19600,1120,993,16.3,926,182,118,3.55,38.1,334000,4.21,38,4.1801715575510112,null,"N","S",{"$f":"_xlfn.IFS($AE24<=$AX$5,\"C\",$AE24<=$AX$7,\"N\",TRUE,\"S\")","v":"C"},{"$f":"_xlfn.IFS($AF24<=$AY$5,\"C\",$AF24<=$AY$7,\"N\",TRUE,\"S\")","v":"C"},"F2",12.539313821382377,38.596986973042888,1.0096994752742884E-3,1.0194930303691734E-6,3.6266480015160682E-3,6.8090729741943259E-2,6802.1571428571433,110.73904856482162,443.19980655455402,1.1432519165626673,1.0096994752742884E-3,1.0194930303691734E-6,3.2963774370571115E-3,6.5620704905779551E-2,6753.9629022717054,110.73904856482162,316.26971598250719]
["W40X215","40X215","40",null,null,"",null,"278 - 12","232","","","","76","48 - 8.125","60","","193","58","12 - 4","","","","",215,63.5,39,15.8,0.65,1.22,2.4,6.45,52.6,34.190000000000005,16700,964,859,16.2,803,156,101,3.54,24.8,284000,4.1900000000000004,37.799999999999997,4.177348401294191,null,"N","S",{"$f":"_xlfn.IFS($AE25<=$AX$5,\"C\",$AE25<=$AX$7,\"N\",TRUE,\"S\")","v":"C"},{"$f":"_xlfn.IFS($AF25<=$AY$5,\"C\",$AF25<=$AY$7,\"N\",TRUE,\"S\")","v":"C"},"F2",12.50399181061792,37.380975921290577,7.6377724806129936E-4,5.8335568465609157E-7,3.6266480015160682E-3,6.626028410426088E-2,6769.8428571428576,110.66425889805176,426.51321513349365,1.1529103548454038,7.6377724806129936E-4,5.8335568465609157E-7,3.2295459219255774E-3,6.3192746181716747E-2,6749.4014883767568,110.66425889805176,316.05611737411851]
["W40X199","40X199","40",null,null,"",null,"264","210","","","","68 - 9","57","55","","176","53 - 10","","","","","",199,58.8,38.700000000000003,15.8,0.65,1.07,2.25,7.39,52.6,34.190000000000005,14900,869,770,16,695,137,88.2,3.45,18.3,246000,4.12,37.6,4.1309389657640327,null,"N","S",{"$f":"_xlfn.IFS($AE26<=$AX$5,\"C\",$AE26<=$AX$7,\"N\",TRUE,\"S\")","v":"C"},{"$f":"_xlfn.IFS($AF26<=$AY$5,\"C\",$AF26<=$AY$7,\"N\",TRUE,\"S\")","v":"C"},"F2",12.186093713737804,36.200996165698506,6.3208068527217465E-4,3.9952599269414191E-7,3.6266480015160682E-3,6.5258935685377537E-2,6656.7428571428582,109.43480296202526,413.22347844082259,1.3145333017863481,6.3208068527217465E-4,3.9952599269414191E-7,3.2009587891543029E-3,6.1911545566448893E-2,6674.4171003987449,109.43480296202526,312.54480239769902]
["W40X392","40X392","40",null,null,"",null,"235","194","","","","62","50","50 - 7.5","","159","50","","","","","",392,116,41.6,12.4,1.42,2.52,3.7,2.4500000000000002,24.1,34.222000000000001,29900,1710,1440,16.100000000000001,803,212,130,2.64,172,306000,3.3,39.1,3.1899598868013728,null,"N","N",{"$f":"_xlfn.IFS($AE27<=$AX$5,\"C\",$AE27<=$AX$7,\"N\",TRUE,\"S\")","v":"C"},{"$f":"_xlfn.IFS($AF27<=$AY$5,\"C\",$AF27<=$AY$7,\"N\",TRUE,\"S\")","v":"C"},"F2",9.3250108418167539,36.319011669122126,3.0548451264563797E-3,9.3320787466342944E-6,3.6266480015160682E-3,8.174040083075472E-2,5331.8571428571431,84.506848094839057,444.3924887438834,1.5551472094214027,3.0548451264563797E-3,9.3320787466342944E-6,4.379348116307304E-3,8.6221767801197877E-2,5154.0637599605034,84.506848094839057,241.35078991478676]
["W40X331","40X331","40",null,null,"",null,"211","182","","","","55 - 7","44 - 6.5","46","","145 - 15.5","45","","","","","",331,97.7,40.799999999999997,12.2,1.22,2.13,3.31,2.86,28,34.159999999999997,24700,1430,1210,15.9,644,172,106,2.57,105,241000,3.21,38.700000000000003,3.1284610372111845,null,"N","N",{"$f":"_xlfn.IFS($AE28<=$AX$5,\"C\",$AE28<=$AX$7,\"N\",TRUE,\"S\")","v":"C"},{"$f":"_xlfn.IFS($AF28<=$AY$5,\"C\",$AF28<=$AY$7,\"N\",TRUE,\"S\")","v":"C"},"F2",9.0777567664655532,33.110698161456249,2.2422961112178873E-3,5.0278918503828602E-6,3.6266480015160682E-3,7.6609034145679947E-2,5186.4428571428571,82.877650824419277,394.75368507552048,1.6037558685446009,2.2422961112178873E-3,5.0278918503828602E-6,3.8567477267190935E-3,7.8096375318813485E-2,5054.6991901226429,82.877650824419277,236.69781732135209]
["W40X327","40X327","40",null,null,"",null,"183","170",{"$f":"IF($C29 = J$7,RIGHT($B29,3),\"\")","v":""},"","","","","40","","132","40 - 8","","","","","",327,95.9,40.799999999999997,12.1,1.18,2.13,3.31,2.85,29,34.22,24500,1410,1200,16,640,170,105,2.58,103,239000,3.21,38.700000000000003,3.1103979401388577,null,"N","N",{"$f":"_xlfn.IFS($AE29<=$AX$5,\"C\",$AE29<=$AX$7,\"N\",TRUE,\"S\")","v":"C"},{"$f":"_xlfn.IFS($AF29<=$AY$5,\"C\",$AF29<=$AY$7,\"N\",TRUE,\"S\")","v":"C"},"F2",9.1130787772300099,33.0418530526536,2.2179155900086131E-3,4.9191495644032544E-6,3.6266480015160682E-3,7.6449745529495919E-2,5186.4428571428571,82.399132142498161,391.23362532552318,1.5667403872269428,2.2179155900086131E-3,4.9191495644032544E-6,3.8426241998890929E-3,7.7849468783657783E-2,5025.5143861386405,82.399132142498161,235.33117231595523]
["W40X294","40X294","40",null,null,"",null,"167","160","","","","","","35 - 6","","120","35","","","","","",294,86.2,40.4,12,1.06,1.93,3.11,3.11,32.200000000000003,34.132000000000005,21900,1270,1080,15.9,562,150,93.5,2.5499999999999998,76.599999999999994,208000,3.16,38.5,3.0856236335965788,null,"N","N",{"$f":"_xlfn.IFS($AE30<=$AX$5,\"C\",$AE30<=$AX$7,\"N\",TRUE,\"S\")","v":"C"},{"$f":"_xlfn.IFS($AF30<=$AY$5,\"C\",$AF30<=$AY$7,\"N\",TRUE,\"S\")","v":"C"},"F2",9.0071127449366362,31.464409981562568,1.8422318422318422E-3,3.3938181605329271E-6,3.6266480015160682E-3,7.395187518750225E-2,5105.6571428571433,81.742823400721889,369.09342232025273,1.5621727115716757,1.8422318422318422E-3,3.3938181605329271E-6,3.638740075589759E-3,7.4033586417393021E-2,4985.4861851396145,81.742823400721889,233.45676051588535]
["W40X278","40X278","40",null,null,"",null,"149 - 11.75","150","","","","","","","","109","30","","","","","",278,82.3,40.200000000000003,12,1.03,1.81,2.99,3.31,33.299999999999997,34.298999999999999,20500,1190,1020,15.8,521,140,87.1,2.52,65,192000,3.13,38.4,3.0725792949492776,null,"N","N",{"$f":"_xlfn.IFS($AE31<=$AX$5,\"C\",$AE31<=$AX$7,\"N\",TRUE,\"S\")","v":"C"},{"$f":"_xlfn.IFS($AF31<=$AY$5,\"C\",$AF31<=$AY$7,\"N\",TRUE,\"S\")","v":"C"},"F2",8.901146712643266,30.640655636356154,1.6595179738562091E-3,2.7539999055518176E-6,3.6266480015160682E-3,7.2706024340299866E-2,5057.1857142857134,81.397259198135487,358.30704291439218,1.6265179558011051,1.6595179738562091E-3,2.7539999055518176E-6,3.5497339453432076E-3,7.2175147517683794E-2,4964.4102608394751,81.397259198135487,232.4698322947913]
["W40X264","40X264","40",null,null,"",null,null,"135 - 12","","","","","","","","99","26 - 6.5","","","","","",264,77.400000000000006,40,11.9,0.96,1.73,2.91,3.45,35.6,34.176000000000002,19400,1130,971,15.8,493,132,82.6,2.52,56.1,181000,3.12,38.299999999999997,3.0535567689306897,null,"N","N",{"$f":"_xlfn.IFS($AE32<=$AX$5,\"C\",$AE32<=$AX$7,\"N\",TRUE,\"S\")","v":"C"},{"$f":"_xlfn.IFS($AF32<=$AY$5,\"C\",$AF32<=$AY$7,\"N\",TRUE,\"S\")","v":"C"},"F2",8.901146712643266,30.103315359690402,1.5084984121776965E-3,2.2755674595426314E-6,3.6266480015160682E-3,7.1659935903500255E-2,5041.028571428571,80.893323796538695,348.52113414666599,1.593673677563511,1.5084984121776965E-3,2.2755674595426314E-6,3.4816919215681147E-3,7.0641279247659519E-2,4933.6752938008713,80.893323796538695,231.03059736906181]
["W40X235","40X235","40",null,null,"",null,null,null,"","","","","","","","90 - 14.5","22","","","","","",235,69.099999999999994,39.700000000000003,11.9,0.83,1.58,2.76,3.77,41.2,34.195999999999998,17400,1010,875,15.9,444,118,74.599999999999994,2.54,41.3,161000,3.11,38.1,3.0706111386992956,null,"N","S",{"$f":"_xlfn.IFS($AE33<=$AX$5,\"C\",$AE33<=$AX$7,\"N\",TRUE,\"S\")","v":"C"},{"$f":"_xlfn.IFS($AF33<=$AY$5,\"C\",$AF33<=$AY$7,\"N\",TRUE,\"S\")","v":"C"},"F2",8.9717907341721794,29.208357826276544,1.2388451443569553E-3,1.5347372916968055E-6,3.6266480015160682E-3,6.9753086998877861E-2,5024.8714285714286,81.345119770949495,336.94280709291814,1.509556430167003,1.2388451443569553E-3,1.5347372916968055E-6,3.3736254191695384E-3,6.7915171821372092E-2,4961.2302826698624,81.345119770949495,232.32092256474292]
["W40X211","40X211","40",null,null,"",null,null,null,"","","","","","","","82","19","","","","","",211,62.1,39.4,11.8,0.75,1.42,2.6,4.17,45.6,34.200000000000003,15500,906,786,15.8,390,105,66.099999999999994,2.5099999999999998,30.4,141000,3.07,38,3.0405111364330351,null,"N","S",{"$f":"_xlfn.IFS($AE34<=$AX$5,\"C\",$AE34<=$AX$7,\"N\",TRUE,\"S\")","v":"C"},{"$f":"_xlfn.IFS($AF34<=$AY$5,\"C\",$AF34<=$AY$7,\"N\",TRUE,\"S\")","v":"C"},"F2",8.8658247018788057,28.170158727392209,1.0178117048346056E-3,1.0359406664983262E-6,3.6266480015160682E-3,6.8150272973412765E-2,4960.2428571428563,80.547725317905218,322.76485688351323,1.5307949391262832,1.0178117048346056E-3,1.0359406664983262E-6,3.2988712984395683E-3,6.5701468806063798E-2,4912.5972790082315,80.547725317905218,230.04357125588891]
["W40X183","40X183","40",null,null,"",null,null,null,"","","","","","","","74","16","","","","","",183,53.3,39,11.8,0.65,1.2,2.38,4.92,52.6,34.190000000000005,13200,774,675,15.7,331,88.3,56,2.4900000000000002,19.3,118000,3.04,37.799999999999997,3.0327364351937605,null,"N","S",{"$f":"_xlfn.IFS($AE35<=$AX$5,\"C\",$AE35<=$AX$7,\"N\",TRUE,\"S\")","v":"C"},{"$f":"_xlfn.IFS($AF35<=$AY$5,\"C\",$AF35<=$AY$7,\"N\",TRUE,\"S\")","v":"C"},"F2",8.795180680349894,27.098540288892838,7.564177934548306E-4,5.7216787825507481E-7,3.6266480015160682E-3,6.620472637939756E-2,4911.7714285714283,80.341761757257132,309.29400130406736,1.5694562146892659,7.564177934548306E-4,5.7216787825507481E-7,3.2278133551097892E-3,6.3120766381315585E-2,4900.0355831487759,80.341761757257132,229.45534119907404]
["W40X167","40X167","40",null,null,"",null,null,null,"","","","","","","","68","14 - 4","","","","","",167,49.3,38.6,11.8,0.65,1.03,2.21,5.76,52.6,34.190000000000005,11600,693,600,15.3,283,76,47.9,2.4,14,99700,2.98,37.6,2.9821393585545413,null,"N","S",{"$f":"_xlfn.IFS($AE36<=$AX$5,\"C\",$AE36<=$AX$7,\"N\",TRUE,\"S\")","v":"C"},{"$f":"_xlfn.IFS($AF36<=$AY$5,\"C\",$AF36<=$AY$7,\"N\",TRUE,\"S\")","v":"C"},"F2",8.4772825834697763,26.148797708729294,6.2056737588652485E-4,3.8510386801468742E-7,3.6266480015160682E-3,6.5170663472168155E-2,4814.8285714285712,79.001368892981702,297.77129355077926,1.8284926773078822,6.2056737588652485E-4,3.8510386801468742E-7,3.1987052138614971E-3,6.1800263670538022E-2,4818.2851636074083,79.001368892981702,225.62719136409305]
["W40X149","40X149","40",null,null,"",null,null,"","","","","","","","","61 - 10","","","","","","",149,43.8,38.200000000000003,11.8,0.63,0.83,2.0099999999999998,7.11,54.3,34.208999999999996,9800,598,513,15,229,62.2,38.799999999999997,2.29,9.36,80000,2.89,37.4,2.9137139684989855,null,"N","S",{"$f":"_xlfn.IFS($AE37<=$AX$5,\"C\",$AE37<=$AX$7,\"N\",TRUE,\"S\")","v":"C"},{"$f":"_xlfn.IFS($AF37<=$AY$5,\"C\",$AF37<=$AY$7,\"N\",TRUE,\"S\")","v":"C"},"F2",8.0887404650607451,24.959715074932308,4.8785064264940419E-4,2.3799824953343667E-7,3.6266480015160682E-3,6.4144357851376704E-2,4669.4142857142861,77.188677119903303,284.94318721300192,2.2004972432101284,4.8785064264940419E-4,2.3799824953343667E-7,3.1756274067817644E-3,6.0526672215075301E-2,4707.7292833890751,77.188677119903303,220.45016013919727]
["W36X925","36X925","36",null,null,"",null,"",null,"","","","","","","","53","","","","","","",925,272,43.1,18.600000000000001,3.02,4.53,5.28,2.0499999999999998,10.8,32.616,73000,4130,3390,16.399999999999999,4940,862,531,4.26,1430,1840000,5.3,38.6,4.9121054241154267,null,"N","N",{"$f":"_xlfn.IFS($AE38<=$AX$5,\"C\",$AE38<=$AX$7,\"N\",TRUE,\"S\")","v":"C"},{"$f":"_xlfn.IFS($AF38<=$AY$5,\"C\",$AF38<=$AY$7,\"N\",TRUE,\"S\")","v":"C"},"F2",15.047176585658852,86.092075096682365,1.0928210066180629E-2,1.1942577525057164E-4,3.6266480015160682E-3,0.12064351647600752,8563.2857142857138,130.12908050006601,1185.1281456887605,1.169032258064516,1.0928210066180629E-2,1.1942577525057164E-4,1.1369801512240294E-2,0.14932518735438077,7936.5589066779239,130.12908050006601,371.6474709165476]
["W36X853","36X853","36",null,null,"",null,"",null,"","","","","","","","48","","","","","","",853,251,43.1,18.2,2.52,4.53,5.28,2.0099999999999998,12.9,32.508000000000003,70000,3920,3250,16.7,4600,805,505,4.28,1240,1710000,5.22,38.6,4.8663720856355432,null,"N","N",{"$f":"_xlfn.IFS($AE39<=$AX$5,\"C\",$AE39<=$AX$7,\"N\",TRUE,\"S\")","v":"C"},{"$f":"_xlfn.IFS($AF39<=$AY$5,\"C\",$AF39<=$AY$7,\"N\",TRUE,\"S\")","v":"C"},"F2",15.117820607187769,81.695587282416099,9.8844161020326827E-3,9.7701681678122971E-5,3.6266480015160682E-3,0.11623710295576345,8434.0285714285692,128.91753539450528,1119.0142835319643,0.99362200713194104,9.8844161020326827E-3,9.7701681678122971E-5,1.0370549303450275E-2,0.14231994029468589,7862.6668983625714,128.91753539450528,368.18730910911245]
["W36X802","36X802","36",null,null,"",null,"",null,"","","","","","","","43 - 8","","","","","","",802,236,42.6,18,2.38,4.29,5.04,2.1,13.7,32.605999999999995,64800,3660,3040,16.600000000000001,4210,744,468,4.22,1050,1540000,5.15,38.299999999999997,{"$f":"$AA40/(SQRT(12*(1+$BJ40/6)))","v":4.8090021468345148},null,{"$f":"IF($AE40<=$AV$7,\"N\",\"S\")","v":"N"},{"$f":"IF($AF40<=$AW$7,\"N\",\"S\")","v":"N"},{"$f":"_xlfn.IFS($AE40<=$AX$5,\"C\",$AE40<=$AX$7,\"N\",TRUE,\"S\")","v":"C"},{"$f":"_xlfn.IFS($AF40<=$AY$5,\"C\",$AF40<=$AY$7,\"N\",TRUE,\"S\")","v":"C"},"F2",14.905888542601025,77.97337145256158,9.0181393431359082E-3,8.1326837212215746E-5,{"$f":"SQRT($BD$8+$BC$5)","v":3.6266480015160682E-3},0.11244904332475211,8320.9285714285706,127.39771919759062,1058.7317548346482,1.0049505309505307,9.0181393431359082E-3,8.1326837212215746E-5,9.5484788521201531E-3,0.13625937837542068,{"$f":"1.95*$AT40*E/$BJ$5","v":7769.9734686711954},127.39771919759062,{"$f":"pi*$AT40*SQRT(E/Fy)","v":363.84672786723513}]
["W36X723","36X723","36",null,null,"",null,"",null,"","","","","","","","38","","","","","","",723,213,41.8,17.8,2.17,3.9,4.6500000000000004,2.2799999999999998,15,32.549999999999997,57300,3270,2740,16.399999999999999,3700,658,416,4.17,785,1330000,5.0599999999999996,37.9,4.7513212534536002,null,"N","N",{"$f":"_xlfn.IFS($AE41<=$AX$5,\"C\",$AE41<=$AX$7,\"N\",TRUE,\"S\")","v":"C"},{"$f":"_xlfn.IFS($AF41<=$AY$5,\"C\",$AF41<=$AY$7,\"N\",TRUE,\"S\")","v":"C"},"F2",14.729278488778737,72.055918795238568,7.5592704581784569E-3,5.7142569859889538E-5,3.6266480015160682E-3,0.10576350249350919,8175.5142857142855,125.86966534491248,963.24326581994683,1.0174805531547104,7.5592704581784569E-3,5.7142569859889538E-5,8.1846918718458533E-3,0.12547494702140469,7676.7776252228887,125.86966534491248,359.48261995538508]
["W36X652","36X652","36",null,null,"",null,"",null,"","","","","","","","34","","","","","","",652,192,41.1,17.600000000000001,1.97,3.54,4.49,2.48,16.3,32.111000000000004,50600,2910,2460,16.2,3230,581,367,4.0999999999999996,593,1130000,4.96,37.6,4.6986580640295825,null,"N","N",{"$f":"_xlfn.IFS($AE42<=$AX$5,\"C\",$AE42<=$AX$7,\"N\",TRUE,\"S\")","v":"C"},{"$f":"_xlfn.IFS($AF42<=$AY$5,\"C\",$AF42<=$AY$7,\"N\",TRUE,\"S\")","v":"C"},"F2",14.482024413427533,66.908744549383073,6.4110880470506833E-3,4.1102049947036145E-5,3.6266480015160682E-3,0.1001885025767266,8013.9428571428571,124.47453803711814,883.67132712522334,1.015322772213662,6.4110880470506833E-3,4.1102049947036145E-5,7.1378330832407525E-3,0.11639983303377817,7591.6889577392258,124.47453803711814,355.49814904729988]
["W36X529","36X529","36",null,null,"",null,"",null,"","","","","","","","30 - 6.75","","","","","","",529,156,39.799999999999997,17.2,1.61,2.91,3.86,2.96,19.899999999999999,32.039000000000001,39600,2330,1990,16,2490,454,289,4,327,846000,4.8,36.9,4.586883909031255,null,"N","N",{"$f":"_xlfn.IFS($AE43<=$AX$5,\"C\",$AE43<=$AX$7,\"N\",TRUE,\"S\")","v":"C"},{"$f":"_xlfn.IFS($AF43<=$AY$5,\"C\",$AF43<=$AY$7,\"N\",TRUE,\"S\")","v":"C"},"F2",14.128804305782962,58.093170551109274,4.4531601094905419E-3,1.9830634960757816E-5,3.6266480015160682E-3,8.9887752842123109E-2,7755.4285714285716,121.51347210758884,737.42591357104595,1.0305839926476466,4.4531601094905419E-3,1.9830634960757816E-5,5.4476826392446777E-3,9.9502978592277427E-2,7411.0938587347846,121.51347210758884,347.04137167134542]
["W36X487","36X487","36",null,null,"",null,"",null,"","","","","","","","26","","","","","","",487,143,39.299999999999997,17.100000000000001,1.5,2.68,3.63,3.19,21.4,32.099999999999994,36000,2130,1830,15.8,2250,412,263,3.96,258,754000,4.74,36.6,4.5537164941368982,null,"N","N",{"$f":"_xlfn.IFS($AE44<=$AX$5,\"C\",$AE44<=$AX$7,\"N\",TRUE,\"S\")","v":"C"},{"$f":"_xlfn.IFS($AF44<=$AY$5,\"C\",$AF44<=$AY$7,\"N\",TRUE,\"S\")","v":"C"},"F2",13.98751626272513,55.191669262316701,3.852011108125056E-3,1.4837989577118822E-5,3.6266480015160682E-3,8.6479240917350361E-2,7658.4857142857145,120.63481726814307,690.99353142542986,1.0506677140612721,3.852011108125056E-3,1.4837989577118822E-5,4.9683599662553495E-3,9.3916830623591671E-2,7357.5047926697607,120.63481726814307,344.53194143765955]
["W36X441","36X441","36",null,null,"",null,"",null,"","","","","","","","22 - 5","","","","","","",441,130,38.9,17,1.36,2.44,3.39,3.48,23.6,32.096000000000004,32100,1910,1650,15.7,1990,368,235,3.92,194,661000,4.6900000000000004,36.5,4.5265536918513325,null,"N","N",{"$f":"_xlfn.IFS($AE45<=$AX$5,\"C\",$AE45<=$AX$7,\"N\",TRUE,\"S\")","v":"C"},{"$f":"_xlfn.IFS($AF45<=$AY$5,\"C\",$AF45<=$AY$7,\"N\",TRUE,\"S\")","v":"C"},"F2",13.846228219667301,52.255850218699521,3.2212536322125361E-3,1.0376474963042456E-5,3.6266480015160682E-3,8.275204912102542E-2,7577.7,119.91523367210038,642.52792201811212,1.0523278688524593,3.2212536322125361E-3,1.0376474963042456E-5,4.4970085768444449E-3,8.7853640841213748E-2,7313.6174649769382,119.91523367210038,342.4768172290307]
["W36X395","36X395","36",null,null,null,null,null,null,null,null,null,null,null,null,null,null,null,null,null,null,null,null,395,116,38.4,16.8,1.22,2.2000000000000002,3.15,3.83,26.3,32.085999999999999,28500,1710,1490,15.7,1750,325,208,3.88,142,575000,4.6100000000000003,36.200000000000003,4.4711488750723154,null,"N","N",{"$f":"_xlfn.IFS($AE46<=$AX$5,\"C\",$AE46<=$AX$7,\"N\",TRUE,\"S\")","v":"C"},{"$f":"_xlfn.IFS($AF46<=$AY$5,\"C\",$AF46<=$AY$7,\"N\",TRUE,\"S\")","v":"C"},"F2",13.704940176609471,49.10742233603105,2.6326523044977565E-3,6.9308581563773483E-6,3.6266480015160682E-3,7.9115739938483948E-2,7448.4428571428571,118.44747652109696,592.58238454618242,1.0591158008658006,2.6326523044977565E-3,6.9308581563773483E-6,4.0960309243885584E-3,8.2028551303106143E-2,7224.0991110096975,118.44747652109696,338.28491614901174]
["W36X361","36X361","36",null,null,null,null,null,null,null,null,null,null,null,null,null,null,null,null,null,null,null,null,361,106,38,16.7,1.1200000000000001,2.0099999999999998,2.96,4.16,28.6,32.032000000000004,25700,1550,1350,15.6,1570,293,188,3.85,109,509000,4.58,36,4.4414946927326655,null,"N","N",{"$f":"_xlfn.IFS($AE47<=$AX$5,\"C\",$AE47<=$AX$7,\"N\",TRUE,\"S\")","v":"C"},{"$f":"_xlfn.IFS($AF47<=$AY$5,\"C\",$AF47<=$AY$7,\"N\",TRUE,\"S\")","v":"C"},"F2",13.598974144316101,47.244076678294455,2.2427983539094649E-3,5.0301444562990058E-6,3.6266480015160682E-3,7.6612312035504671E-2,7399.9714285714281,117.66189251023772,560.47063931170419,1.06878303095302,2.2427983539094649E-3,5.0301444562990058E-6,3.8570397500504246E-3,7.8101460318997173E-2,7176.1864249723494,117.66189251023772,336.04129535567063]
["W36X330","36X330","36",null,null,null,null,null,null,null,null,null,null,null,null,null,null,null,null,null,null,null,null,330,96.9,37.700000000000003,16.600000000000001,1.02,1.85,2.8,4.49,31.4,32.027999999999999,23300,1410,1240,15.5,1420,265,171,3.83,84.3,456000,4.53,35.9,4.4164633596860501,null,"N","N",{"$f":"_xlfn.IFS($AE48<=$AX$5,\"C\",$AE48<=$AX$7,\"N\",TRUE,\"S\")","v":"C"},{"$f":"_xlfn.IFS($AF48<=$AY$5,\"C\",$AF48<=$AY$7,\"N\",TRUE,\"S\")","v":"C"},"F2",13.528330122787183,45.317380058459378,1.893701141162728E-3,3.5861040120410184E-6,3.6266480015160682E-3,7.4299052098117616E-2,7319.1857142857152,116.99877474874678,532.02062816184934,1.0637759687398241,1.893701141162728E-3,3.5861040120410184E-6,3.6650668737706624E-3,7.4557145968266444E-2,7135.7429425784603,116.99877474874678,334.14743705719576]
["W36X302","36X302","36",null,null,null,null,null,null,null,null,null,null,null,null,null,null,null,null,null,null,null,null,302,89,37.299999999999997,16.7,0.94499999999999995,1.68,2.63,4.96,33.9,32.035499999999999,21100,1280,1130,15.4,1300,241,156,3.82,64.3,412000,4.53,35.6,4.4382758250094625,null,"N","N",{"$f":"_xlfn.IFS($AE49<=$AX$5,\"C\",$AE49<=$AX$7,\"N\",TRUE,\"S\")","v":"C"},{"$f":"_xlfn.IFS($AF49<=$AY$5,\"C\",$AF49<=$AY$7,\"N\",TRUE,\"S\")","v":"C"},"F2",13.493008112022727,44.088590377616732,1.5983891816645122E-3,2.554847976062149E-6,3.6266480015160682E-3,7.2284418674985418E-2,7319.1857142857152,117.57661984996147,513.11194674838885,1.0790400449101796,1.5983891816645122E-3,2.554847976062149E-6,3.5215705520736319E-3,7.1553893910381597E-2,7170.9856544081458,117.57661984996147,335.79775741312767]
["W36X282","36X282","36",null,null,null,null,null,null,null,null,null,null,null,null,null,null,null,null,null,null,null,null,282,82.9,37.1,16.600000000000001,0.88500000000000001,1.57,2.52,5.29,36.200000000000003,32.037000000000006,19600,1190,1050,15.4,1200,223,144,3.8,52.7,378000,4.5,35.5,4.4089423745102048,null,"N","S",{"$f":"_xlfn.IFS($AE50<=$AX$5,\"C\",$AE50<=$AX$7,\"N\",TRUE,\"S\")","v":"C"},{"$f":"_xlfn.IFS($AF50<=$AY$5,\"C\",$AF50<=$AY$7,\"N\",TRUE,\"S\")","v":"C"},"F2",13.422364090493813,43.016106755111842,1.4138162307176393E-3,1.9988763342406331E-6,3.6266480015160682E-3,7.0996226887305128E-2,7270.7142857142853,116.79953250924137,496.38416420424494,1.0878959788197375,1.4138162307176393E-3,1.9988763342406331E-6,3.4417274022517635E-3,6.9681730984307522E-2,7123.5911793872019,116.79953250924137,333.57840303246144]
["W36X262","36X262","36",null,null,null,null,null,null,null,null,null,null,null,null,null,null,null,null,null,null,null,null,262,77.2,36.9,16.600000000000001,0.84,1.44,2.39,5.75,38.200000000000003,32.088000000000001,17900,1100,972,15.3,1090,204,132,3.76,41.6,342000,4.46,35.5,4.3966482764568102,null,"N","S",{"$f":"_xlfn.IFS($AE51<=$AX$5,\"C\",$AE51<=$AX$7,\"N\",TRUE,\"S\")","v":"C"},{"$f":"_xlfn.IFS($AF51<=$AY$5,\"C\",$AF51<=$AY$7,\"N\",TRUE,\"S\")","v":"C"},"F2",13.281076047435981,41.743823016757567,1.2055874340694372E-3,1.4534410611861297E-6,3.6266480015160682E-3,6.9514282241748757E-2,7206.085714285713,116.4738433114054,480.07442316000282,1.1275903614457832,1.2055874340694372E-3,1.4534410611861297E-6,3.361555032772209E-3,6.758063677446112E-2,7103.7274295323605,116.4738433114054,332.64823764425279]
["W36X247","36X247","36",null,null,null,null,null,null,null,null,null,null,null,null,null,null,null,null,null,null,null,null,247,72.5,36.700000000000003,16.5,0.8,1.35,2.2999999999999998,6.11,40.1,32.080000000000005,16700,1030,913,15.2,1010,190,123,3.74,34.700000000000003,316000,4.42,35.4,4.362654614110733,null,"N","S",{"$f":"_xlfn.IFS($AE52<=$AX$5,\"C\",$AE52<=$AX$7,\"N\",TRUE,\"S\")","v":"C"},{"$f":"_xlfn.IFS($AF52<=$AY$5,\"C\",$AF52<=$AY$7,\"N\",TRUE,\"S\")","v":"C"},"F2",13.210432025907069,40.800684757882927,1.0736319700991952E-3,1.1526856072190791E-6,3.6266480015160682E-3,6.8558587876467111E-2,7141.4571428571426,115.57329993092179,467.04111359920648,1.1521436588103255,1.0736319700991952E-3,1.1526856072190791E-6,3.3165187749188332E-3,6.6258212660907395E-2,7048.8033836560544,115.57329993092179,330.0762939363496]
["W36X231","36X231","36",null,null,null,null,null,null,null,null,null,null,null,null,null,null,null,null,null,null,null,null,231,68.2,36.5,16.5,0.76,1.26,2.21,6.54,42.2,32.072000000000003,15600,963,854,15.1,940,176,114,3.71,28.7,292000,4.4000000000000004,35.200000000000003,4.3564820842781202,null,"N","S",{"$f":"_xlfn.IFS($AE53<=$AX$5,\"C\",$AE53<=$AX$7,\"N\",TRUE,\"S\")","v":"C"},{"$f":"_xlfn.IFS($AF53<=$AY$5,\"C\",$AF53<=$AY$7,\"N\",TRUE,\"S\")","v":"C"},"F2",13.104465993613696,40.099055294018207,9.5473174366616977E-4,9.115127023638449E-7,3.6266480015160682E-3,6.768589029614841E-2,7109.1428571428569,115.40978030702819,458.04831630956357,1.1724252044252046,9.5473174366616977E-4,9.115127023638449E-7,3.2799579081954516E-3,6.5074493097231442E-2,7038.8303390265055,115.40978030702819,329.6092833770515]
["W36X387","36X387","36",null,null,null,null,null,null,null,null,null,null,null,null,null,null,null,null,null,null,null,null,387,114,39.1,12.7,1.42,2.56,3.31,2.48,22.9,32.517999999999994,26500,1610,1360,15.2,882,224,139,2.78,172,294000,3.44,36.5,3.2966975206668443,null,"N","N",{"$f":"_xlfn.IFS($AE54<=$AX$5,\"C\",$AE54<=$AX$7,\"N\",TRUE,\"S\")","v":"C"},{"$f":"_xlfn.IFS($AF54<=$AY$5,\"C\",$AF54<=$AY$7,\"N\",TRUE,\"S\")","v":"C"},"F2",9.8195189925191553,39.004412711440459,3.4649476228847701E-3,1.2005862029334818E-5,3.6266480015160682E-3,8.4211612170773914E-2,5558.0571428571429,87.334488984115737,480.55763167593892,1.4202620570866138,3.4649476228847701E-3,1.2005862029334818E-5,4.6746628976328183E-3,9.0219790071345146E-2,5326.5212798202865,87.334488984115737,249.42650658873464]
["W36X350","36X350","36",null,null,null,null,null,null,null,null,null,null,null,null,null,null,null,null,null,null,null,null,350,103,38.6,12.6,1.3,2.3199999999999998,3.07,2.72,25,32.5,23600,1440,1220,15.1,780,199,124,2.75,129,257000,3.41,36.299999999999997,3.2652275955262025,null,"N","N",{"$f":"_xlfn.IFS($AE55<=$AX$5,\"C\",$AE55<=$AX$7,\"N\",TRUE,\"S\")","v":"C"},{"$f":"_xlfn.IFS($AF55<=$AY$5,\"C\",$AF55<=$AY$7,\"N\",TRUE,\"S\")","v":"C"},"F2",9.7135529602257851,37.128811441034365,2.9128844330036582E-3,8.484895720035043E-6,3.6266480015160682E-3,8.0867375588179732E-2,5509.5857142857139,86.500803208184919,447.48221206906692,1.4453338806787084,2.9128844330036582E-3,8.484895720035043E-6,4.281530905786513E-3,8.4819899426904363E-2,5275.674872200193,86.500803208184919,247.04550759163783]
["W36X318","36X318","36",null,null,null,null,null,null,null,null,null,null,null,null,null,null,null,null,null,null,null,null,318,93.4,38.200000000000003,12.4,1.18,2.13,2.88,2.91,27.5,32.449999999999996,21200,1300,1110,15.1,682,176,110,2.7,98.3,222000,3.33,36.1,3.2124443563507508,null,"N","N",{"$f":"_xlfn.IFS($AE56<=$AX$5,\"C\",$AE56<=$AX$7,\"N\",TRUE,\"S\")","v":"C"},{"$f":"_xlfn.IFS($AF56<=$AY$5,\"C\",$AF56<=$AY$7,\"N\",TRUE,\"S\")","v":"C"},"F2",9.5369429064034996,34.960044175007347,2.4531456664420651E-3,6.0179236607834837E-6,3.6266480015160682E-3,7.7973031670944618E-2,5380.3285714285712,85.102495601431244,416.40329013054094,1.449757685900348,2.4531456664420651E-3,6.0179236607834837E-6,3.9830308607834717E-3,8.0225784678154041E-2,5190.3922386181412,85.102495601431244,243.05195377863669]
["W36X286","36X286","36",null,null,null,null,null,null,null,null,null,null,null,null,null,null,null,null,null,null,null,null,286,83.9,37.799999999999997,12.3,1.06,1.93,2.68,3.19,30.6,32.436,18900,1160,1000,15,602,156,97.9,2.68,72.8,194000,3.29,35.9,3.186840637858372,null,"N","N",{"$f":"_xlfn.IFS($AE57<=$AX$5,\"C\",$AE57<=$AX$7,\"N\",TRUE,\"S\")","v":"C"},{"$f":"_xlfn.IFS($AF57<=$AY$5,\"C\",$AF57<=$AY$7,\"N\",TRUE,\"S\")","v":"C"},"F2",9.4662988848745844,33.310138785356585,2.0278551532033427E-3,4.1121965223733527E-6,3.6266480015160682E-3,7.5196430465278144E-2,5315.7,84.424214486282793,390.91923991367128,1.4483407051687096,2.0278551532033427E-3,4.1121965223733527E-6,3.7361487790963828E-3,7.592103748171336E-2,5149.0239448825978,84.424214486282793,241.11478907996462]
["W36X256","36X256","36",null,null,null,null,null,null,null,null,null,null,null,null,null,null,null,null,null,null,null,null,256,75.3,37.4,12.2,0.96,1.73,2.48,3.53,33.799999999999997,32.447999999999993,16800,1040,895,14.9,528,137,86.5,2.65,52.9,168000,3.24,35.700000000000003,3.1551023807611682,null,"N","N",{"$f":"_xlfn.IFS($AE58<=$AX$5,\"C\",$AE58<=$AX$7,\"N\",TRUE,\"S\")","v":"C"},{"$f":"_xlfn.IFS($AF58<=$AY$5,\"C\",$AF58<=$AY$7,\"N\",TRUE,\"S\")","v":"C"},"F2",9.3603328525812106,31.70583051044656,1.6556343207674129E-3,2.7411250041029725E-6,3.6266480015160682E-3,7.2679311514924808E-2,5234.914285714287,83.583420192158371,367.72915746294802,1.4758874253766698,1.6556343207674129E-3,2.7411250041029725E-6,3.5479199795475955E-3,7.2135665937974172E-2,5097.7439894869731,83.583420192158371,238.71348821952984]
["W36X232","36X232","36",null,null,null,null,null,null,null,null,null,null,null,null,null,null,null,null,null,null,null,null,232,68,37.1,12.1,0.87,1.57,2.3199999999999998,3.86,37.299999999999997,32.451000000000001,15000,936,809,14.8,468,122,77.2,2.62,39.6,148000,3.21,35.5,3.1270954883760655,null,"N","S",{"$f":"_xlfn.IFS($AE59<=$AX$5,\"C\",$AE59<=$AX$7,\"N\",TRUE,\"S\")","v":"C"},{"$f":"_xlfn.IFS($AF59<=$AY$5,\"C\",$AF59<=$AY$7,\"N\",TRUE,\"S\")","v":"C"},"F2",9.2543668202878404,30.578218159776686,1.3788540886853881E-3,1.9012385978844121E-6,3.6266480015160682E-3,7.0749573074340572E-2,5186.4428571428571,82.841475376429173,350.27908417434327,1.4861488656103594,1.3788540886853881E-3,1.9012385978844121E-6,3.4275136433068285E-3,6.9327972218955147E-2,5052.4928533619004,82.841475376429173,236.59450057076009]
["W36X210","36X210","36",null,null,null,null,null,null,null,null,null,null,null,null,null,null,null,null,null,null,null,null,210,61.9,36.700000000000003,12.2,0.83,1.36,2.11,4.4800000000000004,39.1,32.453000000000003,13200,833,719,14.6,411,107,67.5,2.58,28,128000,3.18,35.299999999999997,3.1244210615712147,null,"N","S",{"$f":"_xlfn.IFS($AE60<=$AX$5,\"C\",$AE60<=$AX$7,\"N\",TRUE,\"S\")","v":"C"},{"$f":"_xlfn.IFS($AF60<=$AY$5,\"C\",$AF60<=$AY$7,\"N\",TRUE,\"S\")","v":"C"},"F2",9.1130787772300099,29.446525103605932,1.1032004633441948E-3,1.217051262322846E-6,3.6266480015160682E-3,6.8773893774165956E-2,5137.971428571429,82.7706257771369,335.97503485622252,1.6234323770491805,1.1032004633441948E-3,1.217051262322846E-6,3.3262084179276684E-3,6.655380440870276E-2,5048.171743767205,82.7706257771369,236.39215475926864]
["W36X194","36X194","36",null,null,null,null,null,null,null,null,null,null,null,null,null,null,null,null,null,null,null,null,194,57,36.5,12.1,0.76500000000000001,1.26,2.0099999999999998,4.8099999999999996,42.4,32.436,12100,767,664,14.6,375,97.7,61.9,2.56,22.2,116000,3.15,35.200000000000003,3.0979756785544028,null,"N","S",{"$f":"_xlfn.IFS($AE61<=$AX$5,\"C\",$AE61<=$AX$7,\"N\",TRUE,\"S\")","v":"C"},{"$f":"_xlfn.IFS($AF61<=$AY$5,\"C\",$AF61<=$AY$7,\"N\",TRUE,\"S\")","v":"C"},"F2",9.0424347557010947,28.691891730563523,9.4982201533406335E-4,9.0216186081326169E-7,3.6266480015160682E-3,6.7649612096819384E-2,5089.5,82.070047699444387,325.48295250842733,1.6275442739079102,9.4982201533406335E-4,9.0216186081326169E-7,3.2785321468583009E-3,6.5025796128862307E-2,5005.4435606357565,82.070047699444387,234.3913101382704]
["W36X182","36X182","36",null,null,null,null,null,null,null,null,null,null,null,null,null,null,null,null,null,null,null,null,182,53.6,36.299999999999997,12.1,0.72499999999999998,1.18,1.93,5.12,44.8,32.479999999999997,11300,718,623,14.5,347,90.7,57.6,2.5499999999999998,18.5,107000,3.13,35.1,3.0935769842886534,null,"N","S",{"$f":"_xlfn.IFS($AE62<=$AX$5,\"C\",$AE62<=$AX$7,\"N\",TRUE,\"S\")","v":"C"},{"$f":"_xlfn.IFS($AF62<=$AY$5,\"C\",$AF62<=$AY$7,\"N\",TRUE,\"S\")","v":"C"},"F2",9.0071127449366362,28.184517423241914,8.460120819671382E-4,7.1573644283437175E-7,3.6266480015160682E-3,6.6877949157276101E-2,5057.1857142857134,81.953519654791123,319.89309410892793,1.6492505953214736,8.460120819671382E-4,7.1573644283437175E-7,3.2499765568392044E-3,6.3999911240613008E-2,4998.3365274720954,81.953519654791123,234.05850710208654]
["W36X170","36X170","36",null,null,null,null,null,null,null,null,null,null,null,null,null,null,null,null,null,null,null,null,170,50,36.200000000000003,12,0.68,1.1000000000000001,1.85,5.47,47.7,32.436000000000007,10500,668,581,14.5,320,83.8,53.2,2.5299999999999998,15.1,98500,3.11,35.1,3.0636687089901424,null,"N","S",{"$f":"_xlfn.IFS($AE63<=$AX$5,\"C\",$AE63<=$AX$7,\"N\",TRUE,\"S\")","v":"C"},{"$f":"_xlfn.IFS($AF63<=$AY$5,\"C\",$AF63<=$AY$7,\"N\",TRUE,\"S\")","v":"C"},"F2",8.9364687234077227,27.671965275111379,7.4044652357905356E-4,5.4826105428030594E-7,3.6266480015160682E-3,6.6083995983105631E-2,5024.8714285714286,81.161204338260845,311.67614377135868,1.670945454545455,7.4044652357905356E-4,5.4826105428030594E-7,3.2241079745334747E-3,6.2964708354065521E-2,4950.0132998112158,81.161204338260845,231.79566176094261]
["W36X160","36X160","36",null,null,null,null,null,null,null,null,null,null,null,null,null,null,null,null,null,null,null,null,160,47,36,12,0.65,1.02,1.77,5.88,49.9,32.435000000000002,9760,624,542,14.4,295,77.3,49.1,2.5,12.4,90200,3.09,35,3.0534357282741671,null,"N","S",{"$f":"_xlfn.IFS($AE64<=$AX$5,\"C\",$AE64<=$AX$7,\"N\",TRUE,\"S\")","v":"C"},{"$f":"_xlfn.IFS($AF64<=$AY$5,\"C\",$AF64<=$AY$7,\"N\",TRUE,\"S\")","v":"C"},"F2",8.8305026911143507,27.219459396194228,6.5366367949393786E-4,4.2727620588955352E-7,3.6266480015160682E-3,6.5424090983444372E-2,4992.557142857142,80.890117247009229,306.47013561207194,1.7224468954248366,6.5366367949393786E-4,4.2727620588955352E-7,3.2052905302108873E-3,6.2120481402713111E-2,4933.4797266829755,80.890117247009229,231.02143949275606]
["W36X150","36X150","36",null,null,null,null,null,null,null,null,null,null,null,null,null,null,null,null,null,null,null,null,150,44.3,35.9,12,0.625,0.94,1.69,6.37,51.9,32.4375,9040,581,504,14.3,270,70.900000000000006,45.1,2.4700000000000002,10.1,82200,3.06,35,3.0387459230069362,null,"N","S",{"$f":"_xlfn.IFS($AE65<=$AX$5,\"C\",$AE65<=$AX$7,\"N\",TRUE,\"S\")","v":"C"},{"$f":"_xlfn.IFS($AF65<=$AY$5,\"C\",$AF65<=$AY$7,\"N\",TRUE,\"S\")","v":"C"},"F2",8.7245366588209787,26.698604436923343,5.7256235827664401E-4,3.2782765411531205E-7,3.6266480015160682E-3,6.4801314491240936E-2,4944.0857142857139,80.500962152176541,301.15201920758545,1.7972905585106385,5.7256235827664401E-4,3.2782765411531205E-7,3.1897396181013505E-3,6.1337606542625989E-2,4909.7451984583504,80.500962152176541,229.91001607968752]
["W36X135","36X135","36",null,null,null,null,null,null,null,null,null,null,null,null,null,null,null,null,null,null,null,null,135,39.9,35.6,12,0.6,0.79,1.54,7.56,54.1,32.46,7800,509,439,14,225,59.7,37.700000000000003,2.38,7,68100,2.99,34.799999999999997,2.9898460883879858,null,"N","S",{"$f":"_xlfn.IFS($AE66<=$AX$5,\"C\",$AE66<=$AX$7,\"N\",TRUE,\"S\")","v":"C"},{"$f":"_xlfn.IFS($AF66<=$AY$5,\"C\",$AF66<=$AY$7,\"N\",TRUE,\"S\")","v":"C"},"F2",8.406638561940861,25.730155583353682,4.5819914644044723E-4,2.0994645779875441E-7,3.6266480015160682E-3,6.3912808950604846E-2,4830.9857142857154,79.205531788583471,291.0256166786628,2.0544303797468353,4.5819914644044723E-4,2.0994645779875441E-7,3.1712075988444516E-3,6.0244557806368691E-2,4830.7370370954459,79.205531788583471,226.21027873790536]
["W33X387","33X387","33",null,null,null,null,null,null,null,null,null,null,null,null,null,null,null,null,null,null,null,null,387,114,36,16.2,1.26,2.2799999999999998,3.07,3.55,23.7,29.861999999999998,24300,1560,1350,14.6,1620,312,200,3.77,148,459000,4.49,33.700000000000003,4.3238653922805321,null,"N","N",{"$f":"_xlfn.IFS($AE67<=$AX$5,\"C\",$AE67<=$AX$7,\"N\",TRUE,\"S\")","v":"C"},{"$f":"_xlfn.IFS($AF67<=$AY$5,\"C\",$AF67<=$AY$7,\"N\",TRUE,\"S\")","v":"C"},"F2",13.316398058200441,50.143665159833482,3.2531047367842614E-3,1.0582690428488198E-5,3.6266480015160682E-3,8.2944274897670478E-2,7254.5571428571429,114.54571494764834,615.9289191973379,1.0186842105263161,3.2531047367842614E-3,1.0582690428488198E-5,4.5198784945679939E-3,8.8164523655222315E-2,6986.1310838132586,114.54571494764834,327.1415205658023]
["W33X354","33X354","33",null,null,null,null,null,null,null,null,null,null,null,null,null,null,null,null,null,null,null,null,354,104,35.6,16.100000000000001,1.1599999999999999,2.09,2.88,3.85,25.7,29.811999999999998,22000,1420,1240,14.5,1460,282,181,3.74,115,408000,4.4400000000000004,33.5,4.2944099203145232,null,"N","N",{"$f":"_xlfn.IFS($AE68<=$AX$5,\"C\",$AE68<=$AX$7,\"N\",TRUE,\"S\")","v":"C"},{"$f":"_xlfn.IFS($AF68<=$AY$5,\"C\",$AF68<=$AY$7,\"N\",TRUE,\"S\")","v":"C"},"F2",13.210432025907069,47.806696677177833,2.7684159845931633E-3,7.6641270637509341E-6,3.6266480015160682E-3,7.9969143962588668E-2,7173.7714285714292,113.7653950742567,578.56766457933566,1.0277250438348835,2.7684159845931633E-3,7.6641270637509341E-6,4.1845834011190377E-3,8.3384647182273314E-2,6938.5394569653226,113.7653950742567,324.91293410121273]
["W33X318","33X318","33",null,null,null,null,null,null,null,null,null,null,null,null,null,null,null,null,null,null,null,null,318,93.7,35.200000000000003,16,1.04,1.89,2.68,4.2300000000000004,28.7,29.847999999999999,19500,1270,1110,14.5,1290,250,161,3.71,84.4,357000,4.4000000000000004,33.299999999999997,4.2681029581207071,null,"N","N",{"$f":"_xlfn.IFS($AE69<=$AX$5,\"C\",$AE69<=$AX$7,\"N\",TRUE,\"S\")","v":"C"},{"$f":"_xlfn.IFS($AF69<=$AY$5,\"C\",$AF69<=$AY$7,\"N\",TRUE,\"S\")","v":"C"},"F2",13.104465993613696,45.54389747184559,2.2833644455266078E-3,5.213753191095033E-6,3.6266480015160682E-3,7.6876605329857517E-2,7109.1428571428569,113.06848397291408,541.42144242057566,1.0265185185185186,2.2833644455266078E-3,5.213753191095033E-6,3.8807685280450662E-3,7.8511992546181589E-2,6896.0349223350277,113.06848397291408,322.92256233133372]
["W33X291","33X291","33",null,null,null,null,null,null,null,null,null,null,null,null,null,null,null,null,null,null,null,null,291,85.6,34.799999999999997,15.9,0.96,1.73,2.52,4.5999999999999996,31,29.759999999999998,17700,1160,1020,14.4,1160,226,146,3.68,65.099999999999994,319000,4.34,33.1,4.2377765478759288,null,"N","N",{"$f":"_xlfn.IFS($AE70<=$AX$5,\"C\",$AE70<=$AX$7,\"N\",TRUE,\"S\")","v":"C"},{"$f":"_xlfn.IFS($AF70<=$AY$5,\"C\",$AF70<=$AY$7,\"N\",TRUE,\"S\")","v":"C"},"F2",12.998499961320322,43.552116722913958,1.9282033054913808E-3,3.717967987307887E-6,3.6266480015160682E-3,7.4530874857386784E-2,7012.1999999999989,112.26509163107902,512.89810445609635,1.0386301668666156,1.9282033054913808E-3,3.717967987307887E-6,3.6830122406092984E-3,7.4908047271976586E-2,6847.0361080681078,112.26509163107902,320.62808110661956]
["W33X263","33X263","33",null,null,null,null,null,null,null,null,null,null,null,null,null,null,null,null,null,null,null,null,263,77.400000000000006,34.5,15.8,0.87,1.57,2.36,5.03,34.299999999999997,29.840999999999998,15900,1040,919,14.3,1040,202,131,3.66,48.7,281000,4.3099999999999996,32.9,4.2087452489543917,null,"N","N",{"$f":"_xlfn.IFS($AE71<=$AX$5,\"C\",$AE71<=$AX$7,\"N\",TRUE,\"S\")","v":"C"},{"$f":"_xlfn.IFS($AF71<=$AY$5,\"C\",$AF71<=$AY$7,\"N\",TRUE,\"S\")","v":"C"},"F2",12.927855939791408,41.996853176423564,1.6107107302439881E-3,2.5943890565231214E-6,3.6266480015160682E-3,7.2369598117994663E-2,6963.7285714285708,111.49600874131949,487.42707006544464,1.0465883254051438,1.6107107302439881E-3,2.5943890565231214E-6,3.5271802099826372E-3,7.167908300352778E-2,6800.1298236677394,111.49600874131949,318.43158736512896]
["W33X241","33X241","33",null,null,null,null,null,null,null,null,null,null,null,null,null,null,null,null,null,null,null,null,241,71.099999999999994,34.200000000000003,15.9,0.83,1.4,2.19,5.66,35.9,29.796999999999997,14200,940,831,14.1,933,182,118,3.62,36.200000000000003,251000,4.29,32.799999999999997,{"$f":"$AA72/(SQRT(12*(1+$BJ72/6)))","v":4.2161484651682413},null,{"$f":"IF($AE72<=$AV$7,\"N\",\"S\")","v":"N"},{"$f":"IF($AF72<=$AW$7,\"N\",\"S\")","v":"S"},{"$f":"_xlfn.IFS($AE72<=$AX$5,\"C\",$AE72<=$AX$7,\"N\",TRUE,\"S\")","v":"C"},{"$f":"_xlfn.IFS($AF72<=$AY$5,\"C\",$AF72<=$AY$7,\"N\",TRUE,\"S\")","v":"C"},"F2",12.78656789673358,40.658540865696658,1.3281089489595259E-3,1.7638733803063766E-6,{"$f":"SQRT($BD$8+$BC$5)","v":3.6266480015160682E-3},7.0390034454286168E-2,6931.4142857142851,111.69213110341738,468.77509448142825,1.1110292003593889,1.3281089489595259E-3,1.7638733803063766E-6,3.4074161115831472E-3,6.8815151387922366E-2,{"$f":"1.95*$AT72*E/$BJ$5","v":6812.0913058646875},111.69213110341738,{"$f":"pi*$AT72*SQRT(E/Fy)","v":318.99171104835}]
["W33X221",{"$f":"RIGHT(A73,LEN(A73)-1)","v":"33X221"},{"$f":"LEFT(B73,(FIND(\"X\",B73)-1))","v":"33"},null,null,null,null,null,null,null,null,null,null,null,null,null,null,null,null,null,null,null,null,221,65.3,33.9,15.8,0.77500000000000002,1.28,2.06,6.2,38.5,{"$f":"+AF73*AB73","v":29.837500000000002},12900,857,759,14.1,840,164,106,3.59,27.8,224000,4.25,32.6,4.1801290846451451,null,"N","S",{"$f":"_xlfn.IFS($AE73<=$AX$5,\"C\",$AE73<=$AX$7,\"N\",TRUE,\"S\")","v":"C"},{"$f":"_xlfn.IFS($AF73<=$AY$5,\"C\",$AF73<=$AY$7,\"N\",TRUE,\"S\")","v":"C"},{"$f":"IF(AND(AX73=\"C\", AY73= \"C\"),\"F2\",\"F3\")","v":"F2"},{"$f":"1.76*AO73*sqrtefy/12","v":12.680601864440206},{"$f":"+$BG73*$BF73/12","v":39.439125742647896},{"$f":"+($AP73*$BD$5)/($AJ73*$AS73)","v":1.1235319317474558E-3},{"$f":"+$BC73^2","v":1.2623240016561696E-6},3.6266480015160682E-3,{"$f":"SQRT(($BC73+$BE73))","v":6.8921549121182146E-2},{"$f":"1.95*AR73*E/(0.7*Fy)","v":6866.7857142857147},{"$f":"1.1*AT73*SQRT(E/Fy)","v":110.73792339349298},{"$f":"$BO73*$BN73","v":450.8718353238209},{"$f":"(AG73*AB73)/(AA73*AC73)","v":1.1433970777294304},{"$f":"+($AP73)/($AJ73*$AS73)","v":1.1235319317474558E-3},{"$f":"+$BC73^2","v":1.2623240016561696E-6},{"$f":"SQRT($BL73+$BK$5)","v":3.3330069275094836E-3},{"$f":"+SQRT($BK73+$BM73)","v":6.6757313151870779E-2},6753.8942781909409,{"$f":"+$BH73","v":110.73792339349298},316.26650250342135]
["W33X201","33X201","33",null,null,null,null,null,null,null,null,null,null,null,null,null,null,null,null,null,null,null,null,201,59.1,33.700000000000003,15.7,0.71499999999999997,1.1499999999999999,1.94,6.85,41.7,29.8155,11600,773,686,14,749,147,95.2,3.56,20.8,198000,4.21,32.6,4.1428609024170235,null,"N","S",{"$f":"_xlfn.IFS($AE74<=$AX$5,\"C\",$AE74<=$AX$7,\"N\",TRUE,\"S\")","v":"C"},{"$f":"_xlfn.IFS($AF74<=$AY$5,\"C\",$AF74<=$AY$7,\"N\",TRUE,\"S\")","v":"C"},"F2",12.574635832146834,38.264152749920704,9.3008281314278557E-4,8.650540393035978E-7,3.6266480015160682E-3,6.7503561496108144E-2,6802.1571428571433,109.75063304311786,433.9523782213077,1.1807301301578512,9.3008281314278557E-4,8.650540393035978E-7,3.2728680414085801E-3,6.4830169323790654E-2,6693.6795437623623,109.75063304311786,313.44681023811694]
["W33X169","33X169","33",null,null,null,null,null,null,null,null,null,null,null,null,null,null,null,null,null,null,null,null,169,49.5,33.799999999999997,11.5,0.67,1.22,1.92,4.71,44.7,29.949000000000005,9290,629,549,13.7,310,84.4,53.9,2.5,17.7,82400,3.03,32.6,2.9831997384464528,null,"N","S",{"$f":"_xlfn.IFS($AE75<=$AX$5,\"C\",$AE75<=$AX$7,\"N\",TRUE,\"S\")","v":"C"},{"$f":"_xlfn.IFS($AF75<=$AY$5,\"C\",$AF75<=$AY$7,\"N\",TRUE,\"S\")","v":"C"},"F2",8.8305026911143507,27.716660262330951,9.8897046498374057E-4,9.7806258061015595E-7,3.6266480015160682E-3,6.7938343124481687E-2,4895.614285714285,79.029459955449084,315.29781894216887,1.4302088382038494,9.8897046498374057E-4,9.7806258061015595E-7,3.2900871960755379E-3,6.5414506503215925E-2,4819.9984345470548,79.029459955449084,225.7074191831266]
["W33X152","33X152","33",null,null,null,null,null,null,null,null,null,null,null,null,null,null,null,null,null,null,null,null,152,44.9,33.5,11.6,0.63500000000000001,1.06,1.76,5.48,47.2,29.972000000000001,8160,559,487,13.5,273,73.900000000000006,47.2,2.4700000000000002,12.4,71700,3.01,32.4,2.9856005151707179,null,"N","S",{"$f":"_xlfn.IFS($AE76<=$AX$5,\"C\",$AE76<=$AX$7,\"N\",TRUE,\"S\")","v":"C"},{"$f":"_xlfn.IFS($AF76<=$AY$5,\"C\",$AF76<=$AY$7,\"N\",TRUE,\"S\")","v":"C"},"F2",8.7245366588209787,26.921099470371558,7.8586457778791804E-4,6.1758313462178268E-7,3.6266480015160682E-3,6.6426745963534789E-2,4863.2999999999993,79.09306015142225,305.87739407598031,1.5478383214053353,7.8586457778791804E-4,6.1758313462178268E-7,3.2348406934178103E-3,6.3409031464025128E-2,4823.8774037972598,79.09306015142225,225.88906076464238]
["W33X141","33X141","33",null,null,null,null,null,null,null,null,null,null,null,null,null,null,null,null,null,null,null,null,141,41.5,33.299999999999997,11.5,0.60499999999999998,0.96,1.66,6.01,49.6,30.007999999999999,7450,514,448,13.4,246,66.900000000000006,42.7,2.4300000000000002,9.6999999999999993,64400,2.98,32.299999999999997,2.9410975686927219,null,"N","S",{"$f":"_xlfn.IFS($AE77<=$AX$5,\"C\",$AE77<=$AX$7,\"N\",TRUE,\"S\")","v":"C"},{"$f":"_xlfn.IFS($AF77<=$AY$5,\"C\",$AF77<=$AY$7,\"N\",TRUE,\"S\")","v":"C"},"F2",8.58324861576315,26.301550200258045,6.703339230429014E-4,4.4934756838208645E-7,3.6266480015160682E-3,6.5551368594095494E-2,4814.8285714285712,77.914109985512866,295.96309286219537,1.6444601449275364,6.703339230429014E-4,4.4934756838208645E-7,3.2087316412489414E-3,6.2282144827324651E-2,4751.9733574163838,77.914109985512866,222.52198980853393]
["W33X130","33X130","33",null,null,null,null,null,null,null,null,null,null,null,null,null,null,null,null,null,null,null,null,130,38.299999999999997,33.1,11.5,0.57999999999999996,0.85499999999999998,1.56,6.73,51.7,29.986000000000001,6710,467,406,13.2,218,59.5,37.9,2.39,7.37,56600,2.94,32.200000000000003,2.9174635190324048,null,"N","S",{"$f":"_xlfn.IFS($AE78<=$AX$5,\"C\",$AE78<=$AX$7,\"N\",TRUE,\"S\")","v":"C"},{"$f":"_xlfn.IFS($AF78<=$AY$5,\"C\",$AF78<=$AY$7,\"N\",TRUE,\"S\")","v":"C"},"F2",8.4419605727053195,25.624666441454163,5.6374873787595997E-4,3.178126394567378E-7,3.6266480015160682E-3,6.4733273819512854E-2,4750.2,77.288008368130775,288.7331662376792,1.7688156623442666,5.6374873787595997E-4,3.178126394567378E-7,3.1881693519364329E-3,6.1252902705197509E-2,4713.7874857509287,77.288008368130775,220.73384928112361]
["W33X118","33X118","33",null,null,null,null,null,null,null,null,null,null,null,null,null,null,null,null,null,null,null,null,118,34.700000000000003,32.9,11.5,0.55000000000000004,0.74,1.44,7.76,54.5,29.975000000000001,5900,415,359,13,187,51.3,32.6,2.3199999999999998,5.3,48300,2.89,32.200000000000003,2.8863367633632238,null,"N","S",{"$f":"_xlfn.IFS($AE79<=$AX$5,\"C\",$AE79<=$AX$7,\"N\",TRUE,\"S\")","v":"C"},{"$f":"_xlfn.IFS($AF79<=$AY$5,\"C\",$AF79<=$AY$7,\"N\",TRUE,\"S\")","v":"C"},"F2",8.194706497354117,24.870486765330167,4.5848544092458342E-4,2.1020889953980968E-7,3.6266480015160682E-3,6.3915048638334387E-2,4669.4142857142861,76.463413669023694,280.96290895868208,1.9372796709753235,4.5848544092458342E-4,2.1020889953980968E-7,3.1712489774077734E-3,6.024727726903812E-2,4663.495541948294,76.463413669023694,218.3788143167892]
["W30X391","30X391","30",null,null,null,null,null,null,null,null,null,null,null,null,null,null,null,null,null,null,null,null,391,115,33.200000000000003,15.6,1.36,2.44,3.23,3.19,19.7,26.792000000000002,20700,1450,1250,13.4,1550,310,198,3.67,173,366000,4.37,30.8,4.1820623547294513,null,"N","N",{"$f":"_xlfn.IFS($AE80<=$AX$5,\"C\",$AE80<=$AX$7,\"N\",TRUE,\"S\")","v":"C"},{"$f":"_xlfn.IFS($AF80<=$AY$5,\"C\",$AF80<=$AY$7,\"N\",TRUE,\"S\")","v":"C"},"F2",12.963177950555867,53.020876388555273,4.4935064935064939E-3,2.0191600607185026E-5,3.6266480015160682E-3,9.0111899852475433E-2,7060.6714285714288,110.78913863353932,674.83022032914141,0.95725935266918893,4.4935064935064939E-3,2.0191600607185026E-5,5.4807127077009851E-3,9.9871012817571242E-2,6757.017890284299,110.78913863353932,316.41277276340065]
["W30X357","30X357","30",null,null,null,null,null,null,null,null,null,null,null,null,null,null,null,null,null,null,null,null,357,105,32.799999999999997,15.5,1.24,2.2400000000000002,3.03,3.45,21.6,26.784000000000002,18700,1320,1140,13.3,1390,279,179,3.64,134,324000,4.3099999999999996,30.6,4.1554597108198612,null,"N","N",{"$f":"_xlfn.IFS($AE81<=$AX$5,\"C\",$AE81<=$AX$7,\"N\",TRUE,\"S\")","v":"C"},{"$f":"_xlfn.IFS($AF81<=$AY$5,\"C\",$AF81<=$AY$7,\"N\",TRUE,\"S\")","v":"C"},"F2",12.857211918262495,50.148887994438375,3.8413026029125098E-3,1.4755605687142422E-5,3.6266480015160682E-3,8.6417305005586573E-2,6963.7285714285708,110.08439447763614,629.88120779695339,0.95657142857142852,3.8413026029125098E-3,1.4755605687142422E-5,4.9600621835126681E-3,9.3815589250535417E-2,6714.0356184818038,110.08439447763614,314.40002986090627]
["W30X326","30X326","30",null,null,null,null,null,null,null,null,null,null,null,null,null,null,null,null,null,null,null,null,326,95.9,32.4,15.4,1.1399999999999999,2.0499999999999998,2.84,3.75,23.4,26.675999999999995,16800,1190,1040,13.2,1240,252,162,3.6,103,287000,4.26,30.4,4.1266620282218094,null,"N","N",{"$f":"_xlfn.IFS($AE82<=$AX$5,\"C\",$AE82<=$AX$7,\"N\",TRUE,\"S\")","v":"C"},{"$f":"_xlfn.IFS($AF82<=$AY$5,\"C\",$AF82<=$AY$7,\"N\",TRUE,\"S\")","v":"C"},"F2",12.715923875204664,47.591442873519789,3.2578441295546558E-3,1.0613548372473733E-5,3.6266480015160682E-3,8.2972839719216096E-2,6882.9428571428562,109.32150043659627,588.14571806428478,0.9632765283496989,3.2578441295546558E-3,1.0613548372473733E-5,4.5232907876504875E-3,8.8210741506945425E-2,6667.5067913126668,109.32150043659627,312.22121141509677]
["W30X292","30X292","30",null,null,null,null,null,null,null,null,null,null,null,null,null,null,null,null,null,null,null,null,292,86,32,15.3,1.02,1.85,2.64,4.12,26.2,26.724,14900,1060,930,13.2,1100,223,144,3.58,75.2,250000,4.22,30.2,4.0999389747072383,null,"N","N",{"$f":"_xlfn.IFS($AE83<=$AX$5,\"C\",$AE83<=$AX$7,\"N\",TRUE,\"S\")","v":"C"},{"$f":"_xlfn.IFS($AF83<=$AY$5,\"C\",$AF83<=$AY$7,\"N\",TRUE,\"S\")","v":"C"},"F2",12.645279853675747,45.113720551081776,2.6774905646941537E-3,7.1689557240262176E-6,3.6266480015160682E-3,7.9398605568424319E-2,6818.3142857142848,108.61356644867065,546.35598727628087,0.96302702702702703,2.6774905646941537E-3,7.1689557240262176E-6,4.124992957714747E-3,8.2477169704160566E-2,6624.3299719912666,108.61356644867065,310.19935838134467]
["W30X261","30X261","30",null,null,null,null,null,null,null,null,null,null,null,null,null,null,null,null,null,null,null,null,261,77,31.6,15.2,0.93,1.65,2.44,4.59,28.7,26.691000000000003,13100,943,829,13.1,959,196,127,3.53,54.1,215000,4.16,30,4.0653518617959659,null,"N","N",{"$f":"_xlfn.IFS($AE84<=$AX$5,\"C\",$AE84<=$AX$7,\"N\",TRUE,\"S\")","v":"C"},{"$f":"_xlfn.IFS($AF84<=$AY$5,\"C\",$AF84<=$AY$7,\"N\",TRUE,\"S\")","v":"C"},"F2",12.46866979985346,42.664238702377034,2.1753116204262166E-3,4.7319806459613322E-6,3.6266480015160682E-3,7.6170595520465012E-2,6721.3714285714286,107.69730166774804,508.51421676478128,0.98973803827751217,2.1753116204262166E-3,4.7319806459613322E-6,3.8181922192487075E-3,7.7417723033391547E-2,6568.4470795589104,107.69730166774804,307.58251449670956]
["W30X235","30X235","30",null,null,null,null,null,null,null,null,null,null,null,null,null,null,null,null,null,null,null,null,235,69.3,31.3,15.1,0.83,1.5,2.29,5.0199999999999996,32.200000000000003,26.726000000000003,11700,847,748,13,855,175,114,3.51,40.299999999999997,190000,4.13,29.8,4.0416066644951929,null,"N","N",{"$f":"_xlfn.IFS($AE85<=$AX$5,\"C\",$AE85<=$AX$7,\"N\",TRUE,\"S\")","v":"C"},{"$f":"_xlfn.IFS($AF85<=$AY$5,\"C\",$AF85<=$AY$7,\"N\",TRUE,\"S\")","v":"C"},"F2",12.398025778324547,40.993708702836024,1.807953199583677E-3,3.268694771884855E-6,3.6266480015160682E-3,7.3719747701004409E-2,6672.9,107.06825558175149,481.16817867435071,0.9793633554083887,1.807953199583677E-3,3.268694771884855E-6,3.6215060332760586E-3,7.3684864340376827E-2,6530.0816250629468,107.06825558175149,305.78596459370419]
["W30X211","30X211","30",null,null,null,null,null,null,null,null,null,null,null,null,null,null,null,null,null,null,null,null,211,62.3,30.9,15.1,0.77500000000000002,1.32,2.1,5.74,34.5,26.737500000000001,10300,751,665,12.9,757,155,100,3.49,28.4,166000,4.1100000000000003,29.6,4.0242741878305148,null,"N","N",{"$f":"_xlfn.IFS($AE86<=$AX$5,\"C\",$AE86<=$AX$7,\"N\",TRUE,\"S\")","v":"C"},{"$f":"_xlfn.IFS($AF86<=$AY$5,\"C\",$AF86<=$AY$7,\"N\",TRUE,\"S\")","v":"C"},"F2",12.327381756795633,39.400824819853277,1.4427961796382848E-3,2.0816608159788298E-6,3.6266480015160682E-3,7.1200029362032943E-2,6640.5857142857139,106.60909213625814,454.98418776485755,1.0396128085490668,1.4427961796382848E-3,2.0816608159788298E-6,3.453733051807691E-3,6.9975204404460117E-2,6502.0772949090169,106.60909213625814,304.47459796758835]
["W30X191","30X191","30",null,null,null,null,null,null,null,null,null,null,null,null,null,null,null,null,null,null,null,null,191,56.1,30.7,15,0.71,1.19,1.97,6.35,37.700000000000003,26.766999999999999,9200,675,600,12.8,673,138,89.5,3.46,21,146000,4.0599999999999996,29.5,3.9905242898674871,null,"N","S",{"$f":"_xlfn.IFS($AE87<=$AX$5,\"C\",$AE87<=$AX$7,\"N\",TRUE,\"S\")","v":"C"},{"$f":"_xlfn.IFS($AF87<=$AY$5,\"C\",$AF87<=$AY$7,\"N\",TRUE,\"S\")","v":"C"},"F2",12.221415724502259,37.924624040946931,1.1864406779661016E-3,1.4076414823326629E-6,3.6266480015160682E-3,6.9376427405006741E-2,6559.7999999999993,105.71500644189609,434.48893016566802,1.0646817927170869,1.1864406779661016E-3,1.4076414823326629E-6,3.3547358553994533E-3,6.7388252191057416E-2,6447.5471026287541,105.71500644189609,301.92109735254206]
["W30X173","30X173","30",null,null,null,null,null,null,null,null,null,null,null,null,null,null,null,null,null,null,null,null,173,50.9,30.4,15,0.65500000000000003,1.07,1.85,7.04,40.799999999999997,26.724,8230,607,541,12.7,598,123,79.8,3.42,15.6,129000,4.03,29.3,3.9832227738579213,null,"N","S",{"$f":"_xlfn.IFS($AE88<=$AX$5,\"C\",$AE88<=$AX$7,\"N\",TRUE,\"S\")","v":"C"},{"$f":"_xlfn.IFS($AF88<=$AY$5,\"C\",$AF88<=$AY$7,\"N\",TRUE,\"S\")","v":"C"},"F2",12.080127681444431,36.844803448761546,9.8414641070448472E-4,9.6854415770252035E-7,3.6266480015160682E-3,6.7902830664270192E-2,6511.3285714285712,105.52157827158103,420.68281443740472,1.0906056074766355,9.8414641070448472E-4,9.6854415770252035E-7,3.2886403474494679E-3,6.5366556878528895E-2,6435.7499389047271,105.52157827158103,301.36866825656017]
["W30X148","30X148","30",null,null,null,null,null,null,null,null,null,null,null,null,null,null,null,null,null,null,null,null,148,43.6,30.7,10.5,0.65,1.18,1.83,4.4400000000000004,41.6,27.040000000000003,6680,500,436,12.4,227,68,43.3,2.2799999999999998,14.5,49400,2.77,29.5,2.7259280977460785,null,"N","S",{"$f":"_xlfn.IFS($AE89<=$AX$5,\"C\",$AE89<=$AX$7,\"N\",TRUE,\"S\")","v":"C"},{"$f":"_xlfn.IFS($AF89<=$AY$5,\"C\",$AF89<=$AY$7,\"N\",TRUE,\"S\")","v":"C"},"F2",8.0534184542962866,25.715363734364406,1.1273518892862696E-3,1.2709222822773215E-6,3.6266480015160682E-3,6.8949255911883042E-2,4475.528571428571,72.213946208792905,294.18913831754583,1.4185633575464089,1.1273518892862696E-3,1.2709222822773215E-6,3.3342965464168541E-3,6.6795571976764473E-2,4404.3209693583067,72.213946208792905,206.24237388189243]
["W30X132","30X132","30",null,null,null,null,null,null,null,null,null,null,null,null,null,null,null,null,null,null,null,null,132,38.799999999999997,30.3,10.5,0.61499999999999999,1,1.65,5.27,43.9,26.9985,5770,437,380,12.2,196,58.4,37.200000000000003,2.25,9.7200000000000006,42100,2.75,29.3,2.6965053969523196,null,"N","S",{"$f":"_xlfn.IFS($AE90<=$AX$5,\"C\",$AE90<=$AX$7,\"N\",TRUE,\"S\")","v":"C"},{"$f":"_xlfn.IFS($AF90<=$AY$5,\"C\",$AF90<=$AY$7,\"N\",TRUE,\"S\")","v":"C"},"F2",7.9474524220029146,24.837355946296714,8.7300161666966053E-4,7.6213182270784087E-7,3.6266480015160682E-3,6.7079427682306056E-2,4443.2142857142853,71.434494493175478,279.99261138861095,1.5813407142857141,8.7300161666966053E-4,7.6213182270784087E-7,3.257106537999314E-3,6.4265917519856317E-2,4356.7822913615337,71.434494493175478,204.01626686801379]
["W30X124","30X124","30",null,null,null,null,null,null,null,null,null,null,null,null,null,null,null,null,null,null,null,null,124,36.5,30.2,10.5,0.58499999999999996,0.93,1.58,5.65,46.2,27.027000000000001,5360,408,355,12.1,181,54,34.4,2.23,7.99,38600,2.73,29.3,2.6898102051410033,null,"N","S",{"$f":"_xlfn.IFS($AE91<=$AX$5,\"C\",$AE91<=$AX$7,\"N\",TRUE,\"S\")","v":"C"},{"$f":"_xlfn.IFS($AF91<=$AY$5,\"C\",$AF91<=$AY$7,\"N\",TRUE,\"S\")","v":"C"},"F2",7.8768084004740002,24.367773097175728,7.6815843868672791E-4,5.900673869256315E-7,3.6266480015160682E-3,6.6293336318236362E-2,4410.8999999999996,71.257128765253427,274.81976552387431,1.6191290322580643,7.6815843868672791E-4,5.900673869256315E-7,3.2305848640912793E-3,6.3235617359032784E-2,4345.9647743063924,71.257128765253427,203.50971196148407]
["W30X116","30X116","30",null,null,null,null,null,null,null,null,null,null,null,null,null,null,null,null,null,null,null,null,116,34.200000000000003,30,10.5,0.56499999999999995,0.85,1.5,6.17,47.8,27.006999999999994,4930,378,329,12,164,49.2,31.3,2.19,6.43,34900,2.7,29.2,2.6739663181341107,null,"N","S",{"$f":"_xlfn.IFS($AE92<=$AX$5,\"C\",$AE92<=$AX$7,\"N\",TRUE,\"S\")","v":"C"},{"$f":"_xlfn.IFS($AF92<=$AY$5,\"C\",$AF92<=$AY$7,\"N\",TRUE,\"S\")","v":"C"},"F2",7.7355203574161706,23.827445175910331,6.6931756672357085E-4,4.479860051247617E-7,3.6266480015160682E-3,6.5543615770261243E-2,4362.4285714285725,70.837400304697184,269.03902130030582,1.7096868347338932,6.6931756672357085E-4,4.479860051247617E-7,3.2085194688975783E-3,6.2272281439025093E-2,4320.3655797281126,70.837400304697184,202.31097129384872]
["W30X108","30X108","30",null,null,null,null,null,null,null,null,null,null,null,null,null,null,null,null,null,null,null,null,108,31.7,29.8,10.5,0.54500000000000004,0.76,1.41,6.89,49.6,27.032000000000004,4470,346,299,11.9,146,43.9,27.9,2.15,4.99,30900,2.67,29,2.6506075620290219,null,"N","S",{"$f":"_xlfn.IFS($AE93<=$AX$5,\"C\",$AE93<=$AX$7,\"N\",TRUE,\"S\")","v":"C"},{"$f":"_xlfn.IFS($AF93<=$AY$5,\"C\",$AF93<=$AY$7,\"N\",TRUE,\"S\")","v":"C"},"F2",7.594232314358341,23.30393691212727,5.7548149002421866E-4,3.3117894536049486E-7,3.6266480015160682E-3,6.4823834286011545E-2,4313.9571428571426,70.218591628755988,262.8061546236795,1.846170426065163,5.7548149002421866E-4,3.3117894536049486E-7,3.1902648984889221E-3,6.1365677609826336E-2,4282.6245037926055,70.218591628755988,200.54365934089407]
["W30X99","30X99","30",null,null,null,null,null,null,null,null,null,null,null,null,null,null,null,null,null,null,null,null,99,29,29.7,10.5,0.52,0.67,1.32,7.8,51.9,26.988,3990,312,269,11.7,128,38.6,24.5,2.1,3.77,26800,2.62,29,2.6258455576313087,null,"N","S",{"$f":"_xlfn.IFS($AE94<=$AX$5,\"C\",$AE94<=$AX$7,\"N\",TRUE,\"S\")","v":"C"},{"$f":"_xlfn.IFS($AF94<=$AY$5,\"C\",$AF94<=$AY$7,\"N\",TRUE,\"S\")","v":"C"},"F2",7.4176222605360538,22.615243149276207,4.8327137546468399E-4,2.3355122234352756E-7,3.6266480015160682E-3,6.4108652902558738E-2,4233.1714285714288,69.562608789341809,256.60633799897579,1.9948486140724948,4.8327137546468399E-4,2.3355122234352756E-7,3.174927148693898E-3,6.0483043277918661E-2,4242.6161795442995,69.562608789341809,198.67017831500755]
["W30X90","30X90","30",null,null,null,null,null,null,null,null,null,null,null,null,null,null,null,null,null,null,null,null,90,26.3,29.5,10.4,0.47,0.61,1.26,8.52,57.5,27.024999999999999,3610,283,245,11.7,115,34.700000000000003,22.1,2.09,2.84,24000,2.6,28.9,2.5996478686804907,null,"N","S",{"$f":"_xlfn.IFS($AE95<=$AX$5,\"C\",$AE95<=$AX$7,\"N\",TRUE,\"S\")","v":"C"},{"$f":"_xlfn.IFS($AF95<=$AY$5,\"C\",$AF95<=$AY$7,\"N\",TRUE,\"S\")","v":"C"},"F2",7.3823002497715962,22.21712709405244,4.0110161711743518E-4,1.6088250725422157E-7,3.6266480015160682E-3,6.3464554033204265E-2,4200.8571428571431,68.86859250099829,250.77387631918683,2.002167402269861,4.0110161711743518E-4,1.6088250725422157E-7,3.1634622938205314E-3,5.9703968971400609E-2,4200.2881992537632,68.86859250099829,196.68807410473744]
["W27X539","27X539","27",null,null,null,null,null,null,null,null,null,null,null,null,null,null,null,null,null,null,null,null,539,159,32.5,15.3,1.97,3.54,4.33,2.15,12.1,23.837,25600,1890,1570,12.7,2110,437,277,3.65,496,443000,4.41,29,4.1285034774083682,null,"N","N",{"$f":"_xlfn.IFS($AE96<=$AX$5,\"C\",$AE96<=$AX$7,\"N\",TRUE,\"S\")","v":"C"},{"$f":"_xlfn.IFS($AF96<=$AY$5,\"C\",$AF96<=$AY$7,\"N\",TRUE,\"S\")","v":"C"},"F2",12.892533929026952,71.550661376301804,1.0893916099275203E-2,1.1867740797804745E-4,3.6266480015160682E-3,0.12050130331573709,7125.3000000000011,109.37028320258867,994.56774442620929,0.86700804992430103,1.0893916099275203E-2,1.1867740797804745E-4,1.1336843438771548E-2,0.14909983077806208,6670.4820470698069,109.37028320258867,312.36053455129132]
["W27X368","27X368","27",null,null,null,null,null,null,null,null,null,null,null,null,null,null,null,null,null,null,null,null,368,109,30.4,14.7,1.38,2.48,3.27,2.96,17.3,23.873999999999999,16200,1240,1060,12.2,1310,279,179,3.48,170,255000,4.1500000000000004,27.9,3.9560398980056308,null,"N","N",{"$f":"_xlfn.IFS($AE97<=$AX$5,\"C\",$AE97<=$AX$7,\"N\",TRUE,\"S\")","v":"C"},{"$f":"_xlfn.IFS($AF97<=$AY$5,\"C\",$AF97<=$AY$7,\"N\",TRUE,\"S\")","v":"C"},"F2",12.292059746031176,54.10229321302824,5.7482924190167036E-3,3.3042865734524908E-5,3.6266480015160682E-3,9.6824275987650796E-2,6705.2142857142862,104.80146289648339,708.81039879426373,0.90372284397630009,5.7482924190167036E-3,3.3042865734524908E-5,6.5490057956681443E-3,0.11089318380624144,6391.8301780633838,104.80146289648339,299.31202529178478]
["W27X336","27X336","27",null,null,null,null,null,null,null,null,null,null,null,null,null,null,null,null,null,null,null,null,336,99.2,30,14.6,1.26,2.2799999999999998,3.07,3.19,18.899999999999999,23.814,14600,1130,972,12.1,1180,252,162,3.45,131,226000,4.0999999999999996,27.7,3.9297906268124838,null,"N","N",{"$f":"_xlfn.IFS($AE98<=$AX$5,\"C\",$AE98<=$AX$7,\"N\",TRUE,\"S\")","v":"C"},{"$f":"_xlfn.IFS($AF98<=$AY$5,\"C\",$AF98<=$AY$7,\"N\",TRUE,\"S\")","v":"C"},"F2",12.186093713737804,50.871590752971848,4.8654751823624673E-3,2.3672848750185083E-5,3.6266480015160682E-3,9.2152716638624038E-2,6624.4285714285706,104.10608011675077,655.40873036101459,0.90139509733237211,4.8654751823624673E-3,2.3672848750185083E-5,5.7895992890143197E-3,0.10322342016895578,6349.4188556070276,104.10608011675077,297.32601839453002]
["W27X307","27X307","27",null,null,null,null,null,null,null,null,null,null,null,null,null,null,null,null,null,null,null,null,307,90.2,29.6,14.4,1.1599999999999999,2.09,2.88,3.46,20.6,23.896000000000001,13100,1030,887,12,1050,227,146,3.41,101,199000,4.04,27.5,3.8704555618498686,null,"N","N",{"$f":"_xlfn.IFS($AE99<=$AX$5,\"C\",$AE99<=$AX$7,\"N\",TRUE,\"S\")","v":"C"},{"$f":"_xlfn.IFS($AF99<=$AY$5,\"C\",$AF99<=$AY$7,\"N\",TRUE,\"S\")","v":"C"},"F2",12.044805670679976,47.940078965221289,4.1406169929281544E-3,1.7144709082125391E-5,3.6266480015160682E-3,8.8132088335884914E-2,6527.4857142857145,102.53420476426132,604.23452995424168,0.92103136629452409,4.1406169929281544E-3,1.7144709082125391E-5,5.1953171471331204E-3,9.6622637823965851E-2,6253.5503435031451,102.53420476426132,292.8367566775961]
["W27X281","27X281","27",null,null,null,null,null,null,null,null,null,null,null,null,null,null,null,null,null,null,null,null,281,83.1,29.3,14.4,1.06,1.93,2.72,3.72,22.5,23.85,11900,936,814,12,953,206,133,3.39,79.5,178000,4,27.4,3.873641826274846,null,"N","N",{"$f":"_xlfn.IFS($AE100<=$AX$5,\"C\",$AE100<=$AX$7,\"N\",TRUE,\"S\")","v":"C"},{"$f":"_xlfn.IFS($AF100<=$AY$5,\"C\",$AF100<=$AY$7,\"N\",TRUE,\"S\")","v":"C"},"F2",11.974161649151059,45.671031786439492,3.5644469951039296E-3,1.2705282380905434E-5,3.6266480015160682E-3,8.4800324271903565E-2,6462.8571428571431,102.61861371399939,570.65226698664026,0.90965025906735764,3.5644469951039296E-3,1.2705282380905434E-5,4.7488834011876384E-3,9.1177466494148471E-2,6258.6984364526434,102.61861371399939,293.07782787069397]
["W27X258","27X258","27",null,null,null,null,null,null,null,null,null,null,null,null,null,null,null,null,null,null,null,null,258,76.099999999999994,29,14.3,0.98,1.77,2.56,4.03,24.4,23.911999999999999,10800,852,745,11.9,859,187,120,3.36,61.6,159000,3.96,27.2,3.842244793693554,null,"N","N",{"$f":"_xlfn.IFS($AE101<=$AX$5,\"C\",$AE101<=$AX$7,\"N\",TRUE,\"S\")","v":"C"},{"$f":"_xlfn.IFS($AF101<=$AY$5,\"C\",$AF101<=$AY$7,\"N\",TRUE,\"S\")","v":"C"},"F2",11.868195616857685,43.533957839822783,3.0398736675878407E-3,9.2408319148939501E-6,3.6266480015160682E-3,8.164877016283778E-2,6398.2285714285717,101.7868589718931,534.34688548817383,0.92583303701947772,3.0398736675878407E-3,9.2408319148939501E-6,4.3689178399306146E-3,8.6074337101824119E-2,6207.9698023820129,101.7868589718931,290.70234388864509]
["W27X235","27X235","27",null,null,null,null,null,null,null,null,null,null,null,null,null,null,null,null,null,null,null,null,235,69.400000000000006,28.7,14.2,0.91,1.61,2.4,4.41,26.2,23.841999999999999,9700,772,677,11.8,769,168,108,3.33,47,141000,3.92,27.1,3.8090085011740049,null,"N","N",{"$f":"_xlfn.IFS($AE102<=$AX$5,\"C\",$AE102<=$AX$7,\"N\",TRUE,\"S\")","v":"C"},{"$f":"_xlfn.IFS($AF102<=$AY$5,\"C\",$AF102<=$AY$7,\"N\",TRUE,\"S\")","v":"C"},"F2",11.762229584564315,41.520173267798732,2.5617686014378607E-3,6.5626583673128933E-6,3.6266480015160682E-3,7.8666489707841472E-2,6333.6,100.90637946028347,500.45239638648866,0.94900796080832817,2.5617686014378607E-3,6.5626583673128933E-6,4.0508356600191678E-3,8.1317920912041458E-2,6154.2694497539997,100.90637946028347,288.18770240784721]
["W27X217","27X217","27",null,null,null,null,null,null,null,null,null,null,null,null,null,null,null,null,null,null,null,null,217,63.9,28.4,14.1,0.83,1.5,2.29,4.71,28.7,23.820999999999998,8910,711,627,11.8,704,154,100,3.32,37.6,128000,3.89,26.9,3.7860516776186035,null,"N","N",{"$f":"_xlfn.IFS($AE103<=$AX$5,\"C\",$AE103<=$AX$7,\"N\",TRUE,\"S\")","v":"C"},{"$f":"_xlfn.IFS($AF103<=$AY$5,\"C\",$AF103<=$AY$7,\"N\",TRUE,\"S\")","v":"C"},"F2",11.726907573799856,40.080343269520803,2.2292974748462915E-3,4.9697672313560516E-6,3.6266480015160682E-3,7.6524149628482377E-2,6285.1285714285714,100.29821858372725,476.92424190339864,0.93481938534278963,2.2292974748462915E-3,4.9697672313560516E-6,3.8492049060196952E-3,7.7964750886961642E-2,6117.1777819809158,100.29821858372725,286.45080047313786]
["W27X194","27X194","27",null,null,null,null,null,null,null,null,null,null,null,null,null,null,null,null,null,null,null,null,194,57.1,28.1,14,0.75,1.34,2.13,5.24,31.8,23.85,7860,631,559,11.7,619,136,88.1,3.29,27.1,111000,3.85,26.8,{"$f":"$AA104/(SQRT(12*(1+$BJ104/6)))","v":3.7541495979130866},null,{"$f":"IF($AE104<=$AV$7,\"N\",\"S\")","v":"N"},{"$f":"IF($AF104<=$AW$7,\"N\",\"S\")","v":"N"},{"$f":"_xlfn.IFS($AE104<=$AX$5,\"C\",$AE104<=$AX$7,\"N\",TRUE,\"S\")","v":"C"},{"$f":"_xlfn.IFS($AF104<=$AY$5,\"C\",$AF104<=$AY$7,\"N\",TRUE,\"S\")","v":"C"},"F2",11.620941541506484,38.217921926185056,1.8089338637759325E-3,3.2722417235153239E-6,{"$f":"SQRT($BD$8+$BC$5)","v":3.6266480015160682E-3},7.3726398700139972E-2,6220.5,99.453084381652118,447.00586872948213,0.95349147121535194,1.8089338637759325E-3,3.2722417235153239E-6,3.6219957068838946E-3,7.3694840868678363E-2,{"$f":"1.95*$AT104*E/$BJ$5","v":6065.6331360567156},99.453084381652118,{"$f":"pi*$AT104*SQRT(E/Fy)","v":284.03710487504947}]
["W27X178","27X178","27",null,null,null,null,null,null,null,null,null,null,null,null,null,null,null,null,null,null,null,null,178,52.5,27.8,14.1,0.72499999999999998,1.19,1.98,5.92,32.9,23.852499999999999,7020,570,505,11.6,555,122,78.8,3.25,20.100000000000001,98400,3.83,26.6,3.7601638451315678,null,"N","N",{"$f":"_xlfn.IFS($AE105<=$AX$5,\"C\",$AE105<=$AX$7,\"N\",TRUE,\"S\")","v":"C"},{"$f":"_xlfn.IFS($AF105<=$AY$5,\"C\",$AF105<=$AY$7,\"N\",TRUE,\"S\")","v":"C"},"F2",11.479653498448656,36.909886050527291,1.4963150450383385E-3,2.238958714008085E-6,3.6266480015160682E-3,7.1574877202510143E-2,6188.1857142857143,99.612410860395585,428.41972502620303,1.0306372549019607,1.4963150450383385E-3,2.238958714008085E-6,3.4764306251064644E-3,7.051769756695693E-2,6075.3504412054326,99.612410860395585,284.49213984991826]
["W27X161","27X161","27",null,null,null,null,null,null,null,null,null,null,null,null,null,null,null,null,null,null,null,null,161,47.6,27.6,14,0.66,1.08,1.87,6.49,36.1,23.826000000000001,6310,515,458,11.5,497,109,70.900000000000006,3.23,15.1,87300,3.79,26.5,3.7310062270323812,null,"N","S",{"$f":"_xlfn.IFS($AE106<=$AX$5,\"C\",$AE106<=$AX$7,\"N\",TRUE,\"S\")","v":"C"},{"$f":"_xlfn.IFS($AF106<=$AY$5,\"C\",$AF106<=$AY$7,\"N\",TRUE,\"S\")","v":"C"},"F2",11.40900947691974,35.614075532773363,1.2441295212985088E-3,1.5478582657664566E-6,3.6266480015160682E-3,6.9790955881221292E-2,6123.5571428571429,98.839981585121521,409.7296376135659,1.0400238095238095,1.2441295212985088E-3,1.5478582657664566E-6,3.3755694990529367E-3,6.7968367792315312E-2,6028.2400611051753,98.839981585121521,282.28608886181991]
["W27X146","27X146","27",null,null,null,null,null,null,null,null,null,null,null,null,null,null,null,null,null,null,null,null,146,43.2,27.4,14,0.60499999999999998,0.97499999999999998,1.76,7.16,39.4,23.837,5660,464,414,11.5,443,97.7,63.5,3.2,11.3,77200,3.76,26.4,3.7266448313966651,null,"N","S",{"$f":"_xlfn.IFS($AE107<=$AX$5,\"C\",$AE107<=$AX$7,\"N\",TRUE,\"S\")","v":"C"},{"$f":"_xlfn.IFS($AF107<=$AY$5,\"C\",$AF107<=$AY$7,\"N\",TRUE,\"S\")","v":"C"},"F2",11.303043444626368,34.561228622444091,1.0338896208461428E-3,1.0689277480933808E-6,3.6266480015160682E-3,6.8268130356427745E-2,6075.0857142857139,98.724441637426921,396.56572280508652,1.0565117216117215,1.0338896208461428E-3,1.0689277480933808E-6,3.3038672681061838E-3,6.5861649606977851E-2,6021.1932918708972,98.724441637426921,281.95610782156723]
["W27X129","27X129","27",null,null,null,null,null,null,null,null,null,null,null,null,null,null,null,null,null,null,null,null,129,37.799999999999997,27.6,10,0.61,1.1000000000000001,1.7,4.55,39.700000000000003,24.217000000000002,4760,395,345,11.2,184,57.6,36.799999999999997,2.21,11.1,32500,2.66,26.5,2.6094557203213729,null,"N","S",{"$f":"_xlfn.IFS($AE108<=$AX$5,\"C\",$AE108<=$AX$7,\"N\",TRUE,\"S\")","v":"C"},{"$f":"_xlfn.IFS($AF108<=$AY$5,\"C\",$AF108<=$AY$7,\"N\",TRUE,\"S\")","v":"C"},"F2",7.8061643789450867,24.918485214039691,1.214109926168991E-3,1.4740629128220727E-6,3.6266480015160682E-3,6.9575555532708888E-2,4297.8,69.128417281924868,285.29033252160343,1.3429427272727272,1.214109926168991E-3,1.4740629128220727E-6,3.3646209429877998E-3,6.7666320050352904E-2,4216.134885262104,69.128417281924868,197.43013131702028]
["W27X114","27X114","27",null,null,null,null,null,null,null,null,null,null,null,null,null,null,null,null,null,null,null,null,114,33.6,27.3,10.1,0.56999999999999995,0.93,1.53,5.41,42.5,24.224999999999998,4080,343,299,11,159,49.3,31.5,2.1800000000000002,7.33,27600,2.65,26.4,2.6130300482036026,null,"N","S",{"$f":"_xlfn.IFS($AE109<=$AX$5,\"C\",$AE109<=$AX$7,\"N\",TRUE,\"S\")","v":"C"},{"$f":"_xlfn.IFS($AF109<=$AY$5,\"C\",$AF109<=$AY$7,\"N\",TRUE,\"S\")","v":"C"},"F2",7.7001983466517139,24.08159367240809,9.2860038512212432E-4,8.6229867524895764E-7,3.6266480015160682E-3,6.7492580233964927E-2,4281.6428571428569,69.223106617873725,273.64515467767853,1.4700574896199294,9.2860038512212432E-4,8.6229867524895764E-7,3.2724470740439784E-3,6.4815487803194877E-2,4221.9099778832497,69.223106617873725,197.70056319967807]
["W27X102","27X102","27",null,null,null,null,null,null,null,null,null,null,null,null,null,null,null,null,null,null,null,null,102,30,27.1,10,0.51500000000000001,0.83,1.43,6.03,47.1,24.256500000000003,3620,305,267,11,139,43.4,27.8,2.15,5.28,24000,2.62,26.3,2.5811162855957246,null,"N","S",{"$f":"_xlfn.IFS($AE110<=$AX$5,\"C\",$AE110<=$AX$7,\"N\",TRUE,\"S\")","v":"C"},{"$f":"_xlfn.IFS($AF110<=$AY$5,\"C\",$AF110<=$AY$7,\"N\",TRUE,\"S\")","v":"C"},"F2",7.594232314358341,23.342655147344445,7.5191182125005339E-4,5.6537138693557223E-7,3.6266480015160682E-3,6.6170687035621151E-2,4233.1714285714288,68.377662918096377,263.05176238470619,1.5050719879518075,7.5191182125005339E-4,5.6537138693557223E-7,3.2267603821953699E-3,6.3076716809338004E-2,4170.3464557268062,68.377662918096377,195.28598367896581]
["W27X94","27X94","27",null,null,null,null,null,null,null,null,null,null,null,null,null,null,null,null,null,null,null,null,94,27.6,26.9,10,0.49,0.745,1.34,6.7,49.5,24.254999999999999,3270,278,243,10.9,124,38.799999999999997,24.8,2.12,4.03,21300,2.59,26.2,2.565740150029133,null,"N","S",{"$f":"_xlfn.IFS($AE111<=$AX$5,\"C\",$AE111<=$AX$7,\"N\",TRUE,\"S\")","v":"C"},{"$f":"_xlfn.IFS($AF111<=$AY$5,\"C\",$AF111<=$AY$7,\"N\",TRUE,\"S\")","v":"C"},"F2",7.4882662820649699,22.759854237022292,6.3299092137090454E-4,4.0067750653798664E-7,3.6266480015160682E-3,6.5265909346970519E-2,4184.7,67.970325898597196,256.69099190194436,1.5952953020134228,6.3299092137090454E-4,4.0067750653798664E-7,3.2011386542460207E-3,6.1920348639336042E-2,4145.5030138327847,67.970325898597196,194.12263285433994]
["W27X84","27X84","27",null,null,null,null,null,null,null,null,null,null,null,null,null,null,null,null,null,null,null,null,84,24.7,26.7,10,0.46,0.64,1.24,7.78,52.7,24.242000000000001,2850,244,213,10.7,106,33.200000000000003,21.2,2.0699999999999998,2.81,17900,2.54,26.1,2.5412499030436249,null,"N","S",{"$f":"_xlfn.IFS($AE112<=$AX$5,\"C\",$AE112<=$AX$7,\"N\",TRUE,\"S\")","v":"C"},{"$f":"_xlfn.IFS($AF112<=$AY$5,\"C\",$AF112<=$AY$7,\"N\",TRUE,\"S\")","v":"C"},"F2",7.3116562282426818,21.983803417919972,5.0545932041803823E-4,2.5548912459746503E-7,3.6266480015160682E-3,6.4281469506647926E-2,4103.9142857142861,67.321542322862427,249.20817667304561,1.74239375,5.0545932041803823E-4,2.5548912459746503E-7,3.178380138021175E-3,6.0694641101494397E-2,4105.9337719176283,67.321542322862427,192.26971286007398]
["W24X370","24X370","24",null,null,null,null,null,null,null,null,null,null,null,null,null,null,null,null,null,null,null,null,370,109,28,13.7,1.52,2.72,3.22,2.5099999999999998,14.2,21.584,13400,1130,957,11.1,1160,267,170,3.27,201,186000,3.92,25.3,3.6931618516485867,null,"N","N",{"$f":"_xlfn.IFS($AE113<=$AX$5,\"C\",$AE113<=$AX$7,\"N\",TRUE,\"S\")","v":"C"},{"$f":"_xlfn.IFS($AF113<=$AY$5,\"C\",$AF113<=$AY$7,\"N\",TRUE,\"S\")","v":"C"},"F2",11.550297519977571,57.64456157308453,8.3016343068135351E-3,6.8917132164063443E-5,3.6266480015160682E-3,0.10921667596264593,6333.6,97.837427009111124,782.04294120640918,0.88041219407471005,8.3016343068135351E-3,6.8917132164063443E-5,8.8748939904222789E-3,0.13105925490874659,5967.0943631636455,97.837427009111124,279.4228021068667]
["W24X335","24X335","24",null,null,null,null,null,null,null,null,null,null,null,null,null,null,null,null,null,null,null,null,335,98.3,27.5,13.5,1.38,2.48,2.98,2.73,15.6,21.527999999999999,11900,1020,864,11,1030,238,152,3.23,152,161000,3.86,25,3.6374123866407131,null,"N","N",{"$f":"_xlfn.IFS($AE114<=$AX$5,\"C\",$AE114<=$AX$7,\"N\",TRUE,\"S\")","v":"C"},{"$f":"_xlfn.IFS($AF114<=$AY$5,\"C\",$AF114<=$AY$7,\"N\",TRUE,\"S\")","v":"C"},"F2",11.40900947691974,53.669095763339016,7.037037037037037E-3,4.9519890260631E-5,3.6266480015160682E-3,0.10326512014496039,6236.6571428571424,96.360539606770459,713.56798189837798,0.88735483870967735,7.037037037037037E-3,4.9519890260631E-5,7.7049660244417071E-3,0.12141665067641565,5877.0191561294951,96.360539606770459,275.2048251120309]
["W24X306","24X306","24",null,null,null,null,null,null,null,null,null,null,null,null,null,null,null,null,null,null,null,null,306,89.7,27.1,13.4,1.26,2.2799999999999998,2.78,2.94,17.100000000000001,21.546000000000003,10700,922,789,10.9,919,214,137,3.2,117,142000,3.81,24.8,3.610146961280309,null,"N","N",{"$f":"_xlfn.IFS($AE115<=$AX$5,\"C\",$AE115<=$AX$7,\"N\",TRUE,\"S\")","v":"C"},{"$f":"_xlfn.IFS($AF115<=$AY$5,\"C\",$AF115<=$AY$7,\"N\",TRUE,\"S\")","v":"C"},"F2",11.303043444626368,50.278294461203537,5.9793940880657421E-3,3.5753153660395546E-5,3.6266480015160682E-3,9.8010418270619626E-2,6155.8714285714286,95.63823737071219,658.17349012589091,0.88858208955223894,5.9793940880657421E-3,3.5753153660395546E-5,6.7527597941556888E-3,0.11283684629686098,5832.9660188686139,95.63823737071219,273.14193649223245]
["W24X279","24X279","24",null,null,null,null,null,null,null,null,null,null,null,null,null,null,null,null,null,null,null,null,279,81.900000000000006,26.7,13.3,1.1599999999999999,2.09,2.59,3.18,18.600000000000001,21.576000000000001,9600,835,718,10.8,823,193,124,3.17,90.5,125000,3.76,24.6,3.5801382933859349,null,"N","N",{"$f":"_xlfn.IFS($AE116<=$AX$5,\"C\",$AE116<=$AX$7,\"N\",TRUE,\"S\")","v":"C"},{"$f":"_xlfn.IFS($AF116<=$AY$5,\"C\",$AF116<=$AY$7,\"N\",TRUE,\"S\")","v":"C"},"F2",11.197077412332996,47.357131464411701,5.1237629367937134E-3,2.6252946632460938E-5,3.6266480015160682E-3,9.3543631201219571E-2,6075.0857142857139,94.843262502918122,610.31214728114219,0.90039068964276714,5.1237629367937134E-3,2.6252946632460938E-5,6.0082907560828789E-3,0.10550854796117987,5784.4805854564174,94.843262502918122,270.87149549685677]
["W24X250","24X250","24",null,null,null,null,null,null,null,null,null,null,null,null,null,null,null,null,null,null,null,null,250,73.5,26.3,13.2,1.04,1.89,2.39,3.49,20.7,21.527999999999999,8490,744,644,10.7,724,171,110,3.14,66.599999999999994,108000,3.71,24.4,3.5539821045993669,null,"N","N",{"$f":"_xlfn.IFS($AE117<=$AX$5,\"C\",$AE117<=$AX$7,\"N\",TRUE,\"S\")","v":"C"},{"$f":"_xlfn.IFS($AF117<=$AY$5,\"C\",$AF117<=$AY$7,\"N\",TRUE,\"S\")","v":"C"},"F2",11.091111380039626,44.300333905994826,4.2383667650952046E-3,1.796375283546359E-5,3.6266480015160682E-3,8.8684918484549971E-2,5994.3,94.150345616510862,560.03335861640119,0.89743145743145747,4.2383667650952046E-3,1.796375283546359E-5,5.2735532625198377E-3,9.7529072730212316E-2,5742.21965757412,94.150345616510862,268.89253116852211]
["W24X229","24X229","24",null,null,null,null,null,null,null,null,null,null,null,null,null,null,null,null,null,null,null,null,229,67.2,26,13.1,0.96,1.73,2.23,3.79,22.5,21.599999999999998,7650,675,588,10.7,651,154,99.4,3.11,51.3,96100,3.67,24.3,3.5225819007070855,null,"N","N",{"$f":"_xlfn.IFS($AE118<=$AX$5,\"C\",$AE118<=$AX$7,\"N\",TRUE,\"S\")","v":"C"},{"$f":"_xlfn.IFS($AF118<=$AY$5,\"C\",$AF118<=$AY$7,\"N\",TRUE,\"S\")","v":"C"},"F2",10.985145347746252,41.978500766577767,3.5903250188964475E-3,1.2890433741313775E-5,3.6266480015160682E-3,8.495276935104891E-2,5929.6714285714279,93.318506861593875,520.34821159951196,0.91497153951374477,3.5903250188964475E-3,1.2890433741313775E-5,4.7683377521400274E-3,9.1425722699011114E-2,5691.4858995710201,93.318506861593875,266.51680724664971]
["W24X207","24X207","24",null,null,null,null,null,null,null,null,null,null,null,null,null,null,null,null,null,null,null,null,207,60.7,25.7,13,0.87,1.57,2.0699999999999998,4.1399999999999997,24.8,21.576000000000001,6820,606,531,10.6,578,137,88.8,3.08,38.299999999999997,84100,3.62,24.1,3.494496865328049,null,"N","N",{"$f":"_xlfn.IFS($AE119<=$AX$5,\"C\",$AE119<=$AX$7,\"N\",TRUE,\"S\")","v":"C"},{"$f":"_xlfn.IFS($AF119<=$AY$5,\"C\",$AF119<=$AY$7,\"N\",TRUE,\"S\")","v":"C"},"F2",10.879179315452879,39.655636764277901,2.9928655711059533E-3,8.9572443267113633E-6,3.6266480015160682E-3,8.1360393144465706E-2,5848.8857142857141,92.574491920110006,483.36779202404381,0.919702106810387,2.9928655711059533E-3,8.9572443267113633E-6,4.3363412577749694E-3,8.5610786872221442E-2,5646.1085066943187,92.574491920110006,264.39190733754396]
["W24X192","24X192","24",null,null,null,null,null,null,null,null,null,null,null,null,null,null,null,null,null,null,null,null,192,56.5,25.5,13,0.81,1.46,1.96,4.43,26.6,21.546000000000003,6260,559,491,10.5,530,126,81.8,3.07,30.8,76300,3.6,24,3.4945459034720407,null,"N","N",{"$f":"_xlfn.IFS($AE120<=$AX$5,\"C\",$AE120<=$AX$7,\"N\",TRUE,\"S\")","v":"C"},{"$f":"_xlfn.IFS($AF120<=$AY$5,\"C\",$AF120<=$AY$7,\"N\",TRUE,\"S\")","v":"C"},"F2",10.843857304688422,38.290469758257629,2.6137135098438561E-3,6.8314983115402893E-6,3.6266480015160682E-3,7.8995958829296609E-2,5816.5714285714284,92.575791014497455,462.07752030414809,0.9195079030558484,2.6137135098438561E-3,6.8314983115402893E-6,4.0838841179336033E-3,8.1838851579048078E-2,5646.1877383241117,92.575791014497455,264.39561753930457]
["W24X176","24X176","24",null,null,null,null,null,null,null,null,null,null,null,null,null,null,null,null,null,null,null,null,176,51.7,25.2,12.9,0.75,1.34,1.84,4.8099999999999996,28.7,21.524999999999999,5680,511,450,10.5,479,115,74.3,3.04,23.9,68400,3.57,23.9,3.4640590215970408,null,"N","N",{"$f":"_xlfn.IFS($AE121<=$AX$5,\"C\",$AE121<=$AX$7,\"N\",TRUE,\"S\")","v":"C"},{"$f":"_xlfn.IFS($AF121<=$AY$5,\"C\",$AF121<=$AY$7,\"N\",TRUE,\"S\")","v":"C"},"F2",10.737891272395052,36.761017836096165,2.2222222222222222E-3,4.9382716049382717E-6,3.6266480015160682E-3,7.6477906768806711E-2,5768.0999999999995,91.768147537174855,435.96215541016687,0.93392051371051699,2.2222222222222222E-3,4.9382716049382717E-6,3.8451115435196815E-3,7.7893091900000364E-2,5596.9296477517901,91.768147537174855,262.0889951102846]
["W24X162","24X162","24",null,null,null,null,null,null,null,null,null,null,null,null,null,null,null,null,null,null,null,null,162,47.8,25,13,0.70499999999999996,1.22,1.72,5.31,30.6,21.573,5170,468,414,10.4,443,105,68.400000000000006,3.05,18.5,62600,3.57,23.8,3.4846283131240785,null,"N","N",{"$f":"_xlfn.IFS($AE122<=$AX$5,\"C\",$AE122<=$AX$7,\"N\",TRUE,\"S\")","v":"C"},{"$f":"_xlfn.IFS($AF122<=$AY$5,\"C\",$AF122<=$AY$7,\"N\",TRUE,\"S\")","v":"C"},"F2",10.773213283159507,35.661454868847692,1.8775626192505987E-3,3.5252413892071684E-6,3.6266480015160682E-3,7.4190367439221291E-2,5768.0999999999995,92.313059089726309,418.84471653919002,0.9589511349306431,1.8775626192505987E-3,3.5252413892071684E-6,3.6567543759975468E-3,7.439299022924234E-2,5630.1637459190461,92.313059089726309,263.64525755063022]
["W24X146","24X146","24",null,null,null,null,null,null,null,null,null,null,null,null,null,null,null,null,null,null,null,null,146,43,24.7,12.9,0.65,1.0900000000000001,1.59,5.92,33.200000000000003,21.580000000000002,4580,418,371,10.3,391,93.2,60.5,3.01,13.4,54600,3.53,23.6,3.4482656456433562,null,"N","N",{"$f":"_xlfn.IFS($AE123<=$AX$5,\"C\",$AE123<=$AX$7,\"N\",TRUE,\"S\")","v":"C"},{"$f":"_xlfn.IFS($AF123<=$AY$5,\"C\",$AF123<=$AY$7,\"N\",TRUE,\"S\")","v":"C"},"F2",10.631925240101678,34.131916768461956,1.530449084014802E-3,2.3422743987617466E-6,3.6266480015160682E-3,7.181293118603968E-2,5703.471428571429,91.34975719059247,394.81258541431259,0.99758196429841406,1.530449084014802E-3,2.3422743987617466E-6,3.4912584516090732E-3,7.0864007335345314E-2,5571.4120646037654,91.34975719059247,260.89407608399398]
["W24X131","24X131","24",null,null,null,null,null,null,null,null,null,null,null,null,null,null,null,null,null,null,null,null,131,38.6,24.5,12.9,0.60499999999999998,0.96,1.46,6.7,35.6,21.538,4020,370,329,10.199999999999999,340,81.5,53,2.97,9.5,47100,3.49,23.5,3.4348856995183605,null,"N","N",{"$f":"_xlfn.IFS($AE124<=$AX$5,\"C\",$AE124<=$AX$7,\"N\",TRUE,\"S\")","v":"C"},{"$f":"_xlfn.IFS($AF124<=$AY$5,\"C\",$AF124<=$AY$7,\"N\",TRUE,\"S\")","v":"C"},"F2",10.490637197043849,32.743168049364961,1.228739571881265E-3,1.5098009355069543E-6,3.6266480015160682E-3,6.9680611172673657E-2,5638.8428571428567,90.995302239801248,376.35080103710254,1.0522036498708009,1.228739571881265E-3,1.5098009355069543E-6,3.3699276123793807E-3,6.7813473471432253E-2,5549.7938945075221,90.995302239801248,259.88175596685198]
["W24X117","24X117","24",null,null,null,null,null,null,null,null,null,null,null,null,null,null,null,null,null,null,null,null,117,34.4,24.3,12.8,0.55000000000000004,0.85,1.35,7.53,39.200000000000003,21.560000000000002,3540,327,291,10.1,297,71.400000000000006,46.5,2.94,6.72,40800,3.46,23.5,3.3991883705481456,null,"N","S",{"$f":"_xlfn.IFS($AE125<=$AX$5,\"C\",$AE125<=$AX$7,\"N\",TRUE,\"S\")","v":"C"},{"$f":"_xlfn.IFS($AF125<=$AY$5,\"C\",$AF125<=$AY$7,\"N\",TRUE,\"S\")","v":"C"},"F2",10.384671164750477,31.628444279796156,9.8267163851721855E-4,9.6564354914611511E-7,3.6266480015160682E-3,6.789197036493555E-2,5590.3714285714286,90.04962616119002,358.92029968649774,1.0898897058823531,9.8267163851721855E-4,9.6564354914611511E-7,3.2881993136542305E-3,6.5351900907100233E-2,5492.1172101285038,90.04962616119002,257.18091368339356]
["W24X104","24X104","24",null,null,null,null,null,null,null,null,null,null,null,null,null,null,null,null,null,null,null,null,104,30.7,24.1,12.8,0.5,0.75,1.25,8.5,43.1,21.55,3100,289,258,10.1,259,62.4,40.700000000000003,2.91,4.72,35200,3.42,23.4,3.391422668262988,null,"N","S",{"$f":"_xlfn.IFS($AE126<=$AX$5,\"C\",$AE126<=$AX$7,\"N\",TRUE,\"S\")","v":"C"},{"$f":"_xlfn.IFS($AF126<=$AY$5,\"C\",$AF126<=$AY$7,\"N\",TRUE,\"S\")","v":"C"},"F2",10.278705132457103,30.574068983123237,7.8181938647054925E-4,6.1124155306118609E-7,3.6266480015160682E-3,6.6396290468569236E-2,5525.7428571428572,89.843900996407584,347.23701794078596,1.1223958333333333,7.8181938647054925E-4,6.1124155306118609E-7,3.233860344886777E-3,6.3369391123454286E-2,5479.5700540077705,89.843900996407584,256.59336448300371]
["W24X103","24X103","24",null,null,null,null,null,null,null,null,null,null,null,null,null,null,null,null,null,null,null,null,103,30.3,24.5,9,0.55000000000000004,0.98,1.48,4.59,39.200000000000003,21.560000000000002,3000,280,245,10,119,41.5,26.5,1.99,7.07,16600,2.4,23.5,2.3482700363009372,null,"N","S",{"$f":"_xlfn.IFS($AE127<=$AX$5,\"C\",$AE127<=$AX$7,\"N\",TRUE,\"S\")","v":"C"},{"$f":"_xlfn.IFS($AF127<=$AY$5,\"C\",$AF127<=$AY$7,\"N\",TRUE,\"S\")","v":"C"},"F2",7.0290801421270226,22.514992258563762,1.2279635258358663E-3,1.5078944207832523E-6,3.6266480015160682E-3,6.9675042356298109E-2,3877.7142857142858,62.209214625055864,257.26374265058416,1.3444444444444446,1.2279635258358663E-3,1.5078944207832523E-6,3.3696447287441581E-3,6.7805665357549769E-2,3794.1334443662281,62.209214625055864,177.66895143084474]
["W24X94","24X94","24",null,null,null,null,null,null,null,null,null,null,null,null,null,null,null,null,null,null,null,null,94,27.7,24.3,9.07,0.51500000000000001,0.875,1.38,5.18,41.9,21.578499999999998,2700,254,222,9.8699999999999992,109,37.5,24,1.98,5.26,15000,2.4,23.4,2.3575905292242685,null,"N","S",{"$f":"_xlfn.IFS($AE128<=$AX$5,\"C\",$AE128<=$AX$7,\"N\",TRUE,\"S\")","v":"C"},{"$f":"_xlfn.IFS($AF128<=$AY$5,\"C\",$AF128<=$AY$7,\"N\",TRUE,\"S\")","v":"C"},"F2",6.993758131362565,22.009798281921217,1.0125510125510127E-3,1.0252595530180811E-6,3.6266480015160682E-3,6.8111665770755309E-2,3877.7142857142858,62.456128538581829,250.07003400702942,1.4002743739171521,1.0125510125510127E-3,1.0252595530180811E-6,3.2972519967676291E-3,6.5649089935189822E-2,3809.1926979323534,62.456128538581829,178.37413532320295]
["W24X84","24X84","24",null,null,null,null,null,null,null,null,null,null,null,null,null,null,null,null,null,null,null,null,84,24.7,24.1,9.02,0.47,0.77,1.27,5.86,45.9,21.572999999999997,2370,224,196,9.7899999999999991,94.4,32.6,20.9,1.95,3.7,12800,2.37,23.3,2.3352114319065502,null,"N","S",{"$f":"_xlfn.IFS($AE129<=$AX$5,\"C\",$AE129<=$AX$7,\"N\",TRUE,\"S\")","v":"C"},{"$f":"_xlfn.IFS($AF129<=$AY$5,\"C\",$AF129<=$AY$7,\"N\",TRUE,\"S\")","v":"C"},"F2",6.8877920990691939,21.255372059430407,8.1019532276429889E-4,6.5641646102914648E-7,3.6266480015160682E-3,6.6609633869886775E-2,3829.2428571428572,61.863272501315372,240.14505789688943,1.4598597632965702,8.1019532276429889E-4,6.5641646102914648E-7,3.240837490248344E-3,6.3647724334909589E-2,3773.0344706947258,61.863272501315372,176.68094387037027]
["W24X76","24X76","24",null,null,null,null,null,null,null,null,null,null,null,null,null,null,null,null,null,null,null,null,76,22.4,23.9,8.99,0.44,0.68,1.18,6.61,49,21.56,2100,200,176,9.69,82.5,28.6,18.399999999999999,1.92,2.68,11100,2.33,23.2,2.3132349960609777,null,"N","S",{"$f":"_xlfn.IFS($AE130<=$AX$5,\"C\",$AE130<=$AX$7,\"N\",TRUE,\"S\")","v":"C"},{"$f":"_xlfn.IFS($AF130<=$AY$5,\"C\",$AF130<=$AY$7,\"N\",TRUE,\"S\")","v":"C"},"F2",6.781826066775821,20.53114038000659,6.5634796238244516E-4,4.3079264772358766E-7,3.6266480015160682E-3,6.5444602251816864E-2,3764.6142857142859,61.281083573689074,232.27419668328474,1.5517895701105802,6.5634796238244516E-4,4.3079264772358766E-7,3.2058390204271997E-3,6.2146496142659928E-2,3737.5268293499512,61.281083573689074,175.01821758569622]
["W24X68","24X68","24",null,null,null,null,null,null,null,null,null,null,null,null,null,null,null,null,null,null,null,null,68,20.100000000000001,23.7,8.9700000000000006,0.41499999999999998,0.58499999999999996,1.0900000000000001,7.66,52,21.58,1830,177,154,9.5500000000000007,70.400000000000006,24.5,15.7,1.87,1.87,9430,2.2999999999999998,23.1,2.2847773169328649,null,"N","S",{"$f":"_xlfn.IFS($AE131<=$AX$5,\"C\",$AE131<=$AX$7,\"N\",TRUE,\"S\")","v":"C"},{"$f":"_xlfn.IFS($AF131<=$AY$5,\"C\",$AF131<=$AY$7,\"N\",TRUE,\"S\")","v":"C"},"F2",6.6052160129535347,19.955204676877567,5.2566481137909706E-4,2.7632349392222167E-7,3.6266480015160682E-3,6.4438442042736924E-2,3716.1428571428569,60.527196737318071,224.770093289404,1.7066765762417935,5.2566481137909706E-4,2.7632349392222167E-7,3.1816559636598453E-3,6.0887771966454333E-2,3691.5473506443859,60.527196737318071,172.86512363453733]
["W24X62","24X62","24",null,null,null,null,null,null,null,null,null,null,null,null,null,null,null,null,null,null,null,null,62,18.2,23.7,7.04,0.43,0.59,1.0900000000000001,5.97,50.1,21.542999999999999,1550,153,131,9.23,34.5,15.7,9.8000000000000007,1.38,1.71,4620,1.75,23.1,1.7352083660358271,null,"N","S",{"$f":"_xlfn.IFS($AE132<=$AX$5,\"C\",$AE132<=$AX$7,\"N\",TRUE,\"S\")","v":"C"},{"$f":"_xlfn.IFS($AF132<=$AY$5,\"C\",$AF132<=$AY$7,\"N\",TRUE,\"S\")","v":"C"},"F2",4.8744374854951209,15.255207168412506,5.6508377119064137E-4,3.1931966846303712E-7,3.6266480015160682E-3,6.4743584799628676E-2,2827.5,45.968286437770516,171.76465373910565,2.2302316063174112,5.6508377119064137E-4,3.1931966846303712E-7,3.1884056902522734E-3,6.1265728278074964E-2,2803.6009456950292,45.968286437770516,131.28500817275952]
["W24X55","24X55","24",null,null,null,null,null,null,null,null,null,null,null,null,null,null,null,null,null,null,null,null,55,16.2,23.6,7.01,0.39500000000000002,0.505,1.01,6.94,54.6,21.567,1350,134,114,9.11,29.1,13.3,8.3000000000000007,1.34,1.18,3870,1.72,23.1,1.7096083007674703,null,"N","S",{"$f":"_xlfn.IFS($AE133<=$AX$5,\"C\",$AE133<=$AX$7,\"N\",TRUE,\"S\")","v":"C"},{"$f":"_xlfn.IFS($AF133<=$AY$5,\"C\",$AF133<=$AY$7,\"N\",TRUE,\"S\")","v":"C"},"F2",4.7331494424372922,14.782966965102512,4.4808992177413227E-4,2.0078457799554798E-7,3.6266480015160682E-3,6.3833673897796303E-2,2779.0285714285715,45.290102102035732,166.14474904732253,2.406453298682222,4.4808992177413227E-4,2.0078457799554798E-7,3.1697627285280495E-3,6.0148588098991831E-2,2762.2385545257271,45.290102102035732,129.34811987521311]
["W21X275","21X275","21",null,null,null,null,null,null,null,null,null,null,null,null,null,null,null,null,null,null,null,null,275,81.8,24.1,12.9,1.22,2.19,3.37,2.95,14.2,17.323999999999998,7690,749,638,9.6999999999999993,787,191,122,3.1,107,94400,3.68,21.9,3.5114230237488657,null,"N","N",{"$f":"_xlfn.IFS($AE134<=$AX$5,\"C\",$AE134<=$AX$7,\"N\",TRUE,\"S\")","v":"C"},{"$f":"_xlfn.IFS($AF134<=$AY$5,\"C\",$AF134<=$AY$7,\"N\",TRUE,\"S\")","v":"C"},"F2",10.949823336981796,52.635211815095516,7.6580638696840874E-3,5.8645942232160823E-5,3.6266480015160682E-3,0.1062295244797799,5945.8285714285712,93.022891382565746,716.16205196674139,0.74812502212311061,7.6580638696840874E-3,5.8645942232160823E-5,8.2760228014023048E-3,0.12623029220867071,5673.4563426570958,93.022891382565746,265.67253212595881]
["W21X248","21X248","21",null,null,null,null,null,null,null,null,null,null,null,null,null,null,null,null,null,null,null,null,248,73.8,23.7,12.8,1.1000000000000001,1.99,3.17,3.22,15.8,17.380000000000003,6830,671,576,9.6199999999999992,699,170,109,3.08,80.7,82400,3.63,21.7,3.4835769219266477,null,"N","N",{"$f":"_xlfn.IFS($AE135<=$AX$5,\"C\",$AE135<=$AX$7,\"N\",TRUE,\"S\")","v":"C"},{"$f":"_xlfn.IFS($AF135<=$AY$5,\"C\",$AF135<=$AY$7,\"N\",TRUE,\"S\")","v":"C"},"F2",10.879179315452879,49.07791970536217,6.4564132104454695E-3,4.1685271544014777E-5,3.6266480015160682E-3,0.10041444722728667,5865.0428571428574,92.285206151331323,657.2298661052647,0.75054962311557805,6.4564132104454695E-3,4.1685271544014777E-5,7.1785710779503197E-3,0.116768935459718,5628.4649981414832,92.285206151331323,263.56570981178271]
["W21X223","21X223","21",null,null,null,null,null,null,null,null,null,null,null,null,null,null,null,null,null,null,null,null,223,66.5,23.4,12.7,1,1.79,2.9699999999999998,3.55,17.5,17.5,6080,601,520,9.56,614,150,96.7,3.04,59.5,71700,3.57,21.6,{"$f":"$AA136/(SQRT(12*(1+$BJ136/6)))","v":3.4514422500796531},null,{"$f":"IF($AE136<=$AV$7,\"N\",\"S\")","v":"N"},{"$f":"IF($AF136<=$AW$7,\"N\",\"S\")","v":"N"},{"$f":"_xlfn.IFS($AE136<=$AX$5,\"C\",$AE136<=$AX$7,\"N\",TRUE,\"S\")","v":"C"},{"$f":"_xlfn.IFS($AF136<=$AY$5,\"C\",$AF136<=$AY$7,\"N\",TRUE,\"S\")","v":"C"},"F2",10.737891272395052,45.407921624734946,5.2973646723646723E-3,2.8062072472017272E-5,{"$f":"SQRT($BD$8+$BC$5)","v":3.6266480015160682E-3},9.4466992509980655E-2,5768.0999999999995,91.433910232662441,596.83011971527469,0.76980600888576078,5.2973646723646723E-3,2.8062072472017272E-5,6.1570028138037518E-3,0.10702507877207297,{"$f":"1.95*$AT136*E/$BJ$5","v":5576.5445497715536},91.433910232662441,{"$f":"pi*$AT136*SQRT(E/Fy)","v":261.13441640711818}]
["W21X201",{"$f":"RIGHT(A137,LEN(A137)-1)","v":"21X201"},{"$f":"LEFT(B137,(FIND(\"X\",B137)-1))","v":"21"},null,null,null,null,null,null,null,null,null,null,null,null,null,null,null,null,null,null,null,null,201,59.3,23,12.6,0.91,1.63,2.13,3.86,20.6,{"$f":"+AF137*AB137","v":18.746000000000002},5310,530,461,9.4700000000000006,542,133,86.1,3.02,40.9,62000,3.55,21.4,3.4089931198737893,null,"N","N",{"$f":"_xlfn.IFS($AE137<=$AX$5,\"C\",$AE137<=$AX$7,\"N\",TRUE,\"S\")","v":"C"},{"$f":"_xlfn.IFS($AF137<=$AY$5,\"C\",$AF137<=$AY$7,\"N\",TRUE,\"S\")","v":"C"},{"$f":"IF(AND(AX137=\"C\", AY137= \"C\"),\"F2\",\"F3\")","v":"F2"},{"$f":"1.76*AO137*sqrtefy/12","v":10.667247250866135},{"$f":"+$BG137*$BF137/12","v":42.139623828594019},{"$f":"+($AP137*$BD$5)/($AJ137*$AS137)","v":4.1458025016725122E-3},{"$f":"+$BC137^2","v":1.7187678382874062E-5},3.6266480015160682E-3,{"$f":"SQRT(($BC137+$BE137))","v":8.8161502387315183E-2},{"$f":"1.95*AR137*E/(0.7*Fy)","v":5735.7857142857138},{"$f":"1.1*AT137*SQRT(E/Fy)","v":90.309368757107407},{"$f":"$BO137*$BN137","v":532.45907138626399},{"$f":"(AG137*AB137)/(AA137*AC137)","v":0.83059986366734861},{"$f":"+($AP137)/($AJ137*$AS137)","v":4.1458025016725122E-3},{"$f":"+$BC137^2","v":1.7187678382874062E-5},{"$f":"SQRT($BL137+$BK$5)","v":5.1994508902425554E-3},{"$f":"+SQRT($BK137+$BM137)","v":9.6670850787168874E-2},5507.9588836817948,{"$f":"+$BH137","v":90.309368757107407},257.92273617603729]
["W21X182","21X182","21",null,null,null,null,null,null,null,null,null,null,null,null,null,null,null,null,null,null,null,null,182,53.6,22.7,12.5,0.83,1.48,1.98,4.22,22.6,18.757999999999999,4730,476,417,9.4,483,119,77.2,3,30.7,54400,3.51,21.2,3.3792238738605649,null,"N","N",{"$f":"_xlfn.IFS($AE138<=$AX$5,\"C\",$AE138<=$AX$7,\"N\",TRUE,\"S\")","v":"C"},{"$f":"_xlfn.IFS($AF138<=$AY$5,\"C\",$AF138<=$AY$7,\"N\",TRUE,\"S\")","v":"C"},"F2",10.596603229337221,39.819836316481016,3.4726935432785847E-3,1.2059600445528772E-5,3.6266480015160682E-3,8.4257590428368251E-2,5671.1571428571424,89.520736536010745,492.99547627876348,0.84157513513513504,3.4726935432785847E-3,1.2059600445528772E-5,4.6804072069317653E-3,9.0294522260269752E-2,5459.8602876232844,89.520736536010745,255.67040972196904]
["W21X166","21X166","21",null,null,null,null,null,null,null,null,null,null,null,null,null,null,null,null,null,null,null,null,166,48.8,22.5,12.4,0.75,1.36,1.86,4.57,25,18.75,4280,432,380,9.36,435,108,70,2.99,23.6,48500,3.48,21.1,3.3540776419183365,null,"N","N",{"$f":"_xlfn.IFS($AE139<=$AX$5,\"C\",$AE139<=$AX$7,\"N\",TRUE,\"S\")","v":"C"},{"$f":"_xlfn.IFS($AF139<=$AY$5,\"C\",$AF139<=$AY$7,\"N\",TRUE,\"S\")","v":"C"},"F2",10.561281218572764,37.979224024547321,2.9433774008480918E-3,8.6634705238232678E-6,3.6266480015160682E-3,8.1055693213766045E-2,5622.6857142857143,88.854574929499037,461.29442501582014,0.83387689753320682,2.9433774008480918E-3,8.6634705238232678E-6,4.3023344478310037E-3,8.512174721350059E-2,5419.2311614423406,88.854574929499037,253.76785822978621]
["W21X147","21X147","21",null,null,null,null,null,null,null,null,null,null,null,null,null,null,null,null,null,null,null,null,147,43.2,22.1,12.5,0.72,1.1499999999999999,1.65,5.44,26.1,18.792000000000002,3630,373,329,9.17,376,92.6,60.1,2.95,15.4,41100,3.46,21,3.3548775215376043,null,"N","N",{"$f":"_xlfn.IFS($AE140<=$AX$5,\"C\",$AE140<=$AX$7,\"N\",TRUE,\"S\")","v":"C"},{"$f":"_xlfn.IFS($AF140<=$AY$5,\"C\",$AF140<=$AY$7,\"N\",TRUE,\"S\")","v":"C"},"F2",10.419993175514934,35.648891876506262,2.2289766970618034E-3,4.9683371160445462E-6,3.6266480015160682E-3,7.6522053674596788E-2,5590.3714285714286,88.87576494689057,422.59215795967935,0.94123408695652189,2.2289766970618034E-3,4.9683371160445462E-6,3.8490191339112076E-3,7.7961502236507801E-2,5420.5235383700438,88.87576494689057,253.82837672681993]
["W21X132","21X132","21",null,null,null,null,null,null,null,null,null,null,null,null,null,null,null,null,null,null,null,null,132,38.799999999999997,21.8,12.4,0.65,1.04,1.54,6.01,28.9,18.785,3220,333,295,9.1199999999999992,333,82.3,53.5,2.93,11.3,36000,3.43,20.8,3.3266990997164769,null,"N","N",{"$f":"_xlfn.IFS($AE141<=$AX$5,\"C\",$AE141<=$AX$7,\"N\",TRUE,\"S\")","v":"C"},{"$f":"_xlfn.IFS($AF141<=$AY$5,\"C\",$AF141<=$AY$7,\"N\",TRUE,\"S\")","v":"C"},"F2",10.349349153986021,34.15082248014032,1.8415906127770536E-3,3.3914559850685639E-6,3.6266480015160682E-3,7.3947539609463153E-2,5541.9,88.129276057722109,397.89511381995624,0.94682459677419351,1.8415906127770536E-3,3.3914559850685639E-6,3.6384154741093823E-3,7.4027063205873808E-2,5374.9952596847652,88.129276057722109,251.69641124561744]
["W21X122","21X122","21",null,null,null,null,null,null,null,null,null,null,null,null,null,null,null,null,null,null,null,null,122,35.9,21.7,12.4,0.6,0.96,1.46,6.45,31.3,18.78,2960,307,273,9.09,305,75.599999999999994,49.2,2.92,8.98,32700,3.4,20.7,3.3267594441680766,null,"N","N",{"$f":"_xlfn.IFS($AE142<=$AX$5,\"C\",$AE142<=$AX$7,\"N\",TRUE,\"S\")","v":"C"},{"$f":"_xlfn.IFS($AF142<=$AY$5,\"C\",$AF142<=$AY$7,\"N\",TRUE,\"S\")","v":"C"},"F2",10.31402714322156,33.061254987303435,1.5890711542885458E-3,2.525147133391931E-6,3.6266480015160682E-3,7.2219935999726648E-2,5493.4285714285716,88.13087467324884,384.10001374129649,0.94657258064516137,1.5890711542885458E-3,2.525147133391931E-6,3.5173510360158775E-3,7.1459234464864116E-2,5375.0927590772772,88.13087467324884,251.70097687702892]
["W21X111","21X111","21",null,null,null,null,null,null,null,null,null,null,null,null,null,null,null,null,null,null,null,null,111,32.6,21.5,12.3,0.55000000000000004,0.875,1.38,7.05,34.1,18.755000000000003,2670,279,249,9.0500000000000007,274,68.2,44.5,2.9,6.83,29200,3.37,20.6,3.2971147001516723,null,"N","N",{"$f":"_xlfn.IFS($AE143<=$AX$5,\"C\",$AE143<=$AX$7,\"N\",TRUE,\"S\")","v":"C"},{"$f":"_xlfn.IFS($AF143<=$AY$5,\"C\",$AF143<=$AY$7,\"N\",TRUE,\"S\")","v":"C"},"F2",10.243383121692647,31.950282601818845,1.3315397512379615E-3,1.7729981091268523E-6,3.6266480015160682E-3,7.0414400180318443E-2,5444.9571428571426,87.345540697806086,366.77631671037449,0.9584436701509873,1.3315397512379615E-3,1.7729981091268523E-6,3.408754799966828E-3,6.8849797030962917E-2,5327.1953226736305,87.345540697806086,249.45807018256417]
["W21X101","21X101","21",null,null,null,null,null,null,null,null,null,null,null,null,null,null,null,null,null,null,null,null,101,29.8,21.4,12.3,0.5,0.8,1.3,7.68,37.5,18.75,2420,253,227,9.02,248,61.7,40.299999999999997,2.89,5.21,26200,3.35,20.6,3.2984658888501359,null,"N","S",{"$f":"_xlfn.IFS($AE144<=$AX$5,\"C\",$AE144<=$AX$7,\"N\",TRUE,\"S\")","v":"C"},{"$f":"_xlfn.IFS($AF144<=$AY$5,\"C\",$AF144<=$AY$7,\"N\",TRUE,\"S\")","v":"C"},"F2",10.20806111092819,31.056604162820623,1.1141525170009835E-3,1.2413358311396268E-6,3.6266480015160682E-3,6.8853471361413954E-2,5412.6428571428569,87.381335724120049,355.27450875383516,0.95274390243902418,1.1141525170009835E-3,1.2413358311396268E-6,3.3298569050801063E-3,6.6663403919100084E-2,5329.3784575564341,87.381335724120049,249.5603004523075]
["W21X93","21X93","21",null,null,null,null,null,null,null,null,null,null,null,null,null,null,null,null,null,null,null,null,93,27.3,21.6,8.42,0.57999999999999996,0.93,1.43,4.53,32.299999999999997,18.733999999999998,2070,221,192,8.6999999999999993,92.9,34.700000000000003,22.1,1.84,6.03,9940,2.2400000000000002,20.7,2.1905112326842104,null,"N","N",{"$f":"_xlfn.IFS($AE145<=$AX$5,\"C\",$AE145<=$AX$7,\"N\",TRUE,\"S\")","v":"C"},{"$f":"_xlfn.IFS($AF145<=$AY$5,\"C\",$AF145<=$AY$7,\"N\",TRUE,\"S\")","v":"C"},"F2",6.4992499806601609,21.63096172798069,1.5172101449275365E-3,2.3019266238710362E-6,3.6266480015160682E-3,7.172069538455135E-2,3619.2000000000003,58.029946005402401,250.3292775763646,1.3875973744029828,1.5172101449275365E-3,2.3019266238710362E-6,3.4854752618604357E-3,7.0729664263221068E-2,3539.2402916654883,58.029946005402401,165.73299824646557]
["W21X83","21X83","21",null,null,null,null,null,null,null,null,null,null,null,null,null,null,null,null,null,null,null,null,83,24.4,21.4,8.36,0.51500000000000001,0.83499999999999996,1.34,5,36.4,18.745999999999999,1830,196,171,8.67,81.400000000000006,30.5,19.5,1.83,4.34,8630,2.21,20.6,2.1755785100486817,null,"N","S",{"$f":"_xlfn.IFS($AE146<=$AX$5,\"C\",$AE146<=$AX$7,\"N\",TRUE,\"S\")","v":"C"},{"$f":"_xlfn.IFS($AF146<=$AY$5,\"C\",$AF146<=$AY$7,\"N\",TRUE,\"S\")","v":"C"},"F2",6.4639279698957042,20.741267861503996,1.2320445125759381E-3,1.5179336809684811E-6,3.6266480015160682E-3,6.9704322061777541E-2,3570.7285714285713,57.634355663146309,238.48893638886321,1.383002893734063,1.2320445125759381E-3,1.5179336809684811E-6,3.3711340611341043E-3,6.784672854095504E-2,3515.1132783786561,57.634355663146309,164.60319582525798]
["W21X73","21X73","21",null,null,null,null,null,null,null,null,null,null,null,null,null,null,null,null,null,null,null,null,73,21.5,21.2,8.3000000000000007,0.45500000000000002,0.74,1.24,5.6,41.2,18.746000000000002,1600,172,151,8.64,70.599999999999994,26.6,17,1.81,3.02,7410,2.19,20.5,2.1591305991223249,null,"N","S",{"$f":"_xlfn.IFS($AE147<=$AX$5,\"C\",$AE147<=$AX$7,\"N\",TRUE,\"S\")","v":"C"},{"$f":"_xlfn.IFS($AF147<=$AY$5,\"C\",$AF147<=$AY$7,\"N\",TRUE,\"S\")","v":"C"},"F2",6.3932839483667898,20.003818385023013,9.7560975609756097E-4,9.5181439619274241E-7,3.6266480015160682E-3,6.7839942199368286E-2,3538.4142857142856,57.198625698051089,227.73784002577474,1.3887056333441876,9.7560975609756097E-4,9.5181439619274241E-7,3.2860957949157202E-3,6.5281739797689836E-2,3488.5381537247854,57.198625698051089,163.35875500612755]
["W21X68","21X68","21",null,null,null,null,null,null,null,null,null,null,null,null,null,null,null,null,null,null,null,null,68,20,21.1,8.27,0.43,0.68500000000000005,1.19,6.04,43.6,18.748000000000001,1480,160,140,8.6,64.7,24.4,15.7,1.8,2.4500000000000002,6760,2.17,20.399999999999999,2.1463405593143254,null,"N","S",{"$f":"_xlfn.IFS($AE148<=$AX$5,\"C\",$AE148<=$AX$7,\"N\",TRUE,\"S\")","v":"C"},{"$f":"_xlfn.IFS($AF148<=$AY$5,\"C\",$AF148<=$AY$7,\"N\",TRUE,\"S\")","v":"C"},"F2",6.3579619376023322,19.5658913619618,8.5784313725490206E-4,7.3589484813533275E-7,3.6266480015160682E-3,6.6966343328353911E-2,3506.0999999999995,56.85979825521909,222.34772248341739,1.4230734604895012,8.5784313725490206E-4,7.3589484813533275E-7,3.2530763940161887E-3,6.4116452890588788E-2,3467.8731036921458,56.85979825521909,162.39106690964886]
["W21X62","21X62","21",null,null,null,null,null,null,null,null,null,null,null,null,null,null,null,null,null,null,null,null,62,18.3,21,8.24,0.4,0.61499999999999999,1.1200000000000001,6.7,46.9,18.760000000000002,1330,144,127,8.5399999999999991,57.5,21.7,14,1.77,1.83,5960,2.15,20.399999999999999,2.1302902348482688,null,"N","S",{"$f":"_xlfn.IFS($AE149<=$AX$5,\"C\",$AE149<=$AX$7,\"N\",TRUE,\"S\")","v":"C"},{"$f":"_xlfn.IFS($AF149<=$AY$5,\"C\",$AF149<=$AY$7,\"N\",TRUE,\"S\")","v":"C"},"F2",6.2519959053089602,19.055300377497407,7.063455303381196E-4,4.9892400822863945E-7,3.6266480015160682E-3,6.5825477832327103E-2,3473.7857142857142,56.434600955046783,215.57631538867128,1.4807798563422532,7.063455303381196E-4,4.9892400822863945E-7,3.2164476033970579E-3,6.2632205244068942E-2,3441.9403651619887,56.434600955046783,161.17670728578673]
["W21X55","21X55","21",null,null,null,null,null,null,null,null,null,null,null,null,null,null,null,null,null,null,null,null,55,16.2,20.8,8.2200000000000006,0.375,0.52200000000000002,1.02,7.87,50,18.75,1140,126,110,8.4,48.4,18.399999999999999,11.8,1.73,1.24,4980,2.11,20.3,2.1030426639524928,null,"N","S",{"$f":"_xlfn.IFS($AE150<=$AX$5,\"C\",$AE150<=$AX$7,\"N\",TRUE,\"S\")","v":"C"},{"$f":"_xlfn.IFS($AF150<=$AY$5,\"C\",$AF150<=$AY$7,\"N\",TRUE,\"S\")","v":"C"},"F2",6.1107078622511297,18.371957814695708,5.553067622033139E-4,3.0836560014872779E-7,3.6266480015160682E-3,6.4668035100189813E-2,3409.1571428571424,55.712771710682347,207.85678360301227,1.6386651564728585,5.553067622033139E-4,3.0836560014872779E-7,3.1866874301253278E-3,6.1171841498590201E-2,3397.9160756146707,55.712771710682347,159.11516952596594]
["W21X48","21X48","21",null,null,null,null,null,null,null,null,null,null,null,null,null,null,null,null,null,null,null,null,48,14.1,20.6,8.14,0.35,0.43,0.93,9.4700000000000006,53.6,18.759999999999998,959,107,93,8.24,38.700000000000003,14.9,9.52,1.66,0.80300000000000005,3950,2.0499999999999998,20.2,2.0509709486075787,null,"N","S",{"$f":"_xlfn.IFS($AE151<=$AX$5,\"C\",$AE151<=$AX$7,\"N\",TRUE,\"S\")","v":"N"},{"$f":"_xlfn.IFS($AF151<=$AY$5,\"C\",$AF151<=$AY$7,\"N\",TRUE,\"S\")","v":"C"},"F3",5.8634537868999281,17.574544815759566,4.2744597040349203E-4,1.8271005761418298E-7,3.6266480015160682E-3,6.3671767463449297E-2,3312.2142857142853,54.333313443229734,198.67107343559383,1.8758928061253639,4.2744597040349203E-4,1.8271005761418298E-7,3.1669103610276407E-3,5.9952950981841863E-2,3313.7830612502453,54.333313443229734,155.17544925465097]
["W21X57","21X57","21",null,null,null,null,null,null,null,null,null,null,null,null,null,null,null,null,null,null,null,null,57,16.7,21.1,6.56,0.40500000000000003,0.65,1.1499999999999999,5.04,46.3,18.7515,1170,129,111,8.36,30.6,14.8,9.35,1.35,1.77,3190,1.68,20.5,1.6629147991837616,null,"N","S",{"$f":"_xlfn.IFS($AE152<=$AX$5,\"C\",$AE152<=$AX$7,\"N\",TRUE,\"S\")","v":"C"},{"$f":"_xlfn.IFS($AF152<=$AY$5,\"C\",$AF152<=$AY$7,\"N\",TRUE,\"S\")","v":"C"},"F2",4.7684714532017498,15.012079636218926,7.7785102175346077E-4,6.0505221204290287E-7,3.6266480015160682E-3,6.6366399806449719E-2,2714.4,44.053120827858265,170.15612641320982,1.7810406894934334,7.7785102175346077E-4,6.0505221204290287E-7,3.2329032446414075E-3,6.3330516075545032E-2,2686.7951969669061,44.053120827858265,125.81531260144658]
["W21X50","21X50","21",null,null,null,null,null,null,null,null,null,null,null,null,null,null,null,null,null,null,null,null,50,14.7,20.8,6.53,0.38,0.53500000000000003,1.04,6.1,49.4,18.771999999999998,984,110,94.5,8.18,24.9,12.2,7.64,1.3,1.1399999999999999,2570,1.64,20.3,1.6282450807684372,null,"N","S",{"$f":"_xlfn.IFS($AE153<=$AX$5,\"C\",$AE153<=$AX$7,\"N\",TRUE,\"S\")","v":"C"},{"$f":"_xlfn.IFS($AF153<=$AY$5,\"C\",$AF153<=$AY$7,\"N\",TRUE,\"S\")","v":"C"},"F2",4.5918613993794626,14.345977513276226,5.9426069278286015E-4,3.5314577098676492E-7,3.6266480015160682E-3,6.4968520795066043E-2,2649.7714285714287,43.134667702558161,161.91511995422422,2.0418657239770432,5.9426069278286015E-4,3.5314577098676492E-7,3.1937058330655317E-3,6.1546458272173483E-2,2630.7788376415747,43.134667702558161,123.19221882516337]
["W21X44","21X44","21",null,null,null,null,null,null,null,null,null,null,null,null,null,null,null,null,null,null,null,null,44,13,20.7,6.5,0.35,0.45,0.95,7.22,53.6,18.759999999999998,843,95.4,81.599999999999994,8.06,20.7,10.199999999999999,6.37,1.26,0.77,2110,1.6,20.3,1.6006952508572958,null,"N","S",{"$f":"_xlfn.IFS($AE154<=$AX$5,\"C\",$AE154<=$AX$7,\"N\",TRUE,\"S\")","v":"C"},{"$f":"_xlfn.IFS($AF154<=$AY$5,\"C\",$AF154<=$AY$7,\"N\",TRUE,\"S\")","v":"C"},"F2",4.450573356321633,13.779834491684142,4.6484110885733603E-4,2.1607725648371774E-7,3.6266480015160682E-3,6.3964748966703566E-2,2585.1428571428573,42.404831161047937,155.97169042973923,2.244786324786324,4.6484110885733603E-4,2.1607725648371774E-7,3.1721740862780145E-3,6.0307671113510514E-2,2586.266183885145,42.404831161047937,121.1078122974878]
["W18X311","18X311","18",null,null,null,null,null,null,null,null,null,null,null,null,null,null,null,null,null,null,null,null,311,91.6,22.3,12,1.52,2.74,3.24,2.19,10.4,15.808000000000002,6970,754,624,8.7200000000000006,795,207,132,2.95,176,76200,3.53,19.600000000000001,3.2706452346265178,null,"N","N",{"$f":"_xlfn.IFS($AE155<=$AX$5,\"C\",$AE155<=$AX$7,\"N\",TRUE,\"S\")","v":"C"},{"$f":"_xlfn.IFS($AF155<=$AY$5,\"C\",$AF155<=$AY$7,\"N\",TRUE,\"S\")","v":"C"},"F2",10.419993175514934,63.796888665124278,1.4390371533228674E-2,2.0708279286435816E-4,3.6266480015160682E-3,0.13422749172485027,5703.471428571429,86.644324638149371,901.74854284631556,0.73078345498783459,1.4390371533228674E-2,2.0708279286435816E-4,1.4728523484773624E-2,0.17064259438370685,5284.4282290894162,86.644324638149371,247.45540349087605]
["W18X283","18X283","18",null,null,null,null,null,null,null,null,null,null,null,null,null,null,null,null,null,null,null,null,283,83.3,21.9,11.9,1.4,2.5,3,2.38,11.3,15.82,6170,676,565,8.61,704,185,118,2.91,134,65900,3.47,19.399999999999999,3.2400971415165718,null,"N","N",{"$f":"_xlfn.IFS($AE156<=$AX$5,\"C\",$AE156<=$AX$7,\"N\",TRUE,\"S\")","v":"C"},{"$f":"_xlfn.IFS($AF156<=$AY$5,\"C\",$AF156<=$AY$7,\"N\",TRUE,\"S\")","v":"C"},"F2",10.278705132457103,58.823684270051693,1.2225161937779399E-2,1.4945458440493017E-4,3.6266480015160682E-3,0.12590397110216767,5606.5285714285719,85.835059582902019,825.19436214036182,0.74447058823529411,1.2225161937779399E-2,1.4945458440493017E-4,1.2621457743941474E-2,0.15762810562117682,5235.0712386503465,85.835059582902019,245.14414985004461]
["W18X258","18X258","18",null,null,null,null,null,null,null,null,null,null,null,null,null,null,null,null,null,null,null,null,258,76,21.5,11.8,1.28,2.2999999999999998,2.7,2.56,12.5,16,5510,611,514,8.5299999999999994,628,166,107,2.88,103,57600,3.42,19.2,3.2104581042840072,null,"N","N",{"$f":"_xlfn.IFS($AE157<=$AX$5,\"C\",$AE157<=$AX$7,\"N\",TRUE,\"S\")","v":"C"},{"$f":"_xlfn.IFS($AF157<=$AY$5,\"C\",$AF157<=$AY$7,\"N\",TRUE,\"S\")","v":"C"},"F2",10.17273910016373,54.608139140481001,1.0436932555123218E-2,1.0892956116019085E-4,3.6266480015160682E-3,0.11858996819562473,5525.7428571428572,85.04987678876941,757.67292846823125,0.75460574797347091,1.0436932555123218E-2,1.0892956116019085E-4,1.0898448161888044E-2,0.14606635723879494,5187.1830227788741,85.04987678876941,242.90167492802735]
["W18X234","18X234","18",null,null,null,null,null,null,null,null,null,null,null,null,null,null,null,null,null,null,null,null,234,68.599999999999994,21.1,11.7,1.1599999999999999,2.11,2.5099999999999998,2.76,13.8,16.007999999999999,4900,549,466,8.44,558,149,95.8,2.85,78.7,50100,3.37,19,3.1838205508759172,null,"N","N",{"$f":"_xlfn.IFS($AE158<=$AX$5,\"C\",$AE158<=$AX$7,\"N\",TRUE,\"S\")","v":"C"},{"$f":"_xlfn.IFS($AF158<=$AY$5,\"C\",$AF158<=$AY$7,\"N\",TRUE,\"S\")","v":"C"},"F2",10.06677306787036,50.761401863850779,8.8886379037723066E-3,7.900788378437775E-5,3.6266480015160682E-3,0.11187173863531565,5444.9571428571426,84.34420782760489,696.17026786608471,0.75218860128812737,8.8886379037723066E-3,7.900788378437775E-5,9.4262662259002525E-3,0.13533256862142445,5144.144347200946,84.34420782760489,240.88629079011383]
["W18X211","18X211","18",null,null,null,null,null,null,null,null,null,null,null,null,null,null,null,null,null,null,null,null,211,62.3,20.7,11.6,1.06,1.91,2.31,3.02,15.1,16.006,4330,490,419,8.35,493,132,85.3,2.82,58.6,43400,3.32,18.8,3.1534390005135933,null,"N","N",{"$f":"_xlfn.IFS($AE159<=$AX$5,\"C\",$AE159<=$AX$7,\"N\",TRUE,\"S\")","v":"C"},{"$f":"_xlfn.IFS($AF159<=$AY$5,\"C\",$AF159<=$AY$7,\"N\",TRUE,\"S\")","v":"C"},"F2",9.9608070355769858,47.023352410939992,7.4391915909206314E-3,5.5341571526424234E-5,3.6266480015160682E-3,0.10519429448613979,5364.1714285714279,83.539354740900706,634.59764546354177,0.7657681892038275,7.4391915909206314E-3,5.5341571526424234E-5,8.0739199094116768E-3,0.12455164190139088,5095.0564422583911,83.539354740900706,238.58763769133293]
["W18X192","18X192","18",null,null,null,null,null,null,null,null,null,null,null,null,null,null,null,null,null,null,null,null,192,56.2,20.399999999999999,11.5,0.96,1.75,2.15,3.27,16.7,16.032,3870,442,380,8.2799999999999994,440,119,76.8,2.79,44.7,38000,3.28,18.7,3.1264879954408222,null,"N","N",{"$f":"_xlfn.IFS($AE160<=$AX$5,\"C\",$AE160<=$AX$7,\"N\",TRUE,\"S\")","v":"C"},{"$f":"_xlfn.IFS($AF160<=$AY$5,\"C\",$AF160<=$AY$7,\"N\",TRUE,\"S\")","v":"C"},"F2",9.8548410032836156,43.979436146407863,6.2904587672389534E-3,3.9569871502333414E-5,3.6266480015160682E-3,9.9584671354355642E-2,5299.5428571428574,82.825381972430677,583.00972595621045,0.76475627329192541,6.2904587672389534E-3,3.9569871502333414E-5,7.0296858165570563E-3,0.11541293074779797,5051.5113183479571,82.825381972430677,236.54853795524406]
["W18X175","18X175","18",null,null,null,null,null,null,null,null,null,null,null,null,null,null,null,null,null,null,null,null,175,51.4,20,11.4,0.89,1.59,1.99,3.58,18,16.02,3450,398,344,8.1999999999999993,391,106,68.8,2.76,33.799999999999997,33300,3.24,18.399999999999999,3.0943107357674928,null,"N","N",{"$f":"_xlfn.IFS($AE161<=$AX$5,\"C\",$AE161<=$AX$7,\"N\",TRUE,\"S\")","v":"C"},{"$f":"_xlfn.IFS($AF161<=$AY$5,\"C\",$AF161<=$AY$7,\"N\",TRUE,\"S\")","v":"C"},"F2",9.7488749709902418,41.308853808320777,5.3399898887765418E-3,2.8515492012235702E-5,3.6266480015160682E-3,9.4692332795705325E-2,5234.914285714287,81.972957838016626,536.92410639244224,0.78659384309831171,5.3399898887765418E-3,2.8515492012235702E-5,6.1937148133737749E-3,0.10739508695536457,4999.5220602186209,81.972957838016626,234.1140223766678]
["W18X158","18X158","18",null,null,null,null,null,null,null,null,null,null,null,null,null,null,null,null,null,null,null,null,158,46.3,19.7,11.3,0.81,1.44,1.84,3.92,19.8,16.038,3060,356,310,8.1199999999999992,347,94.8,61.4,2.74,25.2,29000,3.2,18.3,3.0645141380503893,null,"N","N",{"$f":"_xlfn.IFS($AE162<=$AX$5,\"C\",$AE162<=$AX$7,\"N\",TRUE,\"S\")","v":"C"},{"$f":"_xlfn.IFS($AF162<=$AY$5,\"C\",$AF162<=$AY$7,\"N\",TRUE,\"S\")","v":"C"},"F2",9.6782309494613283,38.702250113111361,4.4420941300898995E-3,1.973220026057914E-5,3.6266480015160682E-3,8.9826177318229283E-2,5170.2857142857147,81.183601029035813,492.1764323471092,0.79835176991150436,4.4420941300898995E-3,1.973220026057914E-5,5.4386405872928556E-3,9.9401884878420471E-2,4951.3792716214139,81.183601029035813,231.85962650618964]
["W18X143","18X143","18",null,null,null,null,null,null,null,null,null,null,null,null,null,null,null,null,null,null,null,null,143,42,19.5,11.2,0.73,1.32,1.72,4.25,22,16.059999999999999,2750,322,282,8.09,311,85.4,55.5,2.72,19.2,25700,3.17,18.2,3.0385894614335531,null,"N","N",{"$f":"_xlfn.IFS($AE163<=$AX$5,\"C\",$AE163<=$AX$7,\"N\",TRUE,\"S\")","v":"C"},{"$f":"_xlfn.IFS($AF163<=$AY$5,\"C\",$AF163<=$AY$7,\"N\",TRUE,\"S\")","v":"C"},"F2",9.6075869279324149,36.635763301129828,3.7409399111526772E-3,1.3994631418855E-5,3.6266480015160682E-3,8.5834654497287666E-2,5121.8142857142857,80.496817249142097,455.91422756559865,0.79300595238095239,3.7409399111526772E-3,1.3994631418855E-5,4.8827494914264278E-3,9.2863821817643855E-2,4909.4924012590691,80.496817249142097,229.89817827430207]
["W18X130","18X130","18",null,null,null,null,null,null,null,null,null,null,null,null,null,null,null,null,null,null,null,null,130,38.299999999999997,19.3,11.2,0.67,1.2,1.6,4.6500000000000004,23.9,16.013000000000002,2460,290,256,8.0299999999999994,278,76.7,49.9,2.7,14.5,22700,3.13,18.100000000000001,3.0374134557388976,null,"N","N",{"$f":"_xlfn.IFS($AE164<=$AX$5,\"C\",$AE164<=$AX$7,\"N\",TRUE,\"S\")","v":"C"},{"$f":"_xlfn.IFS($AF164<=$AY$5,\"C\",$AF164<=$AY$7,\"N\",TRUE,\"S\")","v":"C"},"F2",9.5369429064034996,34.639477251462921,3.1293162983425413E-3,9.792620495072265E-6,3.6266480015160682E-3,8.2194673184207076E-2,5057.1857142857134,80.46566308478782,426.73296053948343,0.79826711309523823,3.1293162983425413E-3,9.792620495072265E-6,4.4316172750184894E-3,8.6953628868271113E-2,4907.5923120581328,80.46566308478782,229.80920226412596]
["W18X119","18X119","18",null,null,null,null,null,null,null,null,null,null,null,null,null,null,null,null,null,null,null,null,119,35.1,19,11.3,0.65500000000000003,1.06,1.46,5.31,24.5,16.047499999999999,2190,262,231,7.9,253,69.099999999999994,44.9,2.69,10.6,20300,3.13,17.899999999999999,3.0468217389680623,null,"N","N",{"$f":"_xlfn.IFS($AE165<=$AX$5,\"C\",$AE165<=$AX$7,\"N\",TRUE,\"S\")","v":"C"},{"$f":"_xlfn.IFS($AF165<=$AY$5,\"C\",$AF165<=$AY$7,\"N\",TRUE,\"S\")","v":"C"},"F2",9.5016208956390411,33.157343810428443,2.5635444629858038E-3,6.5717602137051735E-6,3.6266480015160682E-3,7.867777617918463E-2,5057.1857142857134,80.714902695909544,400.39906962306708,0.87753485556854216,2.5635444629858038E-3,6.5717602137051735E-6,4.0519589572051706E-3,8.1335745033724094E-2,4922.7934096755407,80.714902695909544,230.52102832767494]
["W18X106","18X106","18",null,null,null,null,null,null,null,null,null,null,null,null,null,null,null,null,null,null,null,null,106,31.1,18.7,11.2,0.59,0.94,1.34,5.96,27.2,16.047999999999998,1910,230,204,7.84,220,60.5,39.4,2.66,7.48,17400,3.1,17.8,3.0150814333101343,null,"N","N",{"$f":"_xlfn.IFS($AE166<=$AX$5,\"C\",$AE166<=$AX$7,\"N\",TRUE,\"S\")","v":"C"},{"$f":"_xlfn.IFS($AF166<=$AY$5,\"C\",$AF166<=$AY$7,\"N\",TRUE,\"S\")","v":"C"},"F2",9.3956548633456691,31.475332431060014,2.0599250936329588E-3,4.2432913913787545E-6,3.6266480015160682E-3,7.5409370075270002E-2,5008.7142857142853,79.874054132322172,371.4371389351511,0.89934650455927045,2.0599250936329588E-3,4.2432913913787545E-6,3.7536518976256697E-3,7.6246816269655668E-2,4871.5101443910889,79.874054132322172,228.11957247414722]
["W18X97","18X97","18",null,null,null,null,null,null,null,null,null,null,null,null,null,null,null,null,null,null,null,null,97,28.5,18.600000000000001,11.1,0.53500000000000003,0.87,1.27,6.41,30,16.05,1750,211,188,7.82,201,55.3,36.1,2.65,5.86,15800,3.08,17.7,2.990366472663839,null,"N","N",{"$f":"_xlfn.IFS($AE167<=$AX$5,\"C\",$AE167<=$AX$7,\"N\",TRUE,\"S\")","v":"C"},{"$f":"_xlfn.IFS($AF167<=$AY$5,\"C\",$AF167<=$AY$7,\"N\",TRUE,\"S\")","v":"C"},"F2",9.3603328525812106,30.439310434285673,1.7610289698281045E-3,3.1012230325738349E-6,3.6266480015160682E-3,7.3400796803196708E-2,4976.3999999999996,79.219317552828485,353.7077611296537,0.88917365641503576,1.7610289698281045E-3,3.1012230325738349E-6,3.5983099101861518E-3,7.3207505626228353E-2,4831.5778294040028,79.219317552828485,226.24965075526399]
["W18X86","18X86","18",null,null,null,null,null,null,null,null,null,null,null,null,null,null,null,null,null,null,null,null,86,25.3,18.399999999999999,11.1,0.48,0.77,1.17,7.2,33.4,16.032,1530,186,166,7.77,175,48.4,31.6,2.63,4.0999999999999996,13600,3.05,17.600000000000001,{"$f":"$AA168/(SQRT(12*(1+$BJ168/6)))","v":2.987942039741462},null,{"$f":"IF($AE168<=$AV$7,\"N\",\"S\")","v":"N"},{"$f":"IF($AF168<=$AW$7,\"N\",\"S\")","v":"N"},{"$f":"_xlfn.IFS($AE168<=$AX$5,\"C\",$AE168<=$AX$7,\"N\",TRUE,\"S\")","v":"C"},{"$f":"_xlfn.IFS($AF168<=$AY$5,\"C\",$AF168<=$AY$7,\"N\",TRUE,\"S\")","v":"C"},"F2",9.2896888310522971,29.125048697608502,1.4033406352683458E-3,1.9693649385953644E-6,{"$f":"SQRT($BD$8+$BC$5)","v":3.6266480015160682E-3},7.092241279584624E-2,4927.9285714285716,79.155090668492051,335.88786964685346,0.90035802035802026,1.4033406352683458E-3,1.9693649385953644E-6,3.4374374344510478E-3,6.9575700281918784E-2,{"$f":"1.95*$AT168*E/$BJ$5","v":4827.6606384965617},79.155090668492051,{"$f":"pi*$AT168*SQRT(E/Fy)","v":226.06621935747992}]
["W18X76","18X76","18",null,null,null,null,null,null,null,null,null,null,null,null,null,null,null,null,null,null,null,null,76,22.3,18.2,11,0.42499999999999999,0.68,1.08,8.11,37.799999999999997,16.064999999999998,1330,163,146,7.73,152,42.2,27.6,2.61,2.83,11700,3.02,17.5,2.9583611528967593,null,"N","S",{"$f":"_xlfn.IFS($AE169<=$AX$5,\"C\",$AE169<=$AX$7,\"N\",TRUE,\"S\")","v":"C"},{"$f":"_xlfn.IFS($AF169<=$AY$5,\"C\",$AF169<=$AY$7,\"N\",TRUE,\"S\")","v":"C"},"F2",9.2190448095233801,27.978036739611525,1.1076320939334638E-3,1.2268488555114295E-6,3.6266480015160682E-3,6.8806105073965146E-2,4879.4571428571426,78.371448365828954,318.33023605114397,0.91278409090909063,1.1076320939334638E-3,1.2268488555114295E-6,3.3276808790329441E-3,6.6598145416868829E-2,4779.8663770374787,78.371448365828954,223.82814406509507]
["W18X71","18X71","18",null,null,null,null,null,null,null,null,null,null,null,null,null,null,null,null,null,null,null,null,71,20.9,18.5,7.64,0.495,0.81,1.21,4.71,32.4,16.038,1170,146,127,7.5,60.3,24.7,15.8,1.7,3.49,4700,2.0499999999999998,17.7,2.0018317666105845,null,"N","N",{"$f":"_xlfn.IFS($AE170<=$AX$5,\"C\",$AE170<=$AX$7,\"N\",TRUE,\"S\")","v":"C"},{"$f":"_xlfn.IFS($AF170<=$AY$5,\"C\",$AF170<=$AY$7,\"N\",TRUE,\"S\")","v":"C"},"F2",6.0047418299577586,19.864098653389135,1.5525601672672271E-3,2.4104430729848403E-6,3.6266480015160682E-3,7.1966715700963427E-2,3312.2142857142853,53.031542406638884,229.92764373260351,1.2828534031413612,1.5525601672672271E-3,2.4104430729848403E-6,3.5010076049838677E-3,7.1088450343576165E-2,3234.3881829093871,53.031542406638884,151.45760300842966]
["W18X65","18X65","18",null,null,null,null,null,null,null,null,null,null,null,null,null,null,null,null,null,null,null,null,65,19.100000000000001,18.399999999999999,7.59,0.45,0.75,1.1499999999999999,5.0599999999999996,35.700000000000003,16.065000000000001,1070,133,117,7.49,54.8,22.5,14.4,1.69,2.73,4240,2.0299999999999998,17.7,1.9904934518922111,null,"N","N",{"$f":"_xlfn.IFS($AE171<=$AX$5,\"C\",$AE171<=$AX$7,\"N\",TRUE,\"S\")","v":"C"},{"$f":"_xlfn.IFS($AF171<=$AY$5,\"C\",$AF171<=$AY$7,\"N\",TRUE,\"S\")","v":"C"},"F2",5.969419819193301,19.220239306408143,1.3182674199623352E-3,1.7378289905341519E-6,3.6266480015160682E-3,7.0320092587242825E-2,3279.8999999999996,52.731173350738992,220.99469875698921,1.2699604743083004,1.3182674199623352E-3,1.7378289905341519E-6,3.4035922446298103E-3,6.8715789048748796E-2,3216.0687058429867,52.731173350738992,150.59975171540736]
["W18X60","18X60","18",null,null,null,null,null,null,null,null,null,null,null,null,null,null,null,null,null,null,null,null,60,17.600000000000001,18.2,7.56,0.41499999999999998,0.69499999999999995,1.1000000000000001,5.44,38.700000000000003,16.060500000000001,984,123,108,7.47,50.1,20.6,13.3,1.68,2.17,3850,2.02,17.5,1.9828210467578604,null,"N","S",{"$f":"_xlfn.IFS($AE172<=$AX$5,\"C\",$AE172<=$AX$7,\"N\",TRUE,\"S\")","v":"C"},{"$f":"_xlfn.IFS($AF172<=$AY$5,\"C\",$AF172<=$AY$7,\"N\",TRUE,\"S\")","v":"C"},"F2",5.9340978084288425,18.793692028136341,1.1481481481481481E-3,1.3182441700960218E-6,3.6266480015160682E-3,6.9099899780420929E-2,3263.7428571428572,52.527919768180382,214.65879547081178,1.2685294621445704,1.1481481481481481E-3,1.3182441700960218E-6,3.3413852437673302E-3,6.7003980418445866E-2,3203.6722912616287,52.527919768180382,150.01926133137979]
["W18X55","18X55","18",null,null,null,null,null,null,null,null,null,null,null,null,null,null,null,null,null,null,null,null,55,16.2,18.100000000000001,7.53,0.39,0.63,1.03,5.98,41.1,16.029,890,112,98.3,7.41,44.9,18.5,11.9,1.67,1.66,3430,2,17.5,1.9682985402822237,null,"N","S",{"$f":"_xlfn.IFS($AE173<=$AX$5,\"C\",$AE173<=$AX$7,\"N\",TRUE,\"S\")","v":"C"},{"$f":"_xlfn.IFS($AF173<=$AY$5,\"C\",$AF173<=$AY$7,\"N\",TRUE,\"S\")","v":"C"},"F2",5.8987757976643858,18.247210168169431,9.6497602092719074E-4,9.3117872096447403E-7,3.6266480015160682E-3,6.7761523170920962E-2,3231.4285714285716,52.143196670635874,207.27371671044412,1.3177575412635174,9.6497602092719074E-4,9.3117872096447403E-7,3.2829544465518422E-3,6.5176149529402497E-2,3180.2080700845645,52.143196670635874,148.92049566227539]
["W18X50","18X50","18",null,null,null,null,null,null,null,null,null,null,null,null,null,null,null,null,null,null,null,null,50,14.7,18,7.5,0.35499999999999998,0.56999999999999995,0.97199999999999998,6.57,45.2,16.045999999999999,800,101,88.9,7.38,40.1,16.600000000000001,10.7,1.65,1.24,3040,1.98,17.399999999999999,1.9584882684539748,null,"N","S",{"$f":"_xlfn.IFS($AE174<=$AX$5,\"C\",$AE174<=$AX$7,\"N\",TRUE,\"S\")","v":"C"},{"$f":"_xlfn.IFS($AF174<=$AY$5,\"C\",$AF174<=$AY$7,\"N\",TRUE,\"S\")","v":"C"},"F2",5.8281317761354714,17.740491609642543,8.0162393493916711E-4,6.4260093306735404E-7,3.6266480015160682E-3,6.6545262314121473E-2,3199.1142857142859,51.883307775296124,201.1379030319643,1.3324748538011697,8.0162393493916711E-4,6.4260093306735404E-7,3.2387053138927895E-3,6.3563584298180958E-2,3164.3574737449221,51.883307775296124,148.17825533981141]
["W18X46","18X46","18",null,null,null,null,null,null,null,null,null,null,null,null,null,null,null,null,null,null,null,null,46,13.5,18.100000000000001,6.06,0.36,0.60499999999999998,1.01,5.01,44.6,16.056000000000001,712,90.7,78.8,7.25,22.5,11.7,7.43,1.29,1.22,1720,1.58,17.5,1.556759238316709,null,"N","S",{"$f":"_xlfn.IFS($AE175<=$AX$5,\"C\",$AE175<=$AX$7,\"N\",TRUE,\"S\")","v":"C"},{"$f":"_xlfn.IFS($AF175<=$AY$5,\"C\",$AF175<=$AY$7,\"N\",TRUE,\"S\")","v":"C"},"F2",4.556539388615005,14.288726555703013,8.8469905728788979E-4,7.8269242196608086E-7,3.6266480015160682E-3,6.7166562058839654E-2,2552.8285714285716,41.240899930118474,161.93704349061653,1.5765649292201951,8.8469905728788979E-4,7.8269242196608086E-7,3.2602612777408069E-3,6.4381366365033735E-2,2515.2781407659968,41.240899930118474,117.78363528314627]
["W18X40","18X40","18",null,null,null,null,null,null,null,null,null,null,null,null,null,null,null,null,null,null,null,null,40,11.8,17.899999999999999,6.02,0.315,0.52500000000000002,0.92700000000000005,5.73,50.9,16.0335,612,78.400000000000006,68.400000000000006,7.21,19.100000000000001,10,6.35,1.27,0.81,1440,1.56,17.399999999999999,1.5442982673319983,null,"N","S",{"$f":"_xlfn.IFS($AE176<=$AX$5,\"C\",$AE176<=$AX$7,\"N\",TRUE,\"S\")","v":"C"},{"$f":"_xlfn.IFS($AF176<=$AY$5,\"C\",$AF176<=$AY$7,\"N\",TRUE,\"S\")","v":"C"},"F2",4.4858953670860897,13.785003681939584,6.8058076225045369E-4,4.6319017394540857E-7,3.6266480015160682E-3,6.5629480904289661E-2,2520.5142857142855,40.910790016675321,155.65121673631532,1.5980232558139535,6.8058076225045369E-4,4.6319017394540857E-7,3.2108879381123607E-3,6.2381637525499557E-2,2495.1447719321286,40.910790016675321,116.84084437135182]
["W18X35","18X35","18",null,null,null,null,null,null,null,null,null,null,null,null,null,null,null,null,null,null,null,null,35,10.3,17.7,6,0.3,0.42499999999999999,0.82699999999999996,7.06,53.5,16.05,510,66.5,57.6,7.04,15.3,8.06,5.12,1.22,0.50600000000000001,1140,1.51,17.3,1.5105890224117453,null,"N","S",{"$f":"_xlfn.IFS($AE177<=$AX$5,\"C\",$AE177<=$AX$7,\"N\",TRUE,\"S\")","v":"C"},{"$f":"_xlfn.IFS($AF177<=$AY$5,\"C\",$AF177<=$AY$7,\"N\",TRUE,\"S\")","v":"C"},"F2",4.3092853132638025,13.072792629062327,5.0778741168914577E-4,2.5784805546996202E-7,3.6266480015160682E-3,6.4299575528966077E-2,2439.7285714285713,40.017781282724137,148.19047260408058,1.8882352941176472,5.0778741168914577E-4,2.5784805546996202E-7,3.1787512064708682E-3,6.0716872598644389E-2,2440.6802633538341,40.017781282724137,114.29041954544847]
["W16X100","16X100","16",null,null,null,null,null,null,null,null,null,null,null,null,null,null,null,null,null,null,null,null,100,29.4,17,10.4,0.58499999999999996,0.98499999999999999,1.39,5.29,24.3,14.215499999999999,1490,198,175,7.1,186,54.9,35.700000000000003,2.5099999999999998,7.73,11900,2.92,16,2.8176525198044691,null,"N","N",{"$f":"_xlfn.IFS($AE178<=$AX$5,\"C\",$AE178<=$AX$7,\"N\",TRUE,\"S\")","v":"C"},{"$f":"_xlfn.IFS($AF178<=$AY$5,\"C\",$AF178<=$AY$7,\"N\",TRUE,\"S\")","v":"C"},"F2",8.8658247018788057,31.421502289350983,2.760714285714286E-3,7.6215433673469405E-6,3.6266480015160682E-3,7.99209752645096E-2,4717.8857142857141,74.643864476275496,379.26100599625863,0.8117988578680202,2.760714285714286E-3,7.6215433673469405E-6,4.1794921395448244E-3,8.3307901337502849E-2,4552.521428426935,74.643864476275496,213.1821983636566]
["W16X89","16X89","16",null,null,null,null,null,null,null,null,null,null,null,null,null,null,null,null,null,null,null,null,89,26.2,16.8,10.4,0.52500000000000002,0.875,1.28,5.92,27,14.175000000000001,1300,175,155,7.05,163,48.1,31.4,2.4900000000000002,5.45,10200,2.88,15.9,2.8164145575065578,null,"N","N",{"$f":"_xlfn.IFS($AE179<=$AX$5,\"C\",$AE179<=$AX$7,\"N\",TRUE,\"S\")","v":"C"},{"$f":"_xlfn.IFS($AF179<=$AY$5,\"C\",$AF179<=$AY$7,\"N\",TRUE,\"S\")","v":"C"},"F2",8.795180680349894,29.628502952321622,2.2114019070805439E-3,4.890298394639467E-6,3.6266480015160682E-3,7.6407132576720951E-2,4653.2571428571428,74.611068988065881,353.95538956399611,0.81778846153846163,2.2114019070805439E-3,4.890298394639467E-6,3.8388682670559959E-3,7.7783482656258965E-2,4550.5212350570237,74.611068988065881,213.08853474747079]
["W16X77","16X77","16",null,null,null,null,null,null,null,null,null,null,null,null,null,null,null,null,null,null,null,null,77,22.6,16.5,10.3,0.45500000000000002,0.76,1.1599999999999999,6.77,31.2,14.196,1110,150,134,7,138,41.1,26.9,2.4700000000000002,3.57,8590,2.85,15.7,2.7878314264588857,null,"N","N",{"$f":"_xlfn.IFS($AE180<=$AX$5,\"C\",$AE180<=$AX$7,\"N\",TRUE,\"S\")","v":"C"},{"$f":"_xlfn.IFS($AF180<=$AY$5,\"C\",$AF180<=$AY$7,\"N\",TRUE,\"S\")","v":"C"},"F2",8.7245366588209787,27.998190483111355,1.6969293659093072E-3,2.8795692728853636E-6,3.6266480015160682E-3,7.2962849227708862E-2,4604.7857142857147,73.853858741155051,326.81476018301089,0.82513796627491054,1.6969293659093072E-3,2.8795692728853636E-6,3.5673772508742893E-3,7.2555541599409176E-2,4504.339061892857,73.853858741155051,210.92594916602297]
["W16X67","16X67","16",null,null,null,null,null,null,null,null,null,null,null,null,null,null,null,null,null,null,null,null,67,19.600000000000001,16.3,10.199999999999999,0.39500000000000002,0.66500000000000004,1.07,7.7,35.9,14.1805,954,130,117,6.96,119,35.5,23.2,2.46,2.39,7300,2.82,15.6,2.7606343130617708,null,"N","S",{"$f":"_xlfn.IFS($AE181<=$AX$5,\"C\",$AE181<=$AX$7,\"N\",TRUE,\"S\")","v":"C"},{"$f":"_xlfn.IFS($AF181<=$AY$5,\"C\",$AF181<=$AY$7,\"N\",TRUE,\"S\")","v":"C"},"F2",8.689214648056522,26.676209397457427,1.3094455402147709E-3,1.7146476227883533E-6,3.6266480015160682E-3,7.0257337992062005E-2,4556.3142857142857,73.133366192023743,306.10249630325274,0.82578468229397028,1.3094455402147709E-3,1.7146476227883533E-6,3.4001851126017227E-3,6.8626748814266975E-2,4460.3962972469471,73.133366192023743,208.86822899563626]
["W16X57","16X57","16",null,null,null,null,null,null,null,null,null,null,null,null,null,null,null,null,null,null,null,null,57,16.8,16.399999999999999,7.12,0.43,0.71499999999999997,1.1200000000000001,4.9800000000000004,33,14.19,758,105,92.2,6.72,43.1,18.899999999999999,12.1,1.6,2.2200000000000002,2660,1.92,15.7,1.8764705902389778,null,"N","N",{"$f":"_xlfn.IFS($AE182<=$AX$5,\"C\",$AE182<=$AX$7,\"N\",TRUE,\"S\")","v":"C"},{"$f":"_xlfn.IFS($AF182<=$AY$5,\"C\",$AF182<=$AY$7,\"N\",TRUE,\"S\")","v":"C"},"F2",5.6515217223131842,18.570404578193596,1.5336363761968583E-3,2.3520405343942315E-6,3.6266480015160682E-3,7.1835119389564092E-2,3102.1714285714284,49.710535790706686,214.94643009315828,1.1985738980121003,1.5336363761968583E-3,2.3520405343942315E-6,3.4926568270536211E-3,7.08963553594293E-2,3031.840339371834,49.710535790706686,141.97283830429654]
["W16X50","16X50","16",null,null,null,null,null,null,null,null,null,null,null,null,null,null,null,null,null,null,null,null,50,14.7,16.3,7.07,0.38,0.63,1.03,5.61,37.4,14.212,659,92,81,6.68,37.200000000000003,16.3,10.5,1.59,1.52,2270,1.89,15.7,1.8614944594023628,null,"N","S",{"$f":"_xlfn.IFS($AE183<=$AX$5,\"C\",$AE183<=$AX$7,\"N\",TRUE,\"S\")","v":"C"},{"$f":"_xlfn.IFS($AF183<=$AY$5,\"C\",$AF183<=$AY$7,\"N\",TRUE,\"S\")","v":"C"},"F2",5.6161997115487265,17.670716246787261,1.1952504521506645E-3,1.4286236433663679E-6,3.6266480015160682E-3,6.9439890939334947E-2,3053.7,49.313795499741062,202.94599448859188,1.2124918614310409,1.1952504521506645E-3,1.4286236433663679E-6,3.3578616440431857E-3,6.7476752264715958E-2,3007.6431908343889,49.313795499741062,140.83975164002862]
["W16X45","16X45","16",null,null,null,null,null,null,null,null,null,null,null,null,null,null,null,null,null,null,null,null,45,13.3,16.100000000000001,7.04,0.34499999999999997,0.56499999999999995,0.96699999999999997,6.23,41.1,14.179499999999999,586,82.3,72.7,6.65,32.799999999999997,14.5,9.34,1.57,1.1100000000000001,1990,1.87,15.5,1.8513666785734739,null,"N","S",{"$f":"_xlfn.IFS($AE184<=$AX$5,\"C\",$AE184<=$AX$7,\"N\",TRUE,\"S\")","v":"C"},{"$f":"_xlfn.IFS($AF184<=$AY$5,\"C\",$AF184<=$AY$7,\"N\",TRUE,\"S\")","v":"C"},"F2",5.5455556900198131,17.09838946276188,9.850468119093046E-4,9.70317221652685E-7,3.6266480015160682E-3,6.7909460411826078E-2,3021.3857142857141,49.045495312147501,195.5564153989954,1.2298691421962993,9.850468119093046E-4,9.70317221652685E-7,3.2889099104145012E-3,6.5375505522510535E-2,2991.2795906665701,49.045495312147501,140.07348874335403]
["W16X40","16X40","16",null,null,null,null,null,null,null,null,null,null,null,null,null,null,null,null,null,null,null,null,40,11.8,16,7,0.30499999999999999,0.505,0.90700000000000003,6.93,46.5,14.182499999999999,518,73,64.7,6.63,28.9,12.7,8.25,1.57,0.79400000000000004,1730,1.86,15.5,1.8416376559333374,null,"N","S",{"$f":"_xlfn.IFS($AE185<=$AX$5,\"C\",$AE185<=$AX$7,\"N\",TRUE,\"S\")","v":"C"},{"$f":"_xlfn.IFS($AF185<=$AY$5,\"C\",$AF185<=$AY$7,\"N\",TRUE,\"S\")","v":"C"},"F2",5.5455556900198131,16.646708015451502,7.9174353093683001E-4,6.2685781878031911E-7,3.6266480015160682E-3,6.6470982634927997E-2,3005.2285714285713,48.787758830330581,188.8488845290988,1.2236669024045261,7.9174353093683001E-4,6.2685781878031911E-7,3.2362739370996327E-3,6.346666422647769E-2,2975.5602698008638,48.787758830330581,139.33739569434385]
["W16X36","16X36","16",null,null,null,null,null,null,null,null,null,null,null,null,null,null,null,null,null,null,null,null,36,10.6,15.9,6.99,0.29499999999999998,0.43,0.83199999999999996,8.1199999999999992,48.1,14.189499999999999,448,64,56.5,6.51,24.5,10.8,7,1.52,0.54500000000000004,1460,1.83,15.5,1.8178664084604346,null,"N","S",{"$f":"_xlfn.IFS($AE186<=$AX$5,\"C\",$AE186<=$AX$7,\"N\",TRUE,\"S\")","v":"C"},{"$f":"_xlfn.IFS($AF186<=$AY$5,\"C\",$AF186<=$AY$7,\"N\",TRUE,\"S\")","v":"C"},"F2",5.3689456361975259,16.061138570683905,6.2232372252355134E-4,3.8728681561557014E-7,3.6266480015160682E-3,6.5184137058333605E-2,2956.7571428571428,48.158022635988743,181.56665074170158,1.3926547892337888,6.2232372252355134E-4,3.8728681561557014E-7,3.1990464192921003E-3,6.1817231754711009E-2,2937.152725669645,48.158022635988743,137.53887484817807]
["W16X31","16X31","16",null,null,null,null,null,null,null,null,null,null,null,null,null,null,null,null,null,null,null,null,31,9.1300000000000008,15.9,5.53,0.27500000000000002,0.44,0.84199999999999997,6.28,51.6,14.190000000000001,375,54,47.2,6.41,12.4,7.03,4.49,1.17,0.46100000000000002,739,1.42,15.5,1.418065052498688,null,"N","S",{"$f":"_xlfn.IFS($AE187<=$AX$5,\"C\",$AE187<=$AX$7,\"N\",TRUE,\"S\")","v":"C"},{"$f":"_xlfn.IFS($AF187<=$AY$5,\"C\",$AF187<=$AY$7,\"N\",TRUE,\"S\")","v":"C"},"F2",4.1326752594415153,12.474178298521869,6.3012575177692732E-4,3.9705846305243782E-7,3.6266480015160682E-3,6.5243955683978852E-2,2294.3142857142852,37.566681786794632,141.80767540986429,1.6037522603978303,6.3012575177692732E-4,3.9705846305243782E-7,3.2005733299242615E-3,6.1892641579602892E-2,2291.187963394309,37.566681786794632,107.29010166779649]
["W16X26","16X26","16",null,null,null,null,null,null,null,null,null,null,null,null,null,null,null,null,null,null,null,null,26,7.68,15.7,5.5,0.25,0.34499999999999997,0.747,7.97,56.8,14.2,301,44.2,38.4,6.26,9.59,5.48,3.49,1.1200000000000001,0.26200000000000001,565,1.38,15.4,1.3862321612755939,null,"N","S",{"$f":"_xlfn.IFS($AE188<=$AX$5,\"C\",$AE188<=$AX$7,\"N\",TRUE,\"S\")","v":"C"},{"$f":"_xlfn.IFS($AF188<=$AY$5,\"C\",$AF188<=$AY$7,\"N\",TRUE,\"S\")","v":"C"},"F2",3.9560652056192294,11.853410146506613,4.430465367965368E-4,1.9629023376740504E-7,3.6266480015160682E-3,6.3794157556257489E-2,2229.6857142857143,36.723380491960185,134.61096348006828,1.8708827404479578,4.430465367965368E-4,1.9629023376740504E-7,3.1690537090648119E-3,6.0100750792825779E-2,2239.7551062895668,36.723380491960185,104.8816408361247]
["W14X873","14X873","14",null,null,null,null,null,null,null,null,null,null,null,null,null,null,null,null,null,null,null,null,873,257,23.6,18.8,3.94,5.51,6.1,1.71,2.89,11.3866,18100,2030,1530,8.39,6170,1020,656,4.9000000000000004,2270,505000,6.04,18.100000000000001,5.2412267331499587,null,"N","N",{"$f":"_xlfn.IFS($AE189<=$AX$5,\"C\",$AE189<=$AX$7,\"N\",TRUE,\"S\")","v":"C"},{"$f":"_xlfn.IFS($AF189<=$AY$5,\"C\",$AF189<=$AY$7,\"N\",TRUE,\"S\")","v":"C"},"F2",17.307785274584127,237.92992911692997,8.197017296789802E-2,6.719109256387119E-3,3.6266480015160682E-3,0.29256934386468808,9758.9142857142851,138.84800031546357,3429.414246433113,0.43309267482720004,8.197017296789802E-2,6.719109256387119E-3,8.2030213138600885E-2,0.40496961133707171,8468.3249074180039,138.84800031546357,396.54862664641553]
["W14X808","14X808","14",null,null,null,null,null,null,null,null,null,null,null,null,null,null,null,null,null,null,null,null,808,238,22.8,18.600000000000001,3.74,5.12,5.71,1.82,3.04,11.3696,15900,1830,1390,8.17,5550,930,597,4.83,1840,434000,5.94,17.7,5.1800687383629604,null,"N","N",{"$f":"_xlfn.IFS($AE190<=$AX$5,\"C\",$AE190<=$AX$7,\"N\",TRUE,\"S\")","v":"C"},{"$f":"_xlfn.IFS($AF190<=$AY$5,\"C\",$AF190<=$AY$7,\"N\",TRUE,\"S\")","v":"C"},"F2",17.060531199232923,223.9583870367845,7.4787627525098571E-2,5.5931892308328816E-3,3.6266480015160682E-3,0.28002549085148415,9597.3428571428576,137.22783280281433,3237.6169919079362,0.44651276881720431,7.4787627525098571E-2,5.5931892308328816E-3,7.485342905979693E-2,0.38683466311189785,8369.5110615550129,137.22783280281433,391.92144295908497]
["W14X730","14X730","14",null,null,null,null,null,null,null,null,null,null,null,null,null,null,null,null,null,null,null,null,730,215,22.4,17.899999999999999,3.07,4.91,5.51,1.82,3.71,11.389699999999999,14300,1660,1280,8.17,4720,816,527,4.6900000000000004,1450,362000,5.68,17.5,5.0040438483974503,null,"N","N",{"$f":"_xlfn.IFS($AE191<=$AX$5,\"C\",$AE191<=$AX$7,\"N\",TRUE,\"S\")","v":"C"},{"$f":"_xlfn.IFS($AF191<=$AY$5,\"C\",$AF191<=$AY$7,\"N\",TRUE,\"S\")","v":"C"},"F2",16.566023048530521,199.95342184103595,6.4732142857142863E-2,4.1902503188775515E-3,3.6266480015160682E-3,0.26145514119760377,9177.2571428571409,132.56466800918369,2909.9673542152391,0.39784704570537838,6.4732142857142863E-2,4.1902503188775515E-3,6.4808154811371699E-2,0.35991707054336081,8085.1051321964524,132.56466800918369,378.60348670088308]
["W14X665","14X665","14",null,null,null,null,null,null,null,null,null,null,null,null,null,null,null,null,null,null,null,null,665,196,21.6,17.7,2.83,4.5199999999999996,5.12,1.95,4.03,11.404900000000001,12400,1480,1150,7.98,4170,730,472,4.62,1120,305000,5.57,17.100000000000001,4.945975919204999,null,"N","N",{"$f":"_xlfn.IFS($AE192<=$AX$5,\"C\",$AE192<=$AX$7,\"N\",TRUE,\"S\")","v":"C"},{"$f":"_xlfn.IFS($AF192<=$AY$5,\"C\",$AF192<=$AY$7,\"N\",TRUE,\"S\")","v":"C"},"F2",16.318768973179321,184.5888212672908,5.6953979150775491E-2,3.2437557411069693E-3,3.6266480015160682E-3,0.24613132094938986,8999.528571428571,131.02636099417956,2698.1009806435336,0.40342816609169552,5.6953979150775491E-2,3.2437557411069693E-3,5.7040357224373513E-2,0.33763047311394895,7991.2839494583632,131.02636099417956,374.21009585064047]
["W14X605","14X605","14",null,null,null,null,null,null,null,null,null,null,null,null,null,null,null,null,null,null,null,null,605,178,20.9,17.399999999999999,2.6,4.16,4.76,2.09,4.3899999999999997,11.414,10800,1320,1040,7.8,3680,652,423,4.55,869,258000,5.44,16.7,4.8596581756476782,null,"N","N",{"$f":"_xlfn.IFS($AE193<=$AX$5,\"C\",$AE193<=$AX$7,\"N\",TRUE,\"S\")","v":"C"},{"$f":"_xlfn.IFS($AF193<=$AY$5,\"C\",$AF193<=$AY$7,\"N\",TRUE,\"S\")","v":"C"},"F2",16.071514897828116,169.67286206938169,5.0034546292031322E-2,2.5034558226494255E-3,3.6266480015160682E-3,0.23164885990124665,8789.4857142857145,128.73967379385803,2485.0405237764135,0.40998563218390804,5.0034546292031322E-2,2.5034558226494255E-3,5.013284785274616E-2,0.31649232872974581,7851.8191380821763,128.73967379385803,367.67933799458768]
["W14X550","14X550","14",null,null,null,null,null,null,null,null,null,null,null,null,null,null,null,null,null,null,null,null,550,162,20.2,17.2,2.38,3.82,4.42,2.25,4.79,11.4002,9430,1180,931,7.63,3250,583,378,4.49,669,219000,5.35,16.399999999999999,4.8026895835103778,null,"N","N",{"$f":"_xlfn.IFS($AE194<=$AX$5,\"C\",$AE194<=$AX$7,\"N\",TRUE,\"S\")","v":"C"},{"$f":"_xlfn.IFS($AF194<=$AY$5,\"C\",$AF194<=$AY$7,\"N\",TRUE,\"S\")","v":"C"},"F2",15.859582833241374,156.8994774413629,4.3815985957926178E-2,1.9198406254651839E-3,3.6266480015160682E-3,0.21781330069452198,8644.0714285714294,127.23048987532576,2298.5728384529571,0.41295014002191649,4.3815985957926178E-2,1.9198406254651839E-3,4.3928205479422375E-2,0.29621646044294797,7759.7741699289118,127.23048987532576,363.36912244311327]
["W14X500","14X500","14",null,null,null,null,null,null,null,null,null,null,null,null,null,null,null,null,null,null,null,null,500,147,19.600000000000001,17,2.19,3.5,4.0999999999999996,2.4300000000000002,5.21,11.4099,8210,1050,838,7.48,2880,522,339,4.43,514,187000,5.26,16.100000000000001,4.7442517643980358,null,"N","N",{"$f":"_xlfn.IFS($AE195<=$AX$5,\"C\",$AE195<=$AX$7,\"N\",TRUE,\"S\")","v":"C"},{"$f":"_xlfn.IFS($AF195<=$AY$5,\"C\",$AF195<=$AY$7,\"N\",TRUE,\"S\")","v":"C"},"F2",15.647650768654627,144.66428215058536,3.8097214604426388E-2,1.4513977606157194E-3,3.6266480015160682E-3,0.20426419805228341,8498.6571428571424,125.68238391852259,2117.6845261606682,0.41996102521008399,3.8097214604426388E-2,1.4513977606157194E-3,3.8226226230075204E-2,0.27626697383962057,7665.3553507631113,125.68238391852259,358.94774590417393]
["W14X455","14X455","14",null,null,null,null,null,null,null,null,null,null,null,null,null,null,null,null,null,null,null,null,455,134,19,16.8,2.02,3.21,3.81,2.62,5.66,11.433200000000001,7190,936,756,7.33,2560,468,304,4.38,395,160000,5.17,15.8,4.685410595751029,null,"N","N",{"$f":"_xlfn.IFS($AE196<=$AX$5,\"C\",$AE196<=$AX$7,\"N\",TRUE,\"S\")","v":"C"},{"$f":"_xlfn.IFS($AF196<=$AY$5,\"C\",$AF196<=$AY$7,\"N\",TRUE,\"S\")","v":"C"},"F2",15.471040714832341,133.3459589327808,3.3068783068783067E-2,1.0935444136502335E-3,3.6266480015160682E-3,0.19156051542606356,8353.2428571428572,124.12359262426547,1949.0523205658692,0.4282573802106513,3.3068783068783067E-2,1.0935444136502335E-3,3.321733018813227E-2,0.25746089655890531,7570.2848339920201,124.12359262426547,354.49585213860553]
["W14X426","14X426","14",null,null,null,null,null,null,null,null,null,null,null,null,null,null,null,null,null,null,null,null,426,125,18.7,16.7,1.88,3.04,3.63,2.75,6.08,11.430399999999999,6600,869,706,7.26,2360,434,283,4.34,331,144000,5.1100000000000003,15.7,4.6593249258368168,null,"N","N",{"$f":"_xlfn.IFS($AE197<=$AX$5,\"C\",$AE197<=$AX$7,\"N\",TRUE,\"S\")","v":"C"},{"$f":"_xlfn.IFS($AF197<=$AY$5,\"C\",$AF197<=$AY$7,\"N\",TRUE,\"S\")","v":"C"},"F2",15.329752671774513,125.90852716990673,2.9862326554916011E-2,8.9175854727244197E-4,3.6266480015160682E-3,0.18299993048204166,8256.3000000000011,123.43254388913455,1842.3041794860546,0.42328143712574845,2.9862326554916011E-2,8.9175854727244197E-4,3.0026740723055709E-2,0.24472242904558569,7528.1378444591983,123.43254388913455,352.52222323333285]
["W14X398","14X398","14",null,null,null,null,null,null,null,null,null,null,null,null,null,null,null,null,null,null,null,null,398,117,18.3,16.600000000000001,1.77,2.85,3.44,2.92,6.44,11.398800000000001,6000,801,656,7.16,2170,402,262,4.3099999999999996,273,129000,5.05,15.5,4.6302788640624213,null,"N","N",{"$f":"_xlfn.IFS($AE198<=$AX$5,\"C\",$AE198<=$AX$7,\"N\",TRUE,\"S\")","v":"C"},{"$f":"_xlfn.IFS($AF198<=$AY$5,\"C\",$AF198<=$AY$7,\"N\",TRUE,\"S\")","v":"C"},"F2",15.223786639481139,118.70000260495887,2.6848937844217151E-2,7.2086546336263592E-4,3.6266480015160682E-3,0.17457258045218102,8159.3571428571431,122.66306990913934,1736.5529188655842,0.42646112872542807,2.6848937844217151E-2,7.2086546336263592E-4,2.7031686490853767E-2,0.23212200312566433,7481.2077075065699,122.66306990913934,350.32461254168453]
["W14X370","14X370","14",null,null,null,null,null,null,null,null,null,null,null,null,null,null,null,null,null,null,null,null,370,109,17.899999999999999,16.5,1.66,2.66,3.26,3.1,6.89,11.437399999999998,5440,736,607,7.07,1990,370,241,4.2699999999999996,222,116000,5,15.2,4.6001949264025388,null,"N","N",{"$f":"_xlfn.IFS($AE199<=$AX$5,\"C\",$AE199<=$AX$7,\"N\",TRUE,\"S\")","v":"C"},{"$f":"_xlfn.IFS($AF199<=$AY$5,\"C\",$AF199<=$AY$7,\"N\",TRUE,\"S\")","v":"C"},"F2",15.082498596423308,112.02099012890996,2.4061389057487212E-2,5.7895044337576531E-4,3.6266480015160682E-3,0.16639722671668322,8078.5714285714284,121.86610103174459,1633.9305947741097,0.43258336750968324,2.4061389057487212E-2,5.7895044337576531E-4,2.4265140728067812E-2,0.21983295882454712,7432.6006596589596,121.86610103174459,348.04847667301681]
["W14X342","14X342","14",null,null,null,null,null,null,null,null,null,null,null,null,null,null,null,null,null,null,null,null,342,101,17.5,16.399999999999999,1.54,2.4700000000000002,3.07,3.31,7.41,11.4114,4900,672,558,6.98,1810,338,221,4.24,178,103000,4.95,15,{"$f":"$AA200/(SQRT(12*(1+$BJ200/6)))","v":4.5718722249651336},null,{"$f":"IF($AE200<=$AV$7,\"N\",\"S\")","v":"N"},{"$f":"IF($AF200<=$AW$7,\"N\",\"S\")","v":"N"},{"$f":"_xlfn.IFS($AE200<=$AX$5,\"C\",$AE200<=$AX$7,\"N\",TRUE,\"S\")","v":"C"},{"$f":"_xlfn.IFS($AF200<=$AY$5,\"C\",$AF200<=$AY$7,\"N\",TRUE,\"S\")","v":"C"},"F2",14.97653256412994,105.15448430473005,2.1266427718040621E-2,4.5226094788664641E-4,{"$f":"SQRT($BD$8+$BC$5)","v":3.6266480015160682E-3},0.15777539643289346,7997.7857142857147,121.11578995795671,1527.5425450959708,0.43382926829268292,2.1266427718040621E-2,4.5226094788664641E-4,2.1496687164859064E-2,0.20679244396955052,{"$f":"1.95*$AT200*E/$BJ$5","v":7386.8392663365221},121.11578995795671,{"$f":"pi*$AT200*SQRT(E/Fy)","v":345.90559506728829}]
["W14X311",{"$f":"RIGHT(A201,LEN(A201)-1)","v":"14X311"},{"$f":"LEFT(B201,(FIND(\"X\",B201)-1))","v":"14"},null,null,null,null,null,null,null,null,null,null,null,null,null,null,null,null,null,null,null,null,311,91.4,17.100000000000001,16.2,1.41,2.2599999999999998,2.86,3.59,8.09,{"$f":"+AF201*AB201","v":11.406899999999998},4330,603,506,6.88,1610,304,199,4.2,136,89100,4.87,14.8,4.5141981244031912,null,"N","N",{"$f":"_xlfn.IFS($AE201<=$AX$5,\"C\",$AE201<=$AX$7,\"N\",TRUE,\"S\")","v":"C"},{"$f":"_xlfn.IFS($AF201<=$AY$5,\"C\",$AF201<=$AY$7,\"N\",TRUE,\"S\")","v":"C"},{"$f":"IF(AND(AX201=\"C\", AY201= \"C\"),\"F2\",\"F3\")","v":"F2"},{"$f":"1.76*AO201*sqrtefy/12","v":14.835244521072108},{"$f":"+$BG201*$BF201/12","v":96.785879945499516},{"$f":"+($AP201*$BD$5)/($AJ201*$AS201)","v":1.816045294306164E-2},{"$f":"+$BC201^2","v":3.2980205109715615E-4},3.6266480015160682E-3,{"$f":"SQRT(($BC201+$BE201))","v":0.14760454242528481},{"$f":"1.95*AR201*E/(0.7*Fy)","v":7868.528571428571},{"$f":"1.1*AT201*SQRT(E/Fy)","v":119.58791605729722},{"$f":"$BO201*$BN201","v":1395.1678481001511},{"$f":"(AG201*AB201)/(AA201*AC201)","v":0.43930211406096364},{"$f":"+($AP201)/($AJ201*$AS201)","v":1.816045294306164E-2},{"$f":"+$BC201^2","v":3.2980205109715615E-4},{"$f":"SQRT($BL201+$BK$5)","v":1.8429559470435699E-2},{"$f":"+SQRT($BK201+$BM201)","v":0.19128515994059064},7293.6543981428695,{"$f":"+$BH201","v":119.58791605729722},341.54200109676754]
["W14X283","14X283","14",null,null,null,null,null,null,null,null,null,null,null,null,null,null,null,null,null,null,null,null,283,83.3,16.7,16.100000000000001,1.29,2.0699999999999998,2.67,3.89,8.84,11.403600000000001,3840,542,459,6.79,1440,274,179,4.17,104,77700,4.8,14.6,4.4856009627553073,null,"N","N",{"$f":"_xlfn.IFS($AE202<=$AX$5,\"C\",$AE202<=$AX$7,\"N\",TRUE,\"S\")","v":"C"},{"$f":"_xlfn.IFS($AF202<=$AY$5,\"C\",$AF202<=$AY$7,\"N\",TRUE,\"S\")","v":"C"},"F2",14.729278488778737,89.425471503616436,1.5519145253230669E-2,2.4084386939087201E-4,3.6266480015160682E-3,0.13836832460771772,7755.4285714285716,118.83033411862759,1283.2765971460205,0.44140318660545513,1.5519145253230669E-2,2.4084386939087201E-4,1.5833208157794237E-2,0.17706595779828743,7247.4495555375033,118.83033411862759,339.37835396703565]
["W14X257","14X257","14",null,null,null,null,null,null,null,null,null,null,null,null,null,null,null,null,null,null,null,null,257,75.599999999999994,16.399999999999999,16,1.18,1.89,2.4900000000000002,4.2300000000000004,9.7100000000000009,11.457800000000001,3400,487,415,6.71,1290,246,161,4.13,79.099999999999994,67800,4.75,14.5,4.4557713112402286,null,"N","N",{"$f":"_xlfn.IFS($AE203<=$AX$5,\"C\",$AE203<=$AX$7,\"N\",TRUE,\"S\")","v":"C"},{"$f":"_xlfn.IFS($AF203<=$AY$5,\"C\",$AF203<=$AY$7,\"N\",TRUE,\"S\")","v":"C"},"F2",14.587990445720905,82.825624151777461,1.3144993768176152E-2,1.7279086116538987E-4,3.6266480015160682E-3,0.12950537351667005,7674.6428571428569,118.04010166469087,1175.4715706073484,0.44709669312169315,1.3144993768176152E-2,1.7279086116538987E-4,1.3514343207960937E-2,0.16327687214096517,7199.253361446712,118.04010166469087,337.12145726252379]
["W14X233","14X233","14",null,null,null,null,null,null,null,null,null,null,null,null,null,null,null,null,null,null,null,null,233,68.5,16,15.9,1.07,1.72,2.3199999999999998,4.62,10.7,11.449,3010,436,375,6.63,1150,221,145,4.0999999999999996,59.5,59000,4.6900000000000004,14.3,4.4276310785871713,null,"N","N",{"$f":"_xlfn.IFS($AE204<=$AX$5,\"C\",$AE204<=$AX$7,\"N\",TRUE,\"S\")","v":"C"},{"$f":"_xlfn.IFS($AF204<=$AY$5,\"C\",$AF204<=$AY$7,\"N\",TRUE,\"S\")","v":"C"},"F2",14.482024413427533,76.620115073352352,1.1095571095571096E-2,1.2311169793687279E-4,3.6266480015160682E-3,0.12133515194323187,7577.7,117.29462446417666,1076.0761661322083,0.44794610209156061,1.1095571095571096E-2,1.2311169793687279E-4,1.1530754923856582E-2,0.15042049733805454,7153.7867855458435,117.29462446417666,334.99238115492068]
["W14X211","14X211","14",null,null,null,null,null,null,null,null,null,null,null,null,null,null,null,null,null,null,null,null,211,62,15.7,15.8,0.98,1.56,2.16,5.0599999999999996,11.6,11.368,2660,390,338,6.55,1030,198,130,4.07,44.6,51500,4.6399999999999997,14.1,4.3984054367707746,null,"N","N",{"$f":"_xlfn.IFS($AE205<=$AX$5,\"C\",$AE205<=$AX$7,\"N\",TRUE,\"S\")","v":"C"},{"$f":"_xlfn.IFS($AF205<=$AY$5,\"C\",$AF205<=$AY$7,\"N\",TRUE,\"S\")","v":"C"},"F2",14.376058381134165,71.190518700500448,9.3583448738931551E-3,8.7578618778722293E-5,3.6266480015160682E-3,0.11395171291125564,7496.9142857142861,116.52039313804895,985.45214925114351,0.45198961376176555,9.3583448738931551E-3,8.7578618778722293E-5,9.87042197456078E-3,0.13866782917625101,7106.5664985539224,116.52039313804895,332.78118352596653]
["W14X193","14X193","14",null,null,null,null,null,null,null,null,null,null,null,null,null,null,null,null,null,null,null,null,193,56.8,15.5,15.7,0.89,1.44,2.04,5.45,12.8,11.392000000000001,2400,355,310,6.5,931,180,119,4.05,34.799999999999997,45900,4.59,14.1,4.3717619515600781,null,"N","N",{"$f":"_xlfn.IFS($AE206<=$AX$5,\"C\",$AE206<=$AX$7,\"N\",TRUE,\"S\")","v":"C"},{"$f":"_xlfn.IFS($AF206<=$AY$5,\"C\",$AF206<=$AY$7,\"N\",TRUE,\"S\")","v":"C"},"F2",14.305414359605246,66.527964579055222,7.9615648592999307E-3,6.3386515008839522E-5,3.6266480015160682E-3,0.10764856181489839,7416.1285714285714,115.81456703448778,907.85310213621142,0.4484642604387829,7.9615648592999307E-3,6.3386515008839522E-5,8.5576355487955637E-3,0.12852704154416492,7063.518238877783,115.81456703448778,330.7653505907968]
["W14X176","14X176","14",null,null,null,null,null,null,null,null,null,null,null,null,null,null,null,null,null,null,null,null,176,51.8,15.2,15.7,0.83,1.31,1.91,5.97,13.7,11.370999999999999,2140,320,281,6.43,838,163,107,4.0199999999999996,26.5,40500,4.55,13.9,4.3682331422638203,null,"N","N",{"$f":"_xlfn.IFS($AE207<=$AX$5,\"C\",$AE207<=$AX$7,\"N\",TRUE,\"S\")","v":"C"},{"$f":"_xlfn.IFS($AF207<=$AY$5,\"C\",$AF207<=$AY$7,\"N\",TRUE,\"S\")","v":"C"},"F2",14.199448327311876,62.509536139413704,6.7846079008679174E-3,4.6030904368519367E-5,3.6266480015160682E-3,0.1020355619496653,7351.4999999999991,115.72108355452669,842.80303734935706,0.45888705207371022,6.7846079008679174E-3,4.6030904368519367E-5,7.4751264568359913E-3,0.11941412964010543,7057.8166912862571,115.72108355452669,330.49836262187767]
["W14X159","14X159","14",null,null,null,null,null,null,null,null,null,null,null,null,null,null,null,null,null,null,null,null,159,46.7,15,15.6,0.745,1.19,1.79,6.54,15.3,11.3985,1900,287,254,6.38,748,146,96.2,4,19.7,35600,4.51,13.8,4.3408969061278135,null,"N","N",{"$f":"_xlfn.IFS($AE208<=$AX$5,\"C\",$AE208<=$AX$7,\"N\",TRUE,\"S\")","v":"C"},{"$f":"_xlfn.IFS($AF208<=$AY$5,\"C\",$AF208<=$AY$7,\"N\",TRUE,\"S\")","v":"C"},"F2",14.128804305782962,58.392520562917639,5.6202213853703067E-3,3.1586888420573733E-5,3.6266480015160682E-3,9.6160643648461372E-2,7286.8714285714277,114.99690543423485,770.13276131426335,0.45743818681318688,5.6202213853703067E-3,3.1586888420573733E-5,6.4368858617924688E-3,0.1098048598522068,7013.6491440436521,114.99690543423485,328.43011649376166]
["W14X145","14X145","14",null,null,null,null,null,null,null,null,null,null,null,null,null,null,null,null,null,null,null,null,145,42.7,14.8,15.5,0.68,1.0900000000000001,1.69,7.11,16.8,11.424000000000001,1710,260,232,6.33,677,133,87.3,3.98,15.2,31700,4.47,13.7,4.3122821254442778,null,"N","N",{"$f":"_xlfn.IFS($AE209<=$AX$5,\"C\",$AE209<=$AX$7,\"N\",TRUE,\"S\")","v":"C"},{"$f":"_xlfn.IFS($AF209<=$AY$5,\"C\",$AF209<=$AY$7,\"N\",TRUE,\"S\")","v":"C"},"F2",14.058160284254045,55.190098495855118,4.7822803926503904E-3,2.287020575392837E-5,3.6266480015160682E-3,9.1700209346361139E-2,7222.2428571428572,114.23885674074003,714.02048949785501,0.45979994081089087,4.7822803926503904E-3,2.287020575392837E-5,5.7198616181773493E-3,0.10247995906921382,6967.4158341106822,114.23885674074003,326.2651363164922]
["W14X132","14X132","14",null,null,null,null,null,null,null,null,null,null,null,null,null,null,null,null,null,null,null,null,132,38.799999999999997,14.7,14.7,0.64500000000000002,1.03,1.63,7.15,17.7,11.416499999999999,1530,234,209,6.28,548,113,74.5,3.76,12.3,25500,4.2300000000000004,13.7,4.081337894636758,null,"N","N",{"$f":"_xlfn.IFS($AE210<=$AX$5,\"C\",$AE210<=$AX$7,\"N\",TRUE,\"S\")","v":"C"},{"$f":"_xlfn.IFS($AF210<=$AY$5,\"C\",$AF210<=$AY$7,\"N\",TRUE,\"S\")","v":"C"},"F2",13.281076047435981,50.693445922302601,4.2957426745363746E-3,1.8453405125832927E-5,3.6266480015160682E-3,8.9007812443922266E-2,6834.471428571429,108.12079578581061,646.62646222204637,0.48633792351892213,4.2957426745363746E-3,1.8453405125832927E-5,5.3197759636100248E-3,9.8058750951388329E-2,6594.2759411916759,108.12079578581061,308.79200984794977]
["W14X120","14X120","14",null,null,null,null,null,null,null,null,null,null,null,null,null,null,null,null,null,null,null,null,120,35.299999999999997,14.5,14.7,0.59,0.94,1.54,7.8,19.3,11.387,1380,212,190,6.24,495,102,67.5,3.74,9.3699999999999992,22700,4.2,13.6,4.0813808685459678,null,"N","N",{"$f":"_xlfn.IFS($AE211<=$AX$5,\"C\",$AE211<=$AX$7,\"N\",TRUE,\"S\")","v":"C"},{"$f":"_xlfn.IFS($AF211<=$AY$5,\"C\",$AF211<=$AY$7,\"N\",TRUE,\"S\")","v":"C"},"F2",13.210432025907069,48.15991695203477,3.6261609907120738E-3,1.3149043530561968E-5,3.6266480015160682E-3,8.5163425202537169E-2,6786,108.1219342294734,605.15612512681616,0.48620133159646844,3.6261609907120738E-3,1.3149043530561968E-5,4.7953784738779485E-3,9.1768946079760674E-2,6594.3453747506992,108.1219342294734,308.79526123270114]
["W14X109","14X109","14",null,null,null,null,null,null,null,null,null,null,null,null,null,null,null,null,null,null,null,null,109,32,14.3,14.6,0.52500000000000002,0.86,1.46,8.49,21.7,11.3925,1240,192,173,6.22,447,92.7,61.2,3.73,7.12,20200,4.17,13.4,4.0566979311176086,null,"N","N",{"$f":"_xlfn.IFS($AE212<=$AX$5,\"C\",$AE212<=$AX$7,\"N\",TRUE,\"S\")","v":"C"},{"$f":"_xlfn.IFS($AF212<=$AY$5,\"C\",$AF212<=$AY$7,\"N\",TRUE,\"S\")","v":"C"},"F2",13.175110015142609,45.950668155850231,3.0713484600120781E-3,9.4331813628185647E-6,3.6266480015160682E-3,8.1841288244553848E-2,6737.528571428571,107.4680459933162,566.2019897747964,0.47635094775406184,3.0713484600120781E-3,9.4331813628185647E-6,4.3908760560950255E-3,8.6384168202901068E-2,6554.4648001343076,107.4680459933162,306.92776237467467]
["W14X99","14X99","14",null,null,null,null,null,null,null,null,null,null,null,null,null,null,null,null,null,null,null,null,99,29.1,14.2,14.6,0.48499999999999999,0.78,1.38,9.34,23.5,11.397499999999999,1110,173,157,6.17,402,83.6,55.2,3.71,5.37,18000,4.1399999999999997,13.4,4.0538653607957515,null,"N","N",{"$f":"_xlfn.IFS($AE213<=$AX$5,\"C\",$AE213<=$AX$7,\"N\",TRUE,\"S\")","v":"N"},{"$f":"_xlfn.IFS($AF213<=$AY$5,\"C\",$AF213<=$AY$7,\"N\",TRUE,\"S\")","v":"C"},"F3",13.104465993613696,43.817621771823305,2.5525240041829071E-3,6.5153787919299415E-6,3.6266480015160682E-3,7.8607709581815038E-2,6689.057142857142,107.3930069337664,532.01543512454407,0.48540459255356511,2.5525240041829071E-3,6.5153787919299415E-6,4.0449956698493487E-3,8.1225117260809512E-2,6549.8881757999925,107.3930069337664,306.71345150277375]
["W14X90","14X90","14",null,null,null,null,null,null,null,null,null,null,null,null,null,null,null,null,null,null,null,null,90,26.5,14,14.5,0.44,0.71,1.31,10.199999999999999,25.9,11.395999999999999,999,157,143,6.14,362,75.599999999999994,49.9,3.7,4.0599999999999996,16000,4.0999999999999996,13.3,4.0255867115999457,null,"N","N",{"$f":"_xlfn.IFS($AE214<=$AX$5,\"C\",$AE214<=$AX$7,\"N\",TRUE,\"S\")","v":"N"},{"$f":"_xlfn.IFS($AF214<=$AY$5,\"C\",$AF214<=$AY$7,\"N\",TRUE,\"S\")","v":"C"},"F3",13.069143982849239,41.901494066138682,2.1347073978652924E-3,4.5569756745008076E-6,3.6266480015160682E-3,7.5903592796265976E-2,6624.4285714285706,106.64386287029248,500.86180908084452,0.48705585235551241,2.1347073978652924E-3,4.5569756745008076E-6,3.7952057719800709E-3,7.7005929446019694E-2,6504.1979583136272,106.64386287029248,304.57390286789285]
["W14X82","14X82","14",null,null,null,null,null,null,null,null,null,null,null,null,null,null,null,null,null,null,null,null,82,24,14.3,10.1,0.51,0.85499999999999998,1.45,5.92,22.4,11.423999999999999,881,139,123,6.05,148,44.8,29.3,2.48,5.07,6710,2.85,13.4,2.7643370673669212,null,"N","N",{"$f":"_xlfn.IFS($AE215<=$AX$5,\"C\",$AE215<=$AX$7,\"N\",TRUE,\"S\")","v":"C"},{"$f":"_xlfn.IFS($AF215<=$AY$5,\"C\",$AF215<=$AY$7,\"N\",TRUE,\"S\")","v":"C"},"F2",8.7598586695854355,31.416230453214599,3.0760829996359664E-3,9.4622866206494051E-6,3.6266480015160682E-3,8.1870208263763664E-2,4604.7857142857147,73.231457737592251,386.03241392965771,0.6746847316310578,3.0760829996359664E-3,9.4622866206494051E-6,4.3941890944541118E-3,8.6430735818284449E-2,4466.3788902742681,73.231457737592251,209.14837755803856]
["W14X74","14X74","14",null,null,null,null,null,null,null,null,null,null,null,null,null,null,null,null,null,null,null,null,74,21.8,14.2,10.1,0.45,0.78500000000000003,1.38,6.41,25.4,11.43,795,126,112,6.04,134,40.5,26.6,2.48,3.87,5990,2.83,13.4,2.7697262397005473,null,"N","N",{"$f":"_xlfn.IFS($AE216<=$AX$5,\"C\",$AE216<=$AX$7,\"N\",TRUE,\"S\")","v":"C"},{"$f":"_xlfn.IFS($AF216<=$AY$5,\"C\",$AF216<=$AY$7,\"N\",TRUE,\"S\")","v":"C"},"F2",8.7598586695854355,30.015818568427935,2.5786247334754799E-3,6.6493055160914898E-6,3.6266480015160682E-3,7.8773553525225387E-2,4572.471428571429,73.374225039977148,364.6616312554014,0.64873557419436223,2.5786247334754799E-3,6.6493055160914898E-6,4.0615165509033111E-3,8.1487062067415281E-2,4475.086253001884,73.374225039977148,209.55611967576525]
["W14X68","14X68","14",null,null,null,null,null,null,null,null,null,null,null,null,null,null,null,null,null,null,null,null,68,20,14,10,0.41499999999999998,0.72,1.31,6.97,27.5,11.4125,722,115,103,6.01,121,36.9,24.2,2.46,3.01,5380,2.8,13.3,2.7404349976040701,null,"N","N",{"$f":"_xlfn.IFS($AE217<=$AX$5,\"C\",$AE217<=$AX$7,\"N\",TRUE,\"S\")","v":"C"},{"$f":"_xlfn.IFS($AF217<=$AY$5,\"C\",$AF217<=$AY$7,\"N\",TRUE,\"S\")","v":"C"},"F2",8.689214648056522,28.770531340831056,2.1972406745017882E-3,4.8278665816850732E-6,3.6266480015160682E-3,7.631440673960492E-2,4524,72.598255863500071,343.77126083261703,0.65780381944444444,2.1972406745017882E-3,4.8278665816850732E-6,3.8307280977452722E-3,7.7639994669287948E-2,4427.7599747002896,72.598255863500071,207.33995876201197]
["W14X61","14X61","14",null,null,null,null,null,null,null,null,null,null,null,null,null,null,null,null,null,null,null,null,61,17.899999999999999,13.9,10,0.375,0.64500000000000002,1.24,7.75,30.4,11.399999999999999,640,102,92.1,5.98,107,32.799999999999997,21.5,2.4500000000000002,2.19,4710,2.78,13.3,2.7394092432028483,null,"N","N",{"$f":"_xlfn.IFS($AE218<=$AX$5,\"C\",$AE218<=$AX$7,\"N\",TRUE,\"S\")","v":"C"},{"$f":"_xlfn.IFS($AF218<=$AY$5,\"C\",$AF218<=$AY$7,\"N\",TRUE,\"S\")","v":"C"},"F2",8.6538926372920635,27.542762995018538,1.7878572653131199E-3,3.1964336011329078E-6,3.6266480015160682E-3,7.3583321933908291E-2,4491.6857142857134,72.571082082498847,325.23190330348422,0.66279069767441845,1.7878572653131199E-3,3.1964336011329078E-6,3.6115155791305881E-3,7.348042490652669E-2,4426.1026486606015,72.571082082498847,207.26235069050682]
["W14X53","14X53","14",null,null,null,null,null,null,null,null,null,null,null,null,null,null,null,null,null,null,null,null,53,15.6,13.9,8.06,0.37,0.66,1.25,6.11,30.9,11.433,541,87.1,77.8,5.89,57.7,22,14.3,1.92,1.94,2540,2.2200000000000002,13.2,2.1863442124350474,null,"N","N",{"$f":"_xlfn.IFS($AE219<=$AX$5,\"C\",$AE219<=$AX$7,\"N\",TRUE,\"S\")","v":"C"},{"$f":"_xlfn.IFS($AF219<=$AY$5,\"C\",$AF219<=$AY$7,\"N\",TRUE,\"S\")","v":"C"},"F2",6.781826066775821,22.19920113889421,1.8890706551374936E-3,3.5685879401015994E-6,3.6266480015160682E-3,7.4267884422902219E-2,3586.8857142857146,57.91955535482991,263.20730675708705,0.79521204601849749,1.8890706551374936E-3,3.5685879401015994E-6,3.6626764963987248E-3,7.451004731937981E-2,3532.5075775200548,57.91955535482991,165.41772355198191]
["W14X48","14X48","14",null,null,null,null,null,null,null,null,null,null,null,null,null,null,null,null,null,null,null,null,48,14.1,13.8,8.0299999999999994,0.34,0.59499999999999997,1.19,6.75,33.6,11.424000000000001,484,78.400000000000006,70.2,5.85,51.4,19.600000000000001,12.8,1.91,1.45,2240,2.2000000000000002,13.2,2.1753688277654502,null,"N","N",{"$f":"_xlfn.IFS($AE220<=$AX$5,\"C\",$AE220<=$AX$7,\"N\",TRUE,\"S\")","v":"C"},{"$f":"_xlfn.IFS($AF220<=$AY$5,\"C\",$AF220<=$AY$7,\"N\",TRUE,\"S\")","v":"C"},"F2",6.7465040560113634,21.342730023430786,1.5647932314598982E-3,2.4485778572227106E-6,3.6266480015160682E-3,7.2051656698343625E-2,3554.5714285714284,57.628800863247235,250.2964389055069,0.8129514321295146,1.5647932314598982E-3,2.4485778572227106E-6,3.5064496338023661E-3,7.1212659445229712E-2,3514.7744917181772,57.628800863247235,164.58733136724442]
["W14X43","14X43","14",null,null,null,null,null,null,null,null,null,null,null,null,null,null,null,null,null,null,null,null,43,12.6,13.7,8,0.30499999999999999,0.53,1.1200000000000001,7.54,37.4,11.407,428,69.599999999999994,62.6,5.82,45.2,17.3,11.3,1.89,1.05,1950,2.1800000000000002,13.2,2.1660339936218982,null,"N","S",{"$f":"_xlfn.IFS($AE221<=$AX$5,\"C\",$AE221<=$AX$7,\"N\",TRUE,\"S\")","v":"C"},{"$f":"_xlfn.IFS($AF221<=$AY$5,\"C\",$AF221<=$AY$7,\"N\",TRUE,\"S\")","v":"C"},"F2",6.6758600344824481,20.540926873147452,1.270694162067964E-3,1.6146636535136051E-6,3.6266480015160682E-3,6.9981012879094806E-2,3522.2571428571432,57.38150702917001,238.80480651993332,0.82055070754716974,1.270694162067964E-3,1.6146636535136051E-6,3.3854504620040807E-3,6.8235948180354652E-2,3499.692066837667,57.38150702917001,163.88106242524563]
["W14X38","14X38","14",null,null,null,null,null,null,null,null,null,null,null,null,null,null,null,null,null,null,null,null,38,11.2,14.1,6.77,0.31,0.51500000000000001,0.91500000000000004,6.57,39.6,12.276,385,61.5,54.6,5.87,26.7,12.1,7.88,1.55,0.79800000000000004,1230,1.82,13.6,1.7976481789399077,null,"N","S",{"$f":"_xlfn.IFS($AE222<=$AX$5,\"C\",$AE222<=$AX$7,\"N\",TRUE,\"S\")","v":"C"},{"$f":"_xlfn.IFS($AF222<=$AY$5,\"C\",$AF222<=$AY$7,\"N\",TRUE,\"S\")","v":"C"},"F2",5.4749116684908978,16.802120242121763,1.074660633484163E-3,1.1548954771605826E-6,3.6266480015160682E-3,6.8566089541406916E-2,2940.6,47.622411245417005,192.47588637600899,1.0914973254363196,1.074660633484163E-3,1.1548954771605826E-6,3.3168519192648049E-3,6.6268488384366886E-2,2904.4858434014791,47.622411245417005,136.00917358589962]
["W14X34","14X34","14",null,null,null,null,null,null,null,null,null,null,null,null,null,null,null,null,null,null,null,null,34,10,14,6.75,0.28499999999999998,0.45500000000000002,0.85499999999999998,7.41,43.1,12.2835,340,54.6,48.6,5.83,23.3,10.6,6.91,1.53,0.56899999999999995,1070,1.8,13.5,1.786256830187448,null,"N","S",{"$f":"_xlfn.IFS($AE223<=$AX$5,\"C\",$AE223<=$AX$7,\"N\",TRUE,\"S\")","v":"C"},{"$f":"_xlfn.IFS($AF223<=$AY$5,\"C\",$AF223<=$AY$7,\"N\",TRUE,\"S\")","v":"C"},"F2",5.4042676469619826,16.246777347424899,8.6724584666971491E-4,7.5211535856587061E-7,3.6266480015160682E-3,6.7036511306792987E-2,2908.2857142857142,47.32063723797495,185.31277473695286,1.1398608058608057,8.6724584666971491E-4,7.5211535856587061E-7,3.2555685426259892E-3,6.4209145682649474E-2,2886.0806784885767,47.32063723797495,135.14730976404519]
["W14X30","14X30","14",null,null,null,null,null,null,null,null,null,null,null,null,null,null,null,null,null,null,null,null,30,8.85,13.8,6.73,0.27,0.38500000000000001,0.78500000000000003,8.74,45.4,12.258000000000001,291,47.3,42,5.73,19.600000000000001,8.99,5.82,1.49,0.38,887,1.77,13.4,1.7640611644577435,null,"N","S",{"$f":"_xlfn.IFS($AE224<=$AX$5,\"C\",$AE224<=$AX$7,\"N\",TRUE,\"S\")","v":"C"},{"$f":"_xlfn.IFS($AF224<=$AY$5,\"C\",$AF224<=$AY$7,\"N\",TRUE,\"S\")","v":"C"},"F2",5.2629796039041521,15.63089645815044,6.7519545131485427E-4,4.5588889747626975E-7,3.6266480015160682E-3,6.5588439932894593E-2,2859.8142857142857,46.732640580103258,177.65224919350553,1.277343162038556,6.7519545131485427E-4,4.5588889747626975E-7,3.2097507807688601E-3,6.2329336849381883E-2,2850.2188242881539,46.732640580103258,133.46799665458778]
["W14X26","14X26","14",null,null,null,null,null,null,null,null,null,null,null,null,null,null,null,null,null,null,null,null,26,7.69,13.9,5.03,0.255,0.42,0.82,5.98,48.1,12.265500000000001,245,40.200000000000003,35.299999999999997,5.65,8.91,5.54,3.55,1.08,0.35799999999999998,405,1.3,13.5,1.3004321514845913,null,"N","S",{"$f":"_xlfn.IFS($AE225<=$AX$5,\"C\",$AE225<=$AX$7,\"N\",TRUE,\"S\")","v":"C"},{"$f":"_xlfn.IFS($AF225<=$AY$5,\"C\",$AF225<=$AY$7,\"N\",TRUE,\"S\")","v":"C"},"F2",3.8147771625613998,11.581335381957409,7.5123281922148785E-4,5.6435074867546463E-7,3.6266480015160682E-3,6.6165556150746263E-2,2100.4285714285716,34.450408839888922,132.51823656845349,1.480499147969327,7.5123281922148785E-4,5.6435074867546463E-7,3.2266022261576502E-3,6.3070080429464631E-2,2101.1268047558183,34.450408839888922,98.390054461187844]
["W14X22","14X22","14",null,null,null,null,null,null,null,null,null,null,null,null,null,null,null,null,null,null,null,null,22,6.49,13.7,5,0.23,0.33500000000000002,0.73499999999999999,7.46,53.3,12.259,199,33.200000000000003,29,5.54,7,4.3899999999999997,2.8,1.04,0.20799999999999999,314,1.27,13.4,1.275499797431078,null,"N","S",{"$f":"_xlfn.IFS($AE226<=$AX$5,\"C\",$AE226<=$AX$7,\"N\",TRUE,\"S\")","v":"C"},{"$f":"_xlfn.IFS($AF226<=$AY$5,\"C\",$AF226<=$AY$7,\"N\",TRUE,\"S\")","v":"C"},"F2",3.6734891195035697,11.031460250370159,5.3525476067936171E-4,2.8649765882992077E-7,3.6266480015160682E-3,6.4512810837812906E-2,2051.957142857143,33.78991318119283,125.66935589023188,1.6833253731343283,5.3525476067936171E-4,2.8649765882992077E-7,3.1832544409770261E-3,6.0979580202362722E-2,2060.8432441350701,33.78991318119283,96.503684864457796]
["W12X336","12X336","12",null,null,null,null,null,null,null,null,null,null,null,null,null,null,null,null,null,null,null,null,336,98.9,16.8,13.4,1.78,2.96,3.55,2.2599999999999998,5.47,9.7365999999999993,4060,603,483,6.41,1190,274,177,3.47,243,57000,4.13,13.8,3.7346487675411644,null,"N","N",{"$f":"_xlfn.IFS($AE227<=$AX$5,\"C\",$AE227<=$AX$7,\"N\",TRUE,\"S\")","v":"C"},{"$f":"_xlfn.IFS($AF227<=$AY$5,\"C\",$AF227<=$AY$7,\"N\",TRUE,\"S\")","v":"C"},"F2",12.25673773526672,111.33112404187307,3.6456926816095053E-2,1.3291075128741105E-3,3.6266480015160682E-3,0.20020882802117174,6672.9,98.93647797641745,1630.874051062048,0.43694907220653484,3.6456926816095053E-2,1.3291075128741105E-3,3.6591722070043117E-2,0.27027513553069987,6034.1253658415098,98.93647797641745,282.56168167812115]
["W12X305","12X305","12",null,null,null,null,null,null,null,null,null,null,null,null,null,null,null,null,null,null,null,null,305,89.5,16.3,13.2,1.63,2.71,3.3,2.4500000000000002,5.98,9.7474000000000007,3550,537,435,6.29,1050,244,159,3.42,185,48600,4.05,13.6,3.676850671498082,null,"N","N",{"$f":"_xlfn.IFS($AE228<=$AX$5,\"C\",$AE228<=$AX$7,\"N\",TRUE,\"S\")","v":"C"},{"$f":"_xlfn.IFS($AF228<=$AY$5,\"C\",$AF228<=$AY$7,\"N\",TRUE,\"S\")","v":"C"},"F2",12.080127681444431,101.86786979740549,3.12711291413117E-2,9.7788351777259382E-4,3.6266480015160682E-3,0.1868094674871372,6543.642857142856,97.40531924846826,1487.5511721409462,0.4441535838085654,3.12711291413117E-2,9.7788351777259382E-4,3.1428174126884367E-2,0.25039828926771057,5940.7401563776148,97.40531924846826,278.18870627072306]
["W12X279","12X279","12",null,null,null,null,null,null,null,null,null,null,null,null,null,null,null,null,null,null,null,null,279,81.900000000000006,15.9,13.1,1.53,2.4700000000000002,3.07,2.66,6.35,9.7155000000000005,3110,481,393,6.16,937,220,143,3.38,143,42000,4,13.4,3.6446875442091691,null,"N","N",{"$f":"_xlfn.IFS($AE229<=$AX$5,\"C\",$AE229<=$AX$7,\"N\",TRUE,\"S\")","v":"C"},{"$f":"_xlfn.IFS($AF229<=$AY$5,\"C\",$AF229<=$AY$7,\"N\",TRUE,\"S\")","v":"C"},"F2",11.938839638386602,94.489671635197695,2.7154304811818769E-2,7.3735626981316399E-4,3.6266480015160682E-3,0.17544501364625567,6462.8571428571431,96.553269502230052,1374.6133230003054,0.45939719380659522,2.7154304811818769E-2,7.3735626981316399E-4,2.7335011999088898E-2,0.23342946860006272,5888.7737321436716,96.553269502230052,275.75525994137354]
["W12X252","12X252","12",null,null,null,null,null,null,null,null,null,null,null,null,null,null,null,null,null,null,null,null,252,74.099999999999994,15.4,13,1.4,2.25,2.85,2.89,6.96,9.7439999999999998,2720,428,353,6.06,828,196,127,3.34,108,35800,3.93,13.2,3.6149122576504871,null,"N","N",{"$f":"_xlfn.IFS($AE230<=$AX$5,\"C\",$AE230<=$AX$7,\"N\",TRUE,\"S\")","v":"C"},{"$f":"_xlfn.IFS($AF230<=$AY$5,\"C\",$AF230<=$AY$7,\"N\",TRUE,\"S\")","v":"C"},"F2",11.797551595328772,86.63244278942085,2.3177955189286635E-2,5.3721760675657921E-4,3.6266480015160682E-3,0.16372111406536025,6349.7571428571428,95.764477257974633,1260.3847221056435,0.46637948717948713,2.3177955189286635E-2,5.3721760675657921E-4,2.3389403967047754E-2,0.21579471531141442,5840.665376289573,95.764477257974633,273.50247646261863]
["W12X230","12X230","12",null,null,null,null,null,null,null,null,null,null,null,null,null,null,null,null,null,null,null,null,230,67.7,15.1,12.9,1.29,2.0699999999999998,2.67,3.11,7.56,9.7523999999999997,2420,386,321,5.97,742,177,115,3.31,83.8,31200,3.87,13,3.5857882155115708,null,"N","N",{"$f":"_xlfn.IFS($AE231<=$AX$5,\"C\",$AE231<=$AX$7,\"N\",TRUE,\"S\")","v":"C"},{"$f":"_xlfn.IFS($AF231<=$AY$5,\"C\",$AF231<=$AY$7,\"N\",TRUE,\"S\")","v":"C"},"F2",11.691585563035401,80.23112471101274,2.0081476156242509E-2,4.0326568461373645E-4,3.6266480015160682E-3,0.15397442696031891,6252.8142857142857,94.992937460523152,1164.5967426791215,0.47113043478260869,2.0081476156242509E-2,4.0326568461373645E-4,2.0325164102434855E-2,0.201014030004568,5793.6092453479805,94.992937460523152,271.29896581509536]
["W12X210","12X210","12",null,null,null,null,null,null,null,null,null,null,null,null,null,null,null,null,null,null,null,null,210,61.8,14.7,12.8,1.18,1.9,2.5,3.37,8.23,9.7113999999999994,2140,348,292,5.89,664,159,104,3.28,64.7,27200,3.81,12.8,3.5579737755359084,null,"N","N",{"$f":"_xlfn.IFS($AE232<=$AX$5,\"C\",$AE232<=$AX$7,\"N\",TRUE,\"S\")","v":"C"},{"$f":"_xlfn.IFS($AF232<=$AY$5,\"C\",$AF232<=$AY$7,\"N\",TRUE,\"S\")","v":"C"},"F2",11.585619530742028,74.228010360629,1.7310573630136987E-2,2.99655959404394E-4,3.6266480015160682E-3,0.14469699938717823,6155.8714285714286,94.256090999352381,1073.9901448962714,0.47119457236842099,1.7310573630136987E-2,2.99655959404394E-4,1.7592685144160458E-2,0.18682413862854405,5748.6690573301603,94.256090999352381,269.19453902059581]
["W12X190","12X190","12",null,null,null,null,null,null,null,null,null,null,null,null,null,null,null,null,null,null,null,null,190,56,14.4,12.7,1.06,1.74,2.33,3.65,9.16,9.7096,1890,311,263,5.82,589,143,93,3.25,48.8,23600,3.77,12.7,3.5316627077155491,null,"N","N",{"$f":"_xlfn.IFS($AE233<=$AX$5,\"C\",$AE233<=$AX$7,\"N\",TRUE,\"S\")","v":"C"},{"$f":"_xlfn.IFS($AF233<=$AY$5,\"C\",$AF233<=$AY$7,\"N\",TRUE,\"S\")","v":"C"},"F2",11.479653498448656,68.549017933281917,1.4610341007754258E-2,2.1346206436286571E-4,3.6266480015160682E-3,0.13504439643787641,6091.2428571428572,93.559071133771056,980.95903038607867,0.46575147072133233,1.4610341007754258E-2,2.1346206436286571E-4,1.4943516170568282E-2,0.17191235318708933,5706.1578891804093,93.559071133771056,267.20385662103979]
["W12X170","12X170","12",null,null,null,null,null,null,null,null,null,null,null,null,null,null,null,null,null,null,null,null,170,50,14,12.6,0.96,1.56,2.16,4.03,10.1,9.6959999999999997,1650,275,235,5.74,517,126,82.3,3.22,35.6,20100,3.7,12.4,3.5017423574948379,null,"N","N",{"$f":"_xlfn.IFS($AE234<=$AX$5,\"C\",$AE234<=$AX$7,\"N\",TRUE,\"S\")","v":"C"},{"$f":"_xlfn.IFS($AF234<=$AY$5,\"C\",$AF234<=$AY$7,\"N\",TRUE,\"S\")","v":"C"},"F2",11.373687466155284,62.706281209279716,1.2216884008236102E-2,1.49252254870695E-4,3.6266480015160682E-3,0.12587109282814768,5978.1428571428569,92.766435934341828,891.53818064104667,0.47355311355311352,1.2216884008236102E-2,1.49252254870695E-4,1.2613439897500802E-2,0.15757640656436137,5657.81515189523,92.766435934341828,264.94009769724448]
["W12X152","12X152","12",null,null,null,null,null,null,null,null,null,null,null,null,null,null,null,null,null,null,null,null,152,44.7,13.7,12.5,0.87,1.4,2,4.46,11.2,9.7439999999999998,1430,243,209,5.66,454,111,72.8,3.19,25.8,17200,3.66,12.3,3.471039699016643,null,"N","N",{"$f":"_xlfn.IFS($AE235<=$AX$5,\"C\",$AE235<=$AX$7,\"N\",TRUE,\"S\")","v":"C"},{"$f":"_xlfn.IFS($AF235<=$AY$5,\"C\",$AF235<=$AY$7,\"N\",TRUE,\"S\")","v":"C"},"F2",11.26772143386191,57.601614434136188,1.003617691679309E-2,1.0072484710517045E-4,3.6266480015160682E-3,0.1168880871530934,5913.5142857142855,91.953076209393629,803.98070562973567,0.48441600000000001,1.003617691679309E-2,1.0072484710517045E-4,1.0515296395363305E-2,0.1433578505424673,5608.208427982604,91.953076209393629,262.61714971697177]
["W12X136","12X136","12",null,null,null,null,null,null,null,null,null,null,null,null,null,null,null,null,null,null,null,null,136,39.9,13.4,12.4,0.79,1.25,1.85,4.96,12.3,9.7170000000000005,1240,214,186,5.58,398,98,64.2,3.16,18.5,14700,3.61,12.2,3.4403975752723843,null,"N","N",{"$f":"_xlfn.IFS($AE236<=$AX$5,\"C\",$AE236<=$AX$7,\"N\",TRUE,\"S\")","v":"C"},{"$f":"_xlfn.IFS($AF236<=$AY$5,\"C\",$AF236<=$AY$7,\"N\",TRUE,\"S\")","v":"C"},"F2",11.16175540156854,52.753378567427383,8.1526529173276928E-3,6.6465749590411736E-5,3.6266480015160682E-3,0.10853248784969301,5832.7285714285708,91.141320140838232,722.38176864685715,0.49525354838709684,8.1526529173276928E-3,6.6465749590411736E-5,8.7356946356647435E-3,0.12995517516818034,5558.699510904381,91.141320140838232,260.29878176477814]
["W12X120","12X120","12",null,null,null,null,null,null,null,null,null,null,null,null,null,null,null,null,null,null,null,null,120,35.200000000000003,13.1,12.3,0.71,1.1100000000000001,1.7,5.57,13.7,9.7269999999999985,1070,186,163,5.51,345,85.4,56,3.13,12.9,12400,3.56,12,3.4098759492889341,null,"N","N",{"$f":"_xlfn.IFS($AE237<=$AX$5,\"C\",$AE237<=$AX$7,\"N\",TRUE,\"S\")","v":"C"},{"$f":"_xlfn.IFS($AF237<=$AY$5,\"C\",$AF237<=$AY$7,\"N\",TRUE,\"S\")","v":"C"},"F2",11.055789369275166,48.461375017218593,6.5950920245398774E-3,4.3495238812149502E-5,3.6266480015160682E-3,0.1011026212620422,5751.9428571428571,90.332756239686105,649.51522732639478,0.50583534754266446,6.5950920245398774E-3,4.3495238812149502E-5,7.3035505057006036E-3,0.1178925041308415,5509.3852837796921,90.332756239686105,257.98953061366859]
["W12X106","12X106","12",null,null,null,null,null,null,null,null,null,null,null,null,null,null,null,null,null,null,null,null,106,31.2,12.9,12.2,0.61,0.99,1.59,6.17,15.9,9.6989999999999998,933,164,145,5.47,301,75.099999999999994,49.3,3.11,9.1300000000000008,10700,3.52,11.9,3.3863165566880751,null,"N","N",{"$f":"_xlfn.IFS($AE238<=$AX$5,\"C\",$AE238<=$AX$7,\"N\",TRUE,\"S\")","v":"C"},{"$f":"_xlfn.IFS($AF238<=$AY$5,\"C\",$AF238<=$AY$7,\"N\",TRUE,\"S\")","v":"C"},"F2",10.985145347746252,44.756539547413389,5.2912199362503626E-3,2.7997008413773292E-5,3.6266480015160682E-3,9.4434463718318595E-2,5687.3142857142857,89.708632400397377,585.27620443782882,0.48984848484848487,5.2912199362503626E-3,2.7997008413773292E-5,6.1517168002878132E-3,0.10697166324096384,5471.3200365917328,89.708632400397377,256.20703860251308]
["W12X96","12X96","12",null,null,null,null,null,null,null,null,null,null,null,null,null,null,null,null,null,null,null,null,96,28.2,12.7,12.2,0.55000000000000004,0.9,1.5,6.76,17.7,9.7350000000000012,833,147,131,5.44,270,67.5,44.4,3.09,6.85,9410,3.49,11.8,3.386893767136065,null,"N","N",{"$f":"_xlfn.IFS($AE239<=$AX$5,\"C\",$AE239<=$AX$7,\"N\",TRUE,\"S\")","v":"C"},{"$f":"_xlfn.IFS($AF239<=$AY$5,\"C\",$AF239<=$AY$7,\"N\",TRUE,\"S\")","v":"C"},"F2",10.914501326217335,42.181561989019549,4.4313624013455812E-3,1.9636972732059275E-5,3.6266480015160682E-3,8.9766421354878848E-2,5638.8428571428567,89.723923575640342,543.41538616076457,0.48763661202185804,4.4313624013455812E-3,1.9636972732059275E-5,5.4298788116521821E-3,9.9303782470748628E-2,5472.2526437584138,89.723923575640342,256.25071005999627]
["W12X87","12X87","12",null,null,null,null,null,null,null,null,null,null,null,null,null,null,null,null,null,null,null,null,87,25.6,12.5,12.1,0.51500000000000001,0.81,1.41,7.48,18.899999999999999,9.7334999999999994,740,132,118,5.38,241,60.4,39.700000000000003,3.07,5.0999999999999996,8270,3.46,11.7,3.3529834655078052,null,"N","N",{"$f":"_xlfn.IFS($AE240<=$AX$5,\"C\",$AE240<=$AX$7,\"N\",TRUE,\"S\")","v":"C"},{"$f":"_xlfn.IFS($AF240<=$AY$5,\"C\",$AF240<=$AY$7,\"N\",TRUE,\"S\")","v":"C"},"F2",10.843857304688422,39.859839597567792,3.6940460669274227E-3,1.364597634458196E-5,3.6266480015160682E-3,8.5561054624422969E-2,5590.3714285714286,88.825588546285786,500.66744647624245,0.51145316804407703,3.6940460669274227E-3,1.364597634458196E-5,4.8469152583629927E-3,9.2417321565226154E-2,5417.463284984754,88.825588546285786,253.68507338284175]
["W12X79","12X79","12",null,null,null,null,null,null,null,null,null,null,null,null,null,null,null,null,null,null,null,null,79,23.2,12.4,12.1,0.47,0.73499999999999999,1.33,8.2200000000000006,20.7,9.7289999999999992,662,119,107,5.34,216,54.3,35.799999999999997,3.05,3.84,7330,3.43,11.7,3.3522882630429107,null,"N","N",{"$f":"_xlfn.IFS($AE241<=$AX$5,\"C\",$AE241<=$AX$7,\"N\",TRUE,\"S\")","v":"C"},{"$f":"_xlfn.IFS($AF241<=$AY$5,\"C\",$AF241<=$AY$7,\"N\",TRUE,\"S\")","v":"C"},"F2",10.773213283159507,37.785034871470287,3.0673376467768992E-3,9.4085602393348451E-6,3.6266480015160682E-3,8.1816780970000086E-2,5541.9,88.807171584574434,467.67231577667224,0.51415415753078086,3.0673376467768992E-3,9.4085602393348451E-6,4.3880714917267334E-3,8.6344711120621823E-2,5416.3400364307599,88.807171584574434,253.63247470762104]
["W12X72","12X72","12",null,null,null,null,null,null,null,null,null,null,null,null,null,null,null,null,null,null,null,null,72,21.1,12.3,12,0.43,0.67,1.27,8.99,22.6,9.718,597,108,97.4,5.31,195,49.2,32.4,3.04,2.93,6540,3.41,11.6,3.3231579500690591,null,"N","N",{"$f":"_xlfn.IFS($AE242<=$AX$5,\"C\",$AE242<=$AX$7,\"N\",TRUE,\"S\")","v":"C"},{"$f":"_xlfn.IFS($AF242<=$AY$5,\"C\",$AF242<=$AY$7,\"N\",TRUE,\"S\")","v":"C"},"F2",10.737891272395052,36.210176361427038,2.5932875451391349E-3,6.7251402917737603E-6,3.6266480015160682E-3,7.8866567990848971E-2,5509.5857142857139,88.03546566324863,438.31592684553277,0.51974378109452735,2.5932875451391349E-3,6.7251402917737603E-6,4.0708416167843965E-3,8.1634117634255904E-2,5369.2737736115796,88.03546566324863,251.42848961182295]
["W12X65","12X65","12",null,null,null,null,null,null,null,null,null,null,null,null,null,null,null,null,null,null,null,null,65,19.100000000000001,12.1,12,0.39,0.60499999999999998,1.2,9.92,24.9,9.7110000000000003,533,96.8,87.9,5.28,174,44.1,29.1,3.02,2.1800000000000002,5780,3.38,11.5,3.3226683553677749,null,"N","N",{"$f":"_xlfn.IFS($AE243<=$AX$5,\"C\",$AE243<=$AX$7,\"N\",TRUE,\"S\")","v":"N"},{"$f":"_xlfn.IFS($AF243<=$AY$5,\"C\",$AF243<=$AY$7,\"N\",TRUE,\"S\")","v":"C"},"F3",10.667247250866135,34.608753721923144,2.1566008804471486E-3,4.6509273575454162E-6,3.6266480015160682E-3,7.6047675059552067E-2,5461.114285714285,88.022495561266894,414.59719212795676,0.52166528925619837,2.1566008804471486E-3,4.6509273575454162E-6,3.8075633329881006E-3,7.7228001485440817E-2,5368.4827284585044,88.022495561266894,251.39144711847314]
["W12X58","12X58","12",null,null,null,null,null,null,null,null,null,null,null,null,null,null,null,null,null,null,null,null,58,17,12.2,10,0.36,0.64,1.24,7.82,27,9.7199999999999989,475,86.4,78,5.28,107,32.5,21.4,2.5099999999999998,2.1,3570,2.81,11.6,2.763580526170121,null,"N","N",{"$f":"_xlfn.IFS($AE244<=$AX$5,\"C\",$AE244<=$AX$7,\"N\",TRUE,\"S\")","v":"C"},{"$f":"_xlfn.IFS($AF244<=$AY$5,\"C\",$AF244<=$AY$7,\"N\",TRUE,\"S\")","v":"C"},"F2",8.8658247018788057,29.178342738982337,2.3209549071618041E-3,5.3868316810784588E-6,3.6266480015160682E-3,7.7120703502223525E-2,4540.1571428571433,73.211415820369396,352.26545714857798,0.54674999999999996,2.3209549071618041E-3,5.3868316810784588E-6,3.9030043374621679E-3,7.8892073395392337E-2,4465.1565358548669,73.211415820369396,209.09113802464935]
["W12X53","12X53","12",null,null,null,null,null,null,null,null,null,null,null,null,null,null,null,null,null,null,null,null,53,15.6,12.1,10,0.34499999999999997,0.57499999999999996,1.18,8.69,28.1,9.6944999999999997,425,77.900000000000006,70.599999999999994,5.23,95.8,29.1,19.2,2.48,1.58,3160,2.79,11.5,2.7562394883363299,null,"N","N",{"$f":"_xlfn.IFS($AE245<=$AX$5,\"C\",$AE245<=$AX$7,\"N\",TRUE,\"S\")","v":"C"},{"$f":"_xlfn.IFS($AF245<=$AY$5,\"C\",$AF245<=$AY$7,\"N\",TRUE,\"S\")","v":"C"},"F2",8.7598586695854355,28.042735289287474,1.9460524695159504E-3,3.7871202141091292E-6,3.6266480015160682E-3,7.4650522242192111E-2,4507.8428571428567,73.016940657328817,334.39596388141086,0.58166999999999991,1.9460524695159504E-3,3.7871202141091292E-6,3.6923883045095847E-3,7.5089551696794238E-2,4453.2955161548407,73.016940657328817,208.53571872696145]
["W12X50","12X50","12",null,null,null,null,null,null,null,null,null,null,null,null,null,null,null,null,null,null,null,null,50,14.6,12.2,8.08,0.37,0.64,1.1399999999999999,6.31,26.8,9.9160000000000004,391,71.900000000000006,64.2,5.18,56.3,21.3,13.9,1.96,1.71,1880,2.25,11.6,2.2057260622627197,null,"N","N",{"$f":"_xlfn.IFS($AE246<=$AX$5,\"C\",$AE246<=$AX$7,\"N\",TRUE,\"S\")","v":"C"},{"$f":"_xlfn.IFS($AF246<=$AY$5,\"C\",$AF246<=$AY$7,\"N\",TRUE,\"S\")","v":"C"},"F2",6.9231141098336506,23.314700858223073,2.2961650016113436E-3,5.2723737146248213E-6,3.6266480015160682E-3,7.6959814209283356E-2,3635.3571428571427,58.433009786016015,280.26424475354537,0.70949102722772284,2.2961650016113436E-3,5.2723737146248213E-6,3.8883138880232981E-3,7.8641457830044337E-2,3563.8231091701946,58.433009786016015,166.88414473968186]
["W12X45","12X45","12",null,null,null,null,null,null,null,null,null,null,null,null,null,null,null,null,null,null,null,null,45,13.1,12.1,8.0500000000000007,0.33500000000000002,0.57499999999999996,1.08,7,29.6,9.9160000000000004,348,64.2,57.7,5.15,50,19,12.4,1.95,1.26,1650,2.23,11.5,2.1962002360111827,null,"N","N",{"$f":"_xlfn.IFS($AE247<=$AX$5,\"C\",$AE247<=$AX$7,\"N\",TRUE,\"S\")","v":"C"},{"$f":"_xlfn.IFS($AF247<=$AY$5,\"C\",$AF247<=$AY$7,\"N\",TRUE,\"S\")","v":"C"},"F2",6.8877920990691939,22.319012012672932,1.8988772511491219E-3,3.6057348149316451E-6,3.6266480015160682E-3,7.4333876884400352E-2,3603.0428571428565,58.180656282968165,264.74778488479114,0.71765811504185806,1.8988772511491219E-3,3.6057348149316451E-6,3.6677439921703483E-3,7.4609793213220144E-2,3548.4320956123538,58.180656282968165,166.16342542909996]
["W12X40","12X40","12",null,null,null,null,null,null,null,null,null,null,null,null,null,null,null,null,null,null,null,null,40,11.7,11.9,8.01,0.29499999999999998,0.51500000000000001,1.02,7.77,33.6,9.911999999999999,307,57,51.5,5.13,44.1,16.8,11,1.94,0.90600000000000003,1440,2.21,11.4,2.1867243792644286,null,"N","N",{"$f":"_xlfn.IFS($AE248<=$AX$5,\"C\",$AE248<=$AX$7,\"N\",TRUE,\"S\")","v":"C"},{"$f":"_xlfn.IFS($AF248<=$AY$5,\"C\",$AF248<=$AY$7,\"N\",TRUE,\"S\")","v":"C"},"F2",6.8524700883047354,21.395063008966773,1.5431783341849771E-3,2.381399371097921E-6,3.6266480015160682E-3,7.190150440499174E-2,3570.7285714285713,57.929626547459684,250.82765192132482,0.70883240609432385,1.5431783341849771E-3,2.381399371097921E-6,3.496857238759964E-3,7.0993207935301395E-2,3533.1218184972408,57.929626547459684,165.44648678657623]
["W12X35","12X35","12",null,null,null,null,null,null,null,null,null,null,null,null,null,null,null,null,null,null,null,null,35,10.3,12.5,6.56,0.3,0.52,0.82,6.31,36.200000000000003,10.860000000000001,285,51.2,45.6,5.25,24.5,11.5,7.47,1.54,0.74099999999999999,879,1.79,12,1.7588851894229076,null,"N","S",{"$f":"_xlfn.IFS($AE249<=$AX$5,\"C\",$AE249<=$AX$7,\"N\",TRUE,\"S\")","v":"C"},{"$f":"_xlfn.IFS($AF249<=$AY$5,\"C\",$AF249<=$AY$7,\"N\",TRUE,\"S\")","v":"C"},"F2",5.4395896577264393,17.009303914756035,1.3541666666666665E-3,1.8337673611111106E-6,3.6266480015160682E-3,7.0574886951257201E-2,2892.1285714285714,46.595521195680483,196.31082344404334,0.95508911819887443,1.3541666666666665E-3,1.8337673611111106E-6,3.4176568783716643E-3,6.9078386960310031E-2,2841.8559274818695,46.595521195680483,133.07638493921621]
["W12X30","12X30","12",null,null,null,null,null,null,null,null,null,null,null,null,null,null,null,null,null,null,null,null,30,8.7899999999999991,12.3,6.52,0.26,0.44,0.74,7.41,41.8,10.868,238,43.1,38.6,5.21,20.3,9.56,6.24,1.52,0.45700000000000002,720,1.77,11.9,1.7444171442012315,null,"N","S",{"$f":"_xlfn.IFS($AE250<=$AX$5,\"C\",$AE250<=$AX$7,\"N\",TRUE,\"S\")","v":"C"},{"$f":"_xlfn.IFS($AF250<=$AY$5,\"C\",$AF250<=$AY$7,\"N\",TRUE,\"S\")","v":"C"},"F2",5.3689456361975259,16.201327038943699,9.9490573431445118E-4,9.8983742017177726E-7,3.6266480015160682E-3,6.7982010383854638E-2,2859.8142857142857,46.212240858884961,184.53578840879112,0.98496932515337432,9.9490573431445118E-4,9.8983742017177726E-7,3.2918761515801009E-3,6.5473520494124582E-2,2818.479700130847,46.212240858884961,131.9817397816949]
["W12X26","12X26","12",null,null,null,null,null,null,null,null,null,null,null,null,null,null,null,null,null,null,null,null,26,7.65,12.2,6.49,0.23,0.38,0.68,8.5399999999999991,47.2,10.856000000000002,204,37.200000000000003,33.4,5.17,17.3,8.17,5.34,1.51,0.3,607,1.75,11.8,1.7329862378251208,null,"N","S",{"$f":"_xlfn.IFS($AE251<=$AX$5,\"C\",$AE251<=$AX$7,\"N\",TRUE,\"S\")","v":"C"},{"$f":"_xlfn.IFS($AF251<=$AY$5,\"C\",$AF251<=$AY$7,\"N\",TRUE,\"S\")","v":"C"},"F2",5.3336236254330673,15.607977654960086,7.6118948543590784E-4,5.7940943273818215E-7,3.6266480015160682E-3,6.6240753973305408E-2,2827.5,45.909418910336591,176.86947882633672,1.0124401913875598,7.6118948543590784E-4,5.7940943273818215E-7,3.2289349033246583E-3,6.3167431392772075E-2,2800.0106214003026,45.909418910336591,131.11688304956758]
["W12X22","12X22","12",null,null,null,null,null,null,null,null,null,null,null,null,null,null,null,null,null,null,null,null,22,6.48,12.3,4.03,0.26,0.42499999999999999,0.72499999999999998,4.74,41.8,10.868,156,29.3,25.4,4.91,4.66,3.66,2.31,0.84799999999999998,0.29299999999999998,164,1.04,11.9,1.0303036909247245,null,"N","S",{"$f":"_xlfn.IFS($AE252<=$AX$5,\"C\",$AE252<=$AX$7,\"N\",TRUE,\"S\")","v":"C"},{"$f":"_xlfn.IFS($AF252<=$AY$5,\"C\",$AF252<=$AY$7,\"N\",TRUE,\"S\")","v":"C"},"F2",2.9953065128259877,9.4930821918471562,9.6936412360219674E-4,9.3966680412705499E-7,3.6266480015160682E-3,6.7793894453101494E-2,1680.3428571428572,27.294298546127486,108.56971783685411,1.6497912713472487,9.6936412360219674E-4,9.3966680412705499E-7,3.2842469428009053E-3,6.5219713786577607E-2,1664.6763920512335,27.294298546127486,77.952268517753296]
["W12X19","12X19","12",null,null,null,null,null,null,null,null,null,null,null,null,null,null,null,null,null,null,null,null,19,5.57,12.2,4.01,0.23499999999999999,0.35,0.65,5.72,46.2,10.856999999999999,130,24.7,21.3,4.82,3.76,2.98,1.88,0.82199999999999995,0.18,131,1.02,11.9,1.0141095358647925,null,"N","S",{"$f":"_xlfn.IFS($AE253<=$AX$5,\"C\",$AE253<=$AX$7,\"N\",TRUE,\"S\")","v":"C"},{"$f":"_xlfn.IFS($AF253<=$AY$5,\"C\",$AF253<=$AY$7,\"N\",TRUE,\"S\")","v":"C"},"F2",2.9034692848383981,9.0441498164328493,7.1014321221446312E-4,5.04303381854276E-7,3.6266480015160682E-3,6.58543181099807E-2,1648.0285714285715,26.865290956616327,102.684168001413,1.8178802992518706,7.1014321221446312E-4,5.04303381854276E-7,3.2172837237372017E-3,6.2669186495052445E-2,1638.5112643758289,26.865290956616327,76.727026742178438]
["W12X16","12X16","12",null,null,null,null,null,null,null,null,null,null,null,null,null,null,null,null,null,null,null,null,16,4.71,12,3.99,0.22,0.26500000000000001,0.56499999999999995,7.53,49.4,10.868,103,20.100000000000001,17.100000000000001,4.67,2.82,2.2599999999999998,1.41,0.77300000000000002,0.10299999999999999,96.9,0.98299999999999998,11.7,0.98159951795586897,null,"N","S",{"$f":"_xlfn.IFS($AE254<=$AX$5,\"C\",$AE254<=$AX$7,\"N\",TRUE,\"S\")","v":"C"},{"$f":"_xlfn.IFS($AF254<=$AY$5,\"C\",$AF254<=$AY$7,\"N\",TRUE,\"S\")","v":"C"},"F2",2.7303914320925577,8.5175360817468295,5.1481981306542707E-4,2.6503943992472125E-7,3.6266480015160682E-3,6.4354236959049516E-2,1588.247142857143,26.004051554717549,96.402569175547796,2.2612758310871519,5.1481981306542707E-4,2.6503943992472125E-7,3.1798821703161832E-3,6.0784060273904129E-2,1585.9843640115539,26.004051554717549,74.267334839804633]
["W12X14","12X14","12",null,null,null,null,null,null,null,null,null,null,null,null,null,null,null,null,null,null,null,null,14,4.16,11.9,3.97,0.2,0.22500000000000001,0.52500000000000002,8.82,54.3,10.86,88.6,17.399999999999999,14.9,4.62,2.36,1.9,1.19,0.753,7.0400000000000004E-2,80.400000000000006,0.96099999999999997,11.7,0.96676580580935678,null,"N","S",{"$f":"_xlfn.IFS($AE255<=$AX$5,\"C\",$AE255<=$AX$7,\"N\",TRUE,\"S\")","v":"C"},{"$f":"_xlfn.IFS($AF255<=$AY$5,\"C\",$AF255<=$AY$7,\"N\",TRUE,\"S\")","v":"C"},"F2",2.6597474105636425,8.2145746717925494,4.0383181322778644E-4,1.6308013337484179E-7,3.6266480015160682E-3,6.3486060003309822E-2,1552.7014285714286,25.611084149630578,93.298883274218326,2.431570109151973,4.0383181322778644E-4,1.6308013337484179E-7,3.1638096198325335E-3,5.9729736589577559E-2,1562.0173233862606,25.611084149630578,73.1450235033072]
["W10X112","10X112","10",null,null,null,null,null,null,null,null,null,null,null,null,null,null,null,null,null,null,null,null,112,32.9,11.4,10.4,0.755,1.25,1.75,4.17,10.4,7.8520000000000003,716,147,126,4.66,236,69.2,45.3,2.68,15.1,6020,3.08,10.199999999999999,2.8942491066479454,null,"N","N",{"$f":"_xlfn.IFS($AE256<=$AX$5,\"C\",$AE256<=$AX$7,\"N\",TRUE,\"S\")","v":"C"},{"$f":"_xlfn.IFS($AF256<=$AY$5,\"C\",$AF256<=$AY$7,\"N\",TRUE,\"S\")","v":"C"},"F2",9.4662988848745844,51.422452359161504,1.1749144102085281E-2,1.3804238713156533E-4,3.6266480015160682E-3,0.12399916170523634,4976.3999999999996,76.673023575029958,723.08811787237175,0.45601999999999998,1.1749144102085281E-2,1.3804238713156533E-4,1.2160962063452685E-2,0.15462893055808788,4676.2796280268949,76.673023575029958,218.97745830279854]
["W10X100","10X100","10",null,null,null,null,null,null,null,null,null,null,null,null,null,null,null,null,null,null,null,null,100,29.3,11.1,10.3,0.68,1.1200000000000001,1.62,4.62,11.6,7.8879999999999999,623,130,112,4.5999999999999996,207,61,40,2.65,10.9,5150,3.04,10,2.864436023997134,null,"N","N",{"$f":"_xlfn.IFS($AE257<=$AX$5,\"C\",$AE257<=$AX$7,\"N\",TRUE,\"S\")","v":"C"},{"$f":"_xlfn.IFS($AF257<=$AY$5,\"C\",$AF257<=$AY$7,\"N\",TRUE,\"S\")","v":"C"},"F2",9.3603328525812106,47.308641572535123,9.7321428571428576E-3,9.4714604591836747E-5,3.6266480015160682E-3,0.1155802355883519,4911.7714285714283,75.883230055294746,653.82046416924175,0.46496532593619971,9.7321428571428576E-3,9.4714604591836747E-5,1.0225517872900462E-2,0.14127158500577292,4628.1102044867976,75.883230055294746,216.72181519037582]
["W10X88","10X88","10",null,null,null,null,null,null,null,null,null,null,null,null,null,null,null,null,null,null,null,null,88,26,10.8,10.3,0.60499999999999998,0.99,1.49,5.18,13,7.8650000000000002,534,113,98.5,4.54,179,53.1,34.799999999999997,2.63,7.53,4330,2.99,9.81,2.8640651635318601,null,"N","N",{"$f":"_xlfn.IFS($AE258<=$AX$5,\"C\",$AE258<=$AX$7,\"N\",TRUE,\"S\")","v":"C"},{"$f":"_xlfn.IFS($AF258<=$AY$5,\"C\",$AF258<=$AY$7,\"N\",TRUE,\"S\")","v":"C"},"F2",9.2896888310522971,43.020531239302642,7.7927319579627124E-3,6.0726671368653367E-5,3.6266480015160682E-3,0.10686149895766379,4830.9857142857154,75.87340540228486,588.8682308088496,0.46663969795037752,7.7927319579627124E-3,6.0726671368653367E-5,8.4007905905232154E-3,0.1272537722367629,4627.5109999350489,75.87340540228486,216.6937560706946]
["W10X77","10X77","10",null,null,null,null,null,null,null,null,null,null,null,null,null,null,null,null,null,null,null,null,77,22.7,10.6,10.199999999999999,0.53,0.87,1.37,5.86,14.8,7.8440000000000012,455,97.6,85.9,4.49,154,45.9,30.1,2.6,5.1100000000000003,3630,2.95,9.73,2.8358545113459983,null,"N","N",{"$f":"_xlfn.IFS($AE259<=$AX$5,\"C\",$AE259<=$AX$7,\"N\",TRUE,\"S\")","v":"C"},{"$f":"_xlfn.IFS($AF259<=$AY$5,\"C\",$AF259<=$AY$7,\"N\",TRUE,\"S\")","v":"C"},"F2",9.1837227987589252,39.200892264554021,6.1138516427835608E-3,3.7379181909967242E-5,3.6266480015160682E-3,9.8693969645058E-2,4766.3571428571431,75.126062682148827,522.13817167418665,0.46848320937570453,6.1138516427835608E-3,3.7379181909967242E-5,6.8721025230374204E-3,0.11395593080582064,4581.9306461890346,75.126062682148827,214.55935205601082]
["W10X68","10X68","10",null,null,null,null,null,null,null,null,null,null,null,null,null,null,null,null,null,null,null,null,68,19.899999999999999,10.4,10.1,0.47,0.77,1.27,6.58,16.7,7.8489999999999993,394,85.3,75.7,4.4400000000000004,134,40.1,26.4,2.59,3.56,3100,2.92,9.6300000000000008,2.8067791768456631,null,"N","N",{"$f":"_xlfn.IFS($AE260<=$AX$5,\"C\",$AE260<=$AX$7,\"N\",TRUE,\"S\")","v":"C"},{"$f":"_xlfn.IFS($AF260<=$AY$5,\"C\",$AF260<=$AY$7,\"N\",TRUE,\"S\")","v":"C"},"F2",9.1484007879944667,36.268848098678419,4.883462210095872E-3,2.3848203157434458E-5,3.6266480015160682E-3,9.2250258599160251E-2,4717.8857142857141,74.355813223498046,468.84015989134843,0.47435129227208428,4.883462210095872E-3,2.3848203157434458E-5,5.8047234503122106E-3,0.10338368178976835,4534.9532128749206,74.355813223498046,212.35952660437204]
["W10X60","10X60","10",null,null,null,null,null,null,null,null,null,null,null,null,null,null,null,null,null,null,null,null,60,17.7,10.199999999999999,10.1,0.42,0.68,1.18,7.41,18.7,7.8539999999999992,341,74.599999999999994,66.7,4.3899999999999997,116,35,23,2.57,2.48,2640,2.88,9.52,2.8054912573544959,null,"N","N",{"$f":"_xlfn.IFS($AE261<=$AX$5,\"C\",$AE261<=$AX$7,\"N\",TRUE,\"S\")","v":"C"},{"$f":"_xlfn.IFS($AF261<=$AY$5,\"C\",$AF261<=$AY$7,\"N\",TRUE,\"S\")","v":"C"},"F2",9.0777567664655532,33.654132997834004,3.9056102201000336E-3,1.5253791191349833E-5,3.6266480015160682E-3,8.6788583475109801E-2,4653.2571428571428,74.321694293899981,428.00590049122542,0.48029702970297022,3.9056102201000336E-3,1.5253791191349833E-5,5.010030176408109E-3,9.4422668869864848E-2,4532.8723029541925,74.321694293899981,212.26208325161201]
["W10X54","10X54","10",null,null,null,null,null,null,null,null,null,null,null,null,null,null,null,null,null,null,null,null,54,15.8,10.1,10,0.37,0.61499999999999999,1.1200000000000001,8.15,21.2,7.8439999999999994,303,66.599999999999994,60,4.37,103,31.3,20.6,2.56,1.82,2320,2.85,9.49,2.7795122011173943,null,"N","N",{"$f":"_xlfn.IFS($AE262<=$AX$5,\"C\",$AE262<=$AX$7,\"N\",TRUE,\"S\")","v":"C"},{"$f":"_xlfn.IFS($AF262<=$AY$5,\"C\",$AF262<=$AY$7,\"N\",TRUE,\"S\")","v":"C"},"F2",9.0424347557010947,31.696820939007477,3.1963470319634705E-3,1.0216634348741687E-5,3.6266480015160682E-3,8.2601422708568031E-2,4604.7857142857147,73.633469915856978,393.44846833933883,0.47191544715447148,3.1963470319634705E-3,1.0216634348741687E-5,4.4792014384164199E-3,8.7610207569551457E-2,4490.8975706625324,73.633469915856978,210.29652068450642]
["W10X49","10X49","10",null,null,null,null,null,null,null,null,null,null,null,null,null,null,null,null,null,null,null,null,49,14.4,10,10,0.34,0.56000000000000005,1.06,8.93,23.1,7.854000000000001,272,60.4,54.6,4.3499999999999996,93.4,28.3,18.7,2.54,1.39,2070,2.84,9.44,2.7784531783485344,null,"N","N",{"$f":"_xlfn.IFS($AE263<=$AX$5,\"C\",$AE263<=$AX$7,\"N\",TRUE,\"S\")","v":"C"},{"$f":"_xlfn.IFS($AF263<=$AY$5,\"C\",$AF263<=$AY$7,\"N\",TRUE,\"S\")","v":"C"},"F2",8.9717907341721794,30.407375576349665,2.6968088408766376E-3,7.2727779242303938E-6,3.6266480015160682E-3,7.9520166262355779E-2,4588.6285714285705,73.60541480562587,371.12208697967191,0.47685000000000005,2.6968088408766376E-3,7.2727779242303938E-6,4.1375583502109587E-3,8.2670231589657445E-2,4489.1864924459887,73.60541480562587,210.21639554473288]
["W10X45","10X45","10",null,null,null,null,null,null,null,null,null,null,null,null,null,null,null,null,null,null,null,null,45,13.3,10.1,8.02,0.35,0.62,1.1200000000000001,6.47,22.5,7.8749999999999991,248,54.9,49.1,4.32,53.4,20.3,13.3,2.0099999999999998,1.51,1200,2.27,9.48,{"$f":"$AA264/(SQRT(12*(1+$BJ264/6)))","v":2.2151130118719329},null,{"$f":"IF($AE264<=$AV$7,\"N\",\"S\")","v":"N"},{"$f":"IF($AF264<=$AW$7,\"N\",\"S\")","v":"N"},{"$f":"_xlfn.IFS($AE264<=$AX$5,\"C\",$AE264<=$AX$7,\"N\",TRUE,\"S\")","v":"C"},{"$f":"_xlfn.IFS($AF264<=$AY$5,\"C\",$AF264<=$AY$7,\"N\",TRUE,\"S\")","v":"C"},"F2",7.0997241636559378,25.334334850083646,3.2440468517706909E-3,1.0523839976483332E-5,{"$f":"SQRT($BD$8+$BC$5)","v":3.6266480015160682E-3},8.2889654681912867E-2,3667.6714285714284,58.681684237372551,315.22368314306664,0.55430979004102643,3.2440468517706909E-3,1.0523839976483332E-5,4.5133636185946029E-3,8.8076162895333349E-2,{"$f":"1.95*$AT264*E/$BJ$5","v":3578.9897377530797},58.681684237372551,{"$f":"pi*$AT264*SQRT(E/Fy)","v":167.5943567120793}]
["W10X39",{"$f":"RIGHT(A265,LEN(A265)-1)","v":"10X39"},{"$f":"LEFT(B265,(FIND(\"X\",B265)-1))","v":"10"},null,null,null,null,null,null,null,null,null,null,null,null,null,null,null,null,null,null,null,null,39,11.5,9.92,7.99,0.315,0.53,1.03,7.53,25,{"$f":"+AF265*AB265","v":7.875},209,46.8,42.1,4.2699999999999996,45,17.2,11.3,1.98,0.97599999999999998,992,2.2400000000000002,9.39,2.201547181903309,null,"N","N",{"$f":"_xlfn.IFS($AE265<=$AX$5,\"C\",$AE265<=$AX$7,\"N\",TRUE,\"S\")","v":"C"},{"$f":"_xlfn.IFS($AF265<=$AY$5,\"C\",$AF265<=$AY$7,\"N\",TRUE,\"S\")","v":"C"},{"$f":"IF(AND(AX265=\"C\", AY265= \"C\"),\"F2\",\"F3\")","v":"F2"},{"$f":"1.76*AO265*sqrtefy/12","v":6.993758131362565},{"$f":"+$BG265*$BF265/12","v":23.547100507759733},{"$f":"+($AP265*$BD$5)/($AJ265*$AS265)","v":2.4688922111004022E-3},{"$f":"+$BC265^2","v":6.0954287500322334E-6},3.6266480015160682E-3,{"$f":"SQRT(($BC265+$BE265))","v":7.8073940675595921E-2},{"$f":"1.95*AR265*E/(0.7*Fy)","v":3619.2000000000003},{"$f":"1.1*AT265*SQRT(E/Fy)","v":58.322304943237157},{"$f":"$BO265*$BN265","v":285.93279042371427},{"$f":"(AG265*AB265)/(AA265*AC265)","v":0.58578529765981058},{"$f":"+($AP265)/($AJ265*$AS265)","v":2.4688922111004022E-3},{"$f":"+$BC265^2","v":6.0954287500322334E-6},{"$f":"SQRT($BL265+$BK$5)","v":3.992748417719588E-3},{"$f":"+SQRT($BK265+$BM265)","v":8.0384330741880228E-2},3557.0712324752035,{"$f":"+$BH265","v":58.322304943237157},166.56797271511309]
["W10X33","10X33","10",null,null,null,null,null,null,null,null,null,null,null,null,null,null,null,null,null,null,null,null,33,9.7100000000000009,9.73,7.96,0.28999999999999998,0.435,0.93500000000000005,9.15,27.1,7.859,171,38.799999999999997,35,4.1900000000000004,36.6,14,9.1999999999999993,1.94,0.58299999999999996,791,2.2000000000000002,9.3000000000000007,2.181320095829574,null,"N","N",{"$f":"_xlfn.IFS($AE266<=$AX$5,\"C\",$AE266<=$AX$7,\"N\",TRUE,\"S\")","v":"C"},{"$f":"_xlfn.IFS($AF266<=$AY$5,\"C\",$AF266<=$AY$7,\"N\",TRUE,\"S\")","v":"C"},"F2",6.8524700883047354,21.802938231776096,1.7910906298003071E-3,3.208005644158461E-6,3.6266480015160682E-3,7.360528942485299E-2,3554.5714285714284,57.786458929214604,259.08960661701002,0.65820770519262972,1.7910906298003071E-3,3.208005644158461E-6,3.613117327368224E-3,7.3513318229886285E-2,3524.3900405474974,57.786458929214604,165.03760137039208]
["W10X30","10X30","10",null,null,null,null,null,null,null,null,null,null,null,null,null,null,null,null,null,null,null,null,30,8.84,10.5,5.81,0.3,0.51,0.81,5.7,29.5,8.85,170,36.6,32.4,4.38,16.7,8.84,5.75,1.37,0.622,414,1.6,9.99,1.564450567082265,null,"N","N",{"$f":"_xlfn.IFS($AE267<=$AX$5,\"C\",$AE267<=$AX$7,\"N\",TRUE,\"S\")","v":"C"},{"$f":"_xlfn.IFS($AF267<=$AY$5,\"C\",$AF267<=$AY$7,\"N\",TRUE,\"S\")","v":"C"},"F2",4.8391154747306642,16.046641873263432,1.921674761180934E-3,3.6928338877597998E-6,3.6266480015160682E-3,7.4487064398437677E-2,2585.1428571428573,41.444654828205941,189.17763414533891,0.89602105902602003,1.921674761180934E-3,3.6928338877597998E-6,3.6795984923534576E-3,7.484165453498734E-2,2527.7051305286313,41.444654828205941,118.3655574197668]
["W10X26","10X26","10",null,null,null,null,null,null,null,null,null,null,null,null,null,null,null,null,null,null,null,null,26,7.61,10.3,5.77,0.26,0.44,0.74,6.56,34,8.84,144,31.3,27.9,4.3499999999999996,14.1,7.5,4.8899999999999997,1.36,0.40200000000000002,345,1.58,9.86,1.552634521111377,null,"N","N",{"$f":"_xlfn.IFS($AE268<=$AX$5,\"C\",$AE268<=$AX$7,\"N\",TRUE,\"S\")","v":"C"},{"$f":"_xlfn.IFS($AF268<=$AY$5,\"C\",$AF268<=$AY$7,\"N\",TRUE,\"S\")","v":"C"},"F2",4.8037934639662074,15.174435186597172,1.4613186765251151E-3,2.1354522743611139E-6,3.6266480015160682E-3,7.1329984424792797E-2,2552.8285714285716,41.131629950973171,176.01157943181369,0.90530959508429187,1.4613186765251151E-3,2.1354522743611139E-6,3.4615117292205082E-3,7.0162884816301729E-2,2508.613776252811,41.131629950973171,117.47156121607071]
["W10X22","10X22","10",null,null,null,null,null,null,null,null,null,null,null,null,null,null,null,null,null,null,null,null,22,6.49,10.199999999999999,5.75,0.24,0.36,0.66,7.99,36.9,8.8559999999999999,118,26,23.2,4.2699999999999996,11.4,6.1,3.97,1.33,0.23899999999999999,275,1.55,9.84,1.5338206766864462,null,"N","S",{"$f":"_xlfn.IFS($AE269<=$AX$5,\"C\",$AE269<=$AX$7,\"N\",TRUE,\"S\")","v":"C"},{"$f":"_xlfn.IFS($AF269<=$AY$5,\"C\",$AF269<=$AY$7,\"N\",TRUE,\"S\")","v":"C"},"F2",4.6978274316728346,14.267222956208984,1.0469231847490888E-3,1.0960481547651748E-6,3.6266480015160682E-3,6.8363522336587934E-2,2504.3571428571427,40.633222839499496,163.54145598012937,1.0267826086956522,1.0469231847490888E-3,1.0960481547651748E-6,3.3079690645372141E-3,6.5991607415536585E-2,2478.2159790462438,40.633222839499496,116.04811503667563]
["W10X19","10X19","10",null,null,null,null,null,null,null,null,null,null,null,null,null,null,null,null,null,null,null,null,19,5.62,10.199999999999999,4.0199999999999996,0.25,0.39500000000000002,0.69499999999999995,5.09,35.4,8.85,96.3,21.6,18.8,4.1399999999999997,4.29,3.35,2.14,0.874,0.23300000000000001,104,1.06,9.81,1.0454191007732101,null,"N","N",{"$f":"_xlfn.IFS($AE270<=$AX$5,\"C\",$AE270<=$AX$7,\"N\",TRUE,\"S\")","v":"C"},{"$f":"_xlfn.IFS($AF270<=$AY$5,\"C\",$AF270<=$AY$7,\"N\",TRUE,\"S\")","v":"C"},"F2",3.0871437408135769,9.9803143362669289,1.2633656494675427E-3,1.596092764254546E-6,3.6266480015160682E-3,6.9928632554795547E-2,1712.6571428571431,27.69472854816053,115.13251064703449,1.3933497071604006,1.2633656494675427E-3,1.596092764254546E-6,3.3827065999617206E-3,6.816210273626587E-2,1689.0985756778578,27.69472854816053,79.095892963286943]
["W10X17","10X17","10",null,null,null,null,null,null,null,null,null,null,null,null,null,null,null,null,null,null,null,null,17,4.99,10.1,4.01,0.24,0.33,0.63,6.08,36.9,8.8559999999999999,81.900000000000006,18.7,16.2,4.05,3.56,2.8,1.78,0.84499999999999997,0.156,85.1,1.04,9.77,1.0281262877868764,null,"N","S",{"$f":"_xlfn.IFS($AE271<=$AX$5,\"C\",$AE271<=$AX$7,\"N\",TRUE,\"S\")","v":"C"},{"$f":"_xlfn.IFS($AF271<=$AY$5,\"C\",$AF271<=$AY$7,\"N\",TRUE,\"S\")","v":"C"},"F2",2.9847099095966505,9.5098685610707303,9.8563251070927648E-4,9.7147144616707207E-7,3.6266480015160682E-3,6.791377262547961E-2,1680.3428571428572,27.23661585332226,108.60873561606998,1.6061664021763771,9.8563251070927648E-4,9.7147144616707207E-7,3.2890853779336759E-3,6.5381326758050362E-2,1661.1583306956531,27.23661585332226,77.787527271489694]
["W10X15","10X15","10",null,null,null,null,null,null,null,null,null,null,null,null,null,null,null,null,null,null,null,null,15,4.41,9.99,4,0.23,0.27,0.56999999999999995,7.41,38.5,8.8550000000000004,68.900000000000006,16,13.8,3.95,2.89,2.2999999999999998,1.45,0.81,0.104,68.3,1.01,9.7200000000000006,1.0072156642409593,null,"N","S",{"$f":"_xlfn.IFS($AE272<=$AX$5,\"C\",$AE272<=$AX$7,\"N\",TRUE,\"S\")","v":"C"},{"$f":"_xlfn.IFS($AF272<=$AY$5,\"C\",$AF272<=$AY$7,\"N\",TRUE,\"S\")","v":"C"},"F2",2.8610828719210502,9.0225386229236744,7.7533249835987344E-4,6.0114048301296315E-7,3.6266480015160682E-3,6.634742270711004E-2,1631.8714285714286,26.682661900836962,103.0222151235397,1.8857870370370371,7.7533249835987344E-4,6.0114048301296315E-7,3.2322982009992522E-3,6.3305850435478123E-2,1627.3727375093213,26.682661900836962,76.2054398191367]
["W10X12","10X12","10",null,null,null,null,null,null,null,null,null,null,null,null,null,null,null,null,null,null,null,null,12,3.54,9.8699999999999992,3.96,0.19,0.21,0.51,9.43,46.6,8.854000000000001,53.8,12.6,10.9,3.9,2.1800000000000002,1.74,1.1000000000000001,0.78500000000000003,5.4699999999999999E-2,50.9,0.98299999999999998,9.66,0.98858488519771892,null,"N","S",{"$f":"_xlfn.IFS($AE273<=$AX$5,\"C\",$AE273<=$AX$7,\"N\",TRUE,\"S\")","v":"N"},{"$f":"_xlfn.IFS($AF273<=$AY$5,\"C\",$AF273<=$AY$7,\"N\",TRUE,\"S\")","v":"C"},"F3",2.7727778450099065,8.5223451940649166,5.1949778714836543E-4,2.698779508520484E-7,3.6266480015160682E-3,6.439057220326927E-2,1588.247142857143,26.189104467400284,97.160031829571295,2.0229196729196732,5.1949778714836543E-4,2.698779508520484E-7,3.1806428796741842E-3,6.0828781566151312E-2,1597.2707216551714,26.189104467400284,74.795844276127326]
["W8X67","8X67","8",null,null,null,null,null,null,null,null,null,null,null,null,null,null,null,null,null,null,null,null,67,19.7,9,8.2799999999999994,0.56999999999999995,0.93500000000000005,1.33,4.43,11.1,6.3269999999999991,272,70.099999999999994,60.4,3.72,88.6,32.700000000000003,21.4,2.12,5.05,1440,2.4300000000000002,8.07,2.3025182414629106,null,"N","N",{"$f":"_xlfn.IFS($AE274<=$AX$5,\"C\",$AE274<=$AX$7,\"N\",TRUE,\"S\")","v":"C"},{"$f":"_xlfn.IFS($AF274<=$AY$5,\"C\",$AF274<=$AY$7,\"N\",TRUE,\"S\")","v":"C"},"F2",7.4882662820649699,38.69494626203501,1.036050452579663E-2,1.0734005402905244E-4,3.6266480015160682E-3,0.11826729271997689,3926.1857142857143,60.997180582734345,541.4893377642826,0.46583352708672393,1.036050452579663E-2,1.0734005402905244E-4,1.0825278989763843E-2,0.14555336999039381,3720.2116158493595,60.997180582734345,174.20739322446579]
["W8X58","8X58","8",null,null,null,null,null,null,null,null,null,null,null,null,null,null,null,null,null,null,null,null,58,17.100000000000001,8.75,8.2200000000000006,0.51,0.81,1.2,5.07,12.4,6.3240000000000007,228,59.8,52,3.65,75.099999999999994,27.9,18.3,2.1,3.33,1180,2.39,7.94,2.2825583127710658,null,"N","N",{"$f":"_xlfn.IFS($AE275<=$AX$5,\"C\",$AE275<=$AX$7,\"N\",TRUE,\"S\")","v":"C"},{"$f":"_xlfn.IFS($AF275<=$AY$5,\"C\",$AF275<=$AY$7,\"N\",TRUE,\"S\")","v":"C"},"F2",7.4176222605360538,34.795622424064085,8.0652974229800424E-3,6.504902252112851E-5,3.6266480015160682E-3,0.10812929956536346,3861.5571428571429,60.468411970650983,476.86823882073696,0.48440118951067856,8.0652974229800424E-3,6.504902252112851E-5,8.6542263489175365E-3,0.1293039975093484,3687.9620739201077,60.468411970650983,172.6972348753431]
["W8X48","8X48","8",null,null,null,null,null,null,null,null,null,null,null,null,null,null,null,null,null,null,null,null,48,14.1,8.5,8.11,0.4,0.68500000000000005,1.08,5.92,15.9,6.36,184,49,43.2,3.61,60.9,22.9,15,2.08,1.96,931,2.35,7.82,2.2566227195937127,null,"N","N",{"$f":"_xlfn.IFS($AE276<=$AX$5,\"C\",$AE276<=$AX$7,\"N\",TRUE,\"S\")","v":"C"},{"$f":"_xlfn.IFS($AF276<=$AY$5,\"C\",$AF276<=$AY$7,\"N\",TRUE,\"S\")","v":"C"},"F2",7.3469782390071394,30.723603605200235,5.8018376432698677E-3,3.3661320038863251E-5,3.6266480015160682E-3,9.7100389519228683E-2,3796.9285714285716,59.781338994606195,405.97327312368964,0.45793694366691579,5.8018376432698677E-3,3.3661320038863251E-5,6.5960542156681288E-3,0.11134582102143752,3646.0575655149842,59.781338994606195,170.73496070187716]
["W8X40","8X40","8",null,null,null,null,null,null,null,null,null,null,null,null,null,null,null,null,null,null,null,null,40,11.7,8.25,8.07,0.36,0.56000000000000005,0.95399999999999996,7.21,17.600000000000001,6.3360000000000003,146,39.799999999999997,35.5,3.53,49.1,18.5,12.2,2.04,1.1200000000000001,726,2.31,7.69,2.2374019718238189,null,"N","N",{"$f":"_xlfn.IFS($AE277<=$AX$5,\"C\",$AE277<=$AX$7,\"N\",TRUE,\"S\")","v":"C"},{"$f":"_xlfn.IFS($AF277<=$AY$5,\"C\",$AF277<=$AY$7,\"N\",TRUE,\"S\")","v":"C"},"F2",7.2056901959493098,27.344187440362884,4.102639242476969E-3,1.6831648753912E-5,3.6266480015160682E-3,8.7916365052207637E-2,3732.3,59.272152399884369,348.01301718862459,0.50472650026553367,4.102639242476969E-3,1.6831648753912E-5,5.1651001859675518E-3,9.6269099032059713E-2,3615.0023287610561,59.272152399884369,169.28072841632061]
["W8X35","8X35","8",null,null,null,null,null,null,null,null,null,null,null,null,null,null,null,null,null,null,null,null,35,10.3,8.1199999999999992,8.02,0.31,0.495,0.88900000000000001,8.1,20.5,6.3549999999999995,127,34.700000000000003,31.2,3.51,42.6,16.100000000000001,10.6,2.0299999999999998,0.76900000000000002,619,2.2799999999999998,7.63,2.2249902588100188,null,"N","N",{"$f":"_xlfn.IFS($AE278<=$AX$5,\"C\",$AE278<=$AX$7,\"N\",TRUE,\"S\")","v":"C"},{"$f":"_xlfn.IFS($AF278<=$AY$5,\"C\",$AF278<=$AY$7,\"N\",TRUE,\"S\")","v":"C"},"F2",7.1703681851848513,25.420531030306904,3.2303323587727262E-3,1.0435047148134164E-5,3.6266480015160682E-3,8.2806885947297848E-2,3683.8285714285712,58.943347404375267,316.14805272659618,0.49624675684526059,3.2303323587727262E-3,1.0435047148134164E-5,4.5035162179461732E-3,8.7942302543877596E-2,3594.9485467344734,58.943347404375267,168.34166433828295]
["W8X31","8X31","8",null,null,null,null,null,null,null,null,null,null,null,null,null,null,null,null,null,null,null,null,31,9.1300000000000008,8,8,0.28499999999999998,0.435,0.82899999999999996,9.19,22.3,6.3554999999999993,110,30.4,27.5,3.47,37.1,14.1,9.27,2.02,0.53600000000000003,530,2.2599999999999998,7.57,2.2153112595568345,null,"N","N",{"$f":"_xlfn.IFS($AE279<=$AX$5,\"C\",$AE279<=$AX$7,\"N\",TRUE,\"S\")","v":"N"},{"$f":"_xlfn.IFS($AF279<=$AY$5,\"C\",$AF279<=$AY$7,\"N\",TRUE,\"S\")","v":"C"},"F3",7.1350461744203955,23.962757851058893,2.5747568151795364E-3,6.6293726573134689E-6,3.6266480015160682E-3,7.8748998829798494E-2,3651.5142857142851,58.686936117517654,291.52856889386976,0.52049353448275848,2.5747568151795364E-3,6.6293726573134689E-6,4.0590619402127272E-3,8.1448258148300895E-2,3579.3100493696857,58.686936117517654,167.60935603402933]
["W8X28","8X28","8",null,null,null,null,null,null,null,null,null,null,null,null,null,null,null,null,null,null,null,null,28,8.25,8.06,6.54,0.28499999999999998,0.46500000000000002,0.85899999999999999,7.03,22.3,6.3554999999999993,98,27.2,24.3,3.45,21.7,10.1,6.63,1.62,0.53700000000000003,312,1.84,7.6,1.8006743604478417,null,"N","N",{"$f":"_xlfn.IFS($AE280<=$AX$5,\"C\",$AE280<=$AX$7,\"N\",TRUE,\"S\")","v":"C"},{"$f":"_xlfn.IFS($AF280<=$AY$5,\"C\",$AF280<=$AY$7,\"N\",TRUE,\"S\")","v":"C"},"F2",5.7221657438421003,20.026421153404204,2.907732293697206E-3,8.454907091809615E-6,3.6266480015160682E-3,8.0835513824143376E-2,2972.9142857142856,47.702579357265833,246.6244273175833,0.59561260728026033,2.907732293697206E-3,8.454907091809615E-6,4.2780273805785359E-3,8.4768860286521142E-2,2909.3752880950124,47.702579357265833,136.23813298453888]
["W8X24","8X24","8",null,null,null,null,null,null,null,null,null,null,null,null,null,null,null,null,null,null,null,null,24,7.08,7.93,6.5,0.245,0.4,0.79400000000000004,8.1199999999999992,25.9,6.3454999999999995,82.7,23.1,20.9,3.42,18.3,8.57,5.63,1.61,0.34599999999999997,259,1.81,7.53,1.7893452039120663,null,"N","N",{"$f":"_xlfn.IFS($AE281<=$AX$5,\"C\",$AE281<=$AX$7,\"N\",TRUE,\"S\")","v":"C"},{"$f":"_xlfn.IFS($AF281<=$AY$5,\"C\",$AF281<=$AY$7,\"N\",TRUE,\"S\")","v":"C"},"F2",5.6868437330776418,18.600171758731253,2.1985423537111523E-3,4.8335884810617739E-6,3.6266480015160682E-3,7.6322934660737599E-2,2924.4428571428571,47.402452915434175,224.50084226859929,0.59794134615384609,2.1985423537111523E-3,4.8335884810617739E-6,3.8314748672321746E-3,7.7653185517036746E-2,2891.0706080350669,47.402452915434175,135.38097459508984]
["W8X21","8X21","8",null,null,null,null,null,null,null,null,null,null,null,null,null,null,null,null,null,null,null,null,21,6.16,8.2799999999999994,5.27,0.25,0.4,0.7,6.59,27.5,6.875,75.3,20.399999999999999,18.2,3.49,9.77,5.69,3.71,1.26,0.28199999999999997,152,1.46,7.88,1.4274195920753414,null,"N","N",{"$f":"_xlfn.IFS($AE282<=$AX$5,\"C\",$AE282<=$AX$7,\"N\",TRUE,\"S\")","v":"C"},{"$f":"_xlfn.IFS($AF282<=$AY$5,\"C\",$AF282<=$AY$7,\"N\",TRUE,\"S\")","v":"C"},"F2",4.450573356321633,14.701338197927482,1.9663078038712556E-3,3.8663663795650007E-6,3.6266480015160682E-3,7.4786066920164512E-2,2358.9428571428571,37.814497647511956,173.65416792642924,0.81534629981024664,1.9663078038712556E-3,3.8663663795650007E-6,3.7031037734223757E-3,7.5295495066395782E-2,2306.3022266245875,37.814497647511956,107.9978615131337]
["W8X18","8X18","8",null,null,null,null,null,null,null,null,null,null,null,null,null,null,null,null,null,null,null,null,18,5.26,8.14,5.25,0.23,0.33,0.63,7.95,29.9,6.8769999999999998,61.9,17,15.2,3.43,7.97,4.66,3.04,1.23,0.17199999999999999,122,1.43,7.81,1.4119267303898491,null,"N","N",{"$f":"_xlfn.IFS($AE283<=$AX$5,\"C\",$AE283<=$AX$7,\"N\",TRUE,\"S\")","v":"C"},{"$f":"_xlfn.IFS($AF283<=$AY$5,\"C\",$AF283<=$AY$7,\"N\",TRUE,\"S\")","v":"C"},"F2",4.344607324028261,13.71703261561837,1.4488846957342138E-3,2.0992668615328256E-6,3.6266480015160682E-3,7.1242772947508734E-2,2310.4714285714285,37.404068377091548,159.77306421057267,0.91296392496392487,1.4488846957342138E-3,2.0992668615328256E-6,3.4562809548274375E-3,7.0036887784664242E-2,2281.2701886727423,37.404068377091548,106.82567924798819]
["W8X15","8X15","8",null,null,null,null,null,null,null,null,null,null,null,null,null,null,null,null,null,null,null,null,15,4.4400000000000004,8.11,4.0199999999999996,0.245,0.315,0.61499999999999999,6.37,28.1,6.8845000000000001,48,13.6,11.8,3.29,3.41,2.67,1.7,0.876,0.13700000000000001,51.8,1.06,7.8,1.0497842190944673,null,"N","N",{"$f":"_xlfn.IFS($AE284<=$AX$5,\"C\",$AE284<=$AX$7,\"N\",TRUE,\"S\")","v":"C"},{"$f":"_xlfn.IFS($AF284<=$AY$5,\"C\",$AF284<=$AY$7,\"N\",TRUE,\"S\")","v":"C"},"F2",3.0942081429664685,10.20745739458784,1.4884832681442851E-3,2.2155824395454917E-6,3.6266480015160682E-3,7.1520145900720547E-2,1712.6571428571431,27.81036711540921,119.47397076784011,1.3319928137092316,1.4884832681442851E-3,2.2155824395454917E-6,3.4730668891795806E-3,7.0438271964350929E-2,1696.1513597083463,27.81036711540921,79.426155660089478]
["W8X13","8X13","8",null,null,null,null,null,null,null,null,null,null,null,null,null,null,null,null,null,null,null,null,13,3.84,7.99,4,0.23,0.255,0.55500000000000005,7.84,29.9,6.8769999999999998,39.6,11.4,9.91,3.21,2.73,2.15,1.37,0.84299999999999997,8.7099999999999997E-2,40.799999999999997,1.03,7.74,1.0293225767847218,null,"N","N",{"$f":"_xlfn.IFS($AE285<=$AX$5,\"C\",$AE285<=$AX$7,\"N\",TRUE,\"S\")","v":"C"},{"$f":"_xlfn.IFS($AF285<=$AY$5,\"C\",$AF285<=$AY$7,\"N\",TRUE,\"S\")","v":"C"},"F2",2.9776455074437589,9.5702645538168944,1.1355428833663174E-3,1.2894576399638899E-6,3.6266480015160682E-3,6.9008629061026755E-2,1664.1857142857145,27.268307352966733,111.2236020931591,1.5506960784313726,1.1355428833663174E-3,1.2894576399638899E-6,3.3370748893505413E-3,6.6877632828299616E-2,1663.0911919193147,27.268307352966733,77.878037906369769]
["W8X10","8X10","8",null,null,null,null,null,null,null,null,null,null,null,null,null,null,null,null,null,null,null,null,10,2.96,7.89,3.94,0.17,0.20499999999999999,0.505,9.61,40.5,6.8850000000000007,30.8,8.8699999999999992,7.81,3.22,2.09,1.66,1.06,0.84099999999999997,4.2599999999999999E-2,30.9,1.01,7.69,1.0207723347988749,null,"N","S",{"$f":"_xlfn.IFS($AE286<=$AX$5,\"C\",$AE286<=$AX$7,\"N\",TRUE,\"S\")","v":"N"},{"$f":"_xlfn.IFS($AF286<=$AY$5,\"C\",$AF286<=$AY$7,\"N\",TRUE,\"S\")","v":"C"},"F3",2.9705811052908673,8.9546148421138554,7.0930370020096936E-4,5.0311173911878665E-7,3.6266480015160682E-3,6.5847943792627553E-2,1631.8714285714286,27.041798548369631,103.34532840173389,1.4491147703355209,7.0930370020096936E-4,5.0311173911878665E-7,3.2170985244920343E-3,6.2661010402745687E-2,1649.2764437964679,27.041798548369631,77.231130819611408]
["W6X25","6X25","6",null,null,null,null,null,null,null,null,null,null,null,null,null,null,null,null,null,null,null,null,25,7.34,6.38,6.08,0.32,0.45500000000000002,0.70499999999999996,6.68,15.5,4.96,53.4,18.899999999999999,16.7,2.7,17.100000000000001,8.56,5.61,1.52,0.46100000000000002,150,1.74,5.93,1.6768038104763727,null,"N","N",{"$f":"_xlfn.IFS($AE287<=$AX$5,\"C\",$AE287<=$AX$7,\"N\",TRUE,\"S\")","v":"C"},{"$f":"_xlfn.IFS($AF287<=$AY$5,\"C\",$AF287<=$AY$7,\"N\",TRUE,\"S\")","v":"C"},"F2",5.3689456361975259,21.320323132361413,4.6551079964859497E-3,2.1670030458947431E-5,3.6266480015160682E-3,9.1004153740376154E-2,2811.3428571428572,44.421061682647228,274.54434987809793,0.5737420474262579,4.6551079964859497E-3,2.1670030458947431E-5,5.6139684391807434E-3,0.10133645166309452,2709.2358709268246,44.421061682647228,126.86614833780696]
["W6X20","6X20","6",null,null,null,null,null,null,null,null,null,null,null,null,null,null,null,null,null,null,null,null,20,5.87,6.2,6.02,0.26,0.36499999999999999,0.61499999999999999,8.25,19.100000000000001,4.9660000000000002,41.4,14.9,13.4,2.66,13.3,6.72,4.41,1.5,0.24,113,1.7,5.84,1.6585076731696362,null,"N","N",{"$f":"_xlfn.IFS($AE288<=$AX$5,\"C\",$AE288<=$AX$7,\"N\",TRUE,\"S\")","v":"C"},{"$f":"_xlfn.IFS($AF288<=$AY$5,\"C\",$AF288<=$AY$7,\"N\",TRUE,\"S\")","v":"C"},"F2",5.2983016146686106,18.726605101258162,3.066857493355142E-3,9.4056148845485855E-6,3.6266480015160682E-3,8.1813846596228507E-2,2746.7142857142858,43.936369413474821,231.36306511317238,0.58761206935784838,3.066857493355142E-3,9.4056148845485855E-6,4.3877358696392177E-3,8.6339987045368258E-2,2679.6745405069405,43.936369413474821,125.48187162334395]
["W6X15","6X15","6",null,null,null,null,null,null,null,null,null,null,null,null,null,null,null,null,null,null,null,null,15,4.43,5.99,5.99,0.23,0.26,0.51,11.5,21.6,4.9680000000000009,29.1,10.8,9.7200000000000006,2.56,9.32,4.75,3.11,1.45,0.10100000000000001,76.5,1.66,5.73,1.6322453779602235,null,"N","N",{"$f":"_xlfn.IFS($AE289<=$AX$5,\"C\",$AE289<=$AX$7,\"N\",TRUE,\"S\")","v":"N"},{"$f":"_xlfn.IFS($AF289<=$AY$5,\"C\",$AF289<=$AY$7,\"N\",TRUE,\"S\")","v":"C"},"F3",5.1216915608463234,16.485188549839119,1.8134287089105782E-3,3.2885236823010864E-6,3.6266480015160682E-3,7.3756875682383982E-2,2682.0857142857139,43.240641607910142,194.47173593651996,0.73368434570437924,1.8134287089105782E-3,3.2885236823010864E-6,3.6242426601251639E-3,7.3740568000495776E-2,2637.2421749614468,43.240641607910142,123.49487933544947]
["W6X16","6X16","6",null,null,null,null,null,null,null,null,null,null,null,null,null,null,null,null,null,null,null,null,16,4.74,6.28,4.03,0.26,0.40500000000000003,0.65500000000000003,4.9800000000000004,19.100000000000001,4.9660000000000002,32.1,11.7,10.199999999999999,2.6,4.43,3.39,2.2000000000000002,0.96699999999999997,0.223,38.200000000000003,1.1299999999999999,5.88,1.0935046872849759,null,"N","N",{"$f":"_xlfn.IFS($AE290<=$AX$5,\"C\",$AE290<=$AX$7,\"N\",TRUE,\"S\")","v":"C"},{"$f":"_xlfn.IFS($AF290<=$AY$5,\"C\",$AF290<=$AY$7,\"N\",TRUE,\"S\")","v":"C"},"F2",3.4156384409230305,13.03922581593514,3.7181539282379623E-3,1.3824668634071389E-5,3.6266480015160682E-3,8.5701819874224552E-2,1825.7571428571425,28.968588251448406,163.68791126876675,0.79107925129430501,3.7181539282379623E-3,1.3824668634071389E-5,4.8653139478600383E-3,9.2647006838310758E-2,1766.791144741868,28.968588251448406,82.734024695334355]
["W6X12","6X12","6",null,null,null,null,null,null,null,null,null,null,null,null,null,null,null,null,null,null,null,null,12,3.55,6.03,4,0.23,0.28000000000000003,0.53,7.14,21.6,4.9680000000000009,22.1,8.3000000000000007,7.31,2.4900000000000002,2.99,2.3199999999999998,1.5,0.91800000000000004,9.0300000000000005E-2,24.7,1.08,5.75,1.0675047326843048,null,"N","N",{"$f":"_xlfn.IFS($AE291<=$AX$5,\"C\",$AE291<=$AX$7,\"N\",TRUE,\"S\")","v":"C"},{"$f":"_xlfn.IFS($AF291<=$AY$5,\"C\",$AF291<=$AY$7,\"N\",TRUE,\"S\")","v":"C"},"F2",3.2425605881771893,11.050515220186448,2.1483375959079286E-3,4.6153544259914581E-6,3.6266480015160682E-3,7.5993326005801304E-2,1744.9714285714283,28.279810244238178,133.05696755668592,1.020214285714286,2.1483375959079286E-3,4.6153544259914581E-6,3.8028891126565202E-3,7.7144194263498847E-2,1724.7826466656411,28.279810244238178,80.766880968360184]
["W6X9","6X9","6",null,null,null,null,null,null,null,null,null,null,null,null,null,null,null,null,null,null,null,null,9,2.68,5.9,3.94,0.17,0.215,0.46500000000000002,9.16,29.2,4.9640000000000004,16.399999999999999,6.23,5.56,2.4700000000000002,2.2000000000000002,1.72,1.1100000000000001,0.90500000000000003,4.0500000000000001E-2,17.7,1.06,5.69,1.0532953170047701,null,"N","N",{"$f":"_xlfn.IFS($AE292<=$AX$5,\"C\",$AE292<=$AX$7,\"N\",TRUE,\"S\")","v":"N"},{"$f":"_xlfn.IFS($AF292<=$AY$5,\"C\",$AF292<=$AY$7,\"N\",TRUE,\"S\")","v":"C"},"F3",3.1966419741833949,9.9974490789861239,1.2801709423322504E-3,1.638837641591842E-6,3.6266480015160682E-3,7.0048689808220668E-2,1712.6571428571431,27.903381394046299,116.28815556658819,0.99619879589186666,1.2801709423322504E-3,1.638837641591842E-6,3.389018857835093E-3,6.8331470057121882E-2,1701.8242907605643,27.903381394046299,79.691803594292622]
["W6X8.5","6X8.5","6",null,null,null,null,null,null,null,null,null,null,null,null,null,null,null,null,null,null,null,null,8.5,2.52,5.83,3.94,0.17,0.19500000000000001,0.44500000000000001,10.1,29.1,4.947000000000001,14.9,5.73,5.0999999999999996,2.4300000000000002,1.99,1.56,1.01,0.89,3.3300000000000003E-2,15.8,1.05,5.64,1.0459644289517671,null,"N","N",{"$f":"_xlfn.IFS($AE293<=$AX$5,\"C\",$AE293<=$AX$7,\"N\",TRUE,\"S\")","v":"N"},{"$f":"_xlfn.IFS($AF293<=$AY$5,\"C\",$AF293<=$AY$7,\"N\",TRUE,\"S\")","v":"C"},"F3",3.1436589580367085,9.7787618175314339,1.1576971214017524E-3,1.340262624901904E-6,3.6266480015160682E-3,6.9168960689877518E-2,1696.5,27.709175114005397,113.39720206275618,1.0946114798906681,1.1576971214017524E-3,1.340262624901904E-6,3.3446784302937019E-3,6.7099743305734441E-2,1689.9796702063552,27.709175114005397,79.137152224007451]
["W5X19","5X19","5",null,null,null,null,null,null,null,null,null,null,null,null,null,null,null,null,null,null,null,null,19,5.56,5.15,5.03,0.27,0.43,0.73,5.85,13.7,3.6989999999999998,26.3,11.6,10.199999999999999,2.17,9.1300000000000008,5.53,3.63,1.28,0.316,50.9,1.45,4.72,1.3991933801118575,null,"N","N",{"$f":"_xlfn.IFS($AE294<=$AX$5,\"C\",$AE294<=$AX$7,\"N\",TRUE,\"S\")","v":"C"},{"$f":"_xlfn.IFS($AF294<=$AY$5,\"C\",$AF294<=$AY$7,\"N\",TRUE,\"S\")","v":"C"},"F2",4.5212173778505473,19.708092934854811,6.5636424061149895E-3,4.308140163535097E-5,3.6266480015160682E-3,0.10094696829341165,2342.7857142857138,37.066742725401426,265.94487489970248,0.46175505108881593,6.5636424061149895E-3,4.308140163535097E-5,7.2751641089752062E-3,0.1176384567864191,2260.6967327235866,37.066742725401426,105.86228025335804]
["W5X16","5X16","5",null,null,null,null,null,null,null,null,null,null,null,null,null,null,null,null,null,null,null,null,16,4.71,5.01,5,0.24,0.36,0.66,6.94,15.4,3.6959999999999997,21.4,9.6300000000000008,8.5500000000000007,2.13,7.51,4.58,3,1.26,0.192,40.6,1.43,4.6500000000000004,1.387519175647512,null,"N","N",{"$f":"_xlfn.IFS($AE295<=$AX$5,\"C\",$AE295<=$AX$7,\"N\",TRUE,\"S\")","v":"C"},{"$f":"_xlfn.IFS($AF295<=$AY$5,\"C\",$AF295<=$AY$7,\"N\",TRUE,\"S\")","v":"C"},"F2",4.450573356321633,17.705163035031596,4.8292774948122986E-3,2.3321921121900552E-5,3.6266480015160682E-3,9.1956106356937309E-2,2310.4714285714285,36.757475443584362,230.68565046814103,0.49280000000000002,4.8292774948122986E-3,2.3321921121900552E-5,5.7592128193938615E-3,0.10290039025293422,2241.8345537961941,36.757475443584362,104.97901570800926]
["W4X13","4X13","4",null,null,null,null,null,null,null,null,null,null,null,null,null,null,null,null,null,null,null,null,13,3.83,4.16,4.0599999999999996,0.28000000000000003,0.34499999999999997,0.59499999999999997,5.88,10.6,2.968,11.3,6.28,5.46,1.72,3.86,2.92,1.9,1,0.151,14,1.1599999999999999,3.82,1.1180455747801925,null,"N","N",{"$f":"_xlfn.IFS($AE296<=$AX$5,\"C\",$AE296<=$AX$7,\"N\",TRUE,\"S\")","v":"C"},{"$f":"_xlfn.IFS($AF296<=$AY$5,\"C\",$AF296<=$AY$7,\"N\",TRUE,\"S\")","v":"C"},"F2",3.5322010764457406,16.281080985448526,7.239706192585774E-3,5.2413345754964801E-5,3.6266480015160682E-3,0.10424180636434617,1874.2285714285715,29.618713370654945,222.2012331994878,0.5933033483258372,7.239706192585774E-3,5.2413345754964801E-5,7.8904978887352119E-3,0.12300489454213188,1806.4422072519967,29.618713370654945,84.59077612555987]